{"text_format":"1","workbook":"xlsx","n_sheets":15,"sheets":["Start","QuE_Balance","QuE_Imports","QuE_Exports","QuE_Stocks","MOS_Table_1","MOS_Table_2","MOS_Table_3","MOS_Table_4","MOS_Table_5","ProductDefinitions","FlowDefinitions","StockDefinitions","Param","Formulas"],"not_rendered":{"charts":0,"images":0,"macros":1,"external_links":0,"defined_names":92,"comments":10,"pivot_tables":0},"unopened":[],"bounds":{"document_bytes":16777216,"sheet_cells":100000,"rows_first":2000,"rows_last":500,"rows_between":2000,"halvings":0,"cell_chars":16384,"cell_head_chars":4096},"cells_cut":0,"cells_raw":0,"read":"whole","date_system":"1900"}

{"sheet":"Start","index":0,"n_rows":16,"n_cols":13,"rows_kept":16,"cut":false,"hidden":false,"merged":[[15,2,15,4],[12,2,12,4],[14,2,14,4],[13,2,13,4],[3,11,3,12],[5,2,5,9],[5,11,5,12],[10,2,10,4],[9,2,9,9]]}
[]
[]
[]
[null,null,"Emergency Data Questionnaire (QuE)",null,null,null,null,null,null,null,null,"(select country)"]
[null,null,null,null,null,null,null,null,null,null,null,"MONTH ?",2022]
[null,null,"This questionnaire includes all modules. It is possible that not all modules will need to be completed. You will be informed which modules will be activated.",null,null,null,null,null,null,null,null,"(Select data month)"]
[null,null,"You can fill out the QuE worksheets or the MOS tables in this file"]
[null,null,"If you choose the MOS Tables format, check this box:"]
[null,null,"this will allow you to enter data in the \"MOS_Tables\"."]
[null,null,{"$f":"IF(DataFromMOS=FALSE,\"\",\"Please note that the breakdown of Closing stocks on national territory with foreing claim will not be automatically completed from the MOS. Please enter these data manually on the QuE_Stocks module (lines 17 to 19)\")","v":""}]
[null,null,"Modules:"]
[]
[null,null,"Balance"]
[null,null,"Stocks"]
[null,null,"Imports"]
[null,null,"Exports"]

{"sheet":"QuE_Balance","index":1,"n_rows":35,"n_cols":25,"rows_kept":35,"cut":false,"hidden":false,"merged":[[2,1,2,2],[4,1,4,2],[25,3,25,9],[28,4,28,9]]}
[null,"BALANCE"]
[]
[2007.1,"Country:",null,{"$f":"CountryMessage","v":"(select your country on the 'Start' sheet)"}]
[]
[null,"Time period:",null,{"$f":"FirstMonth & \" \" & QuestYear","v":"MONTH ? 2022"}]
[null,null,null,null,null,null,null,null,null,null,null,null,null,null,null,null,null,null,null,null,null,null,"BALANCE",null,"BALANCE"]
[null,"Crude, NGL and Other Balance",null,null,null,null,null,null,"Product Balance"]
[null,null,null,null,null,null,"Thousand Metric Tons",null,null,null,null,null,null,null,null,null,null,"Thousand Metric Tons"]
[null,null,null,null,null,null,null,null,null,null,"Petroleum Products"]
[null,null,null,"Crude Oil","NGL","Other","Total\n(1)+(2)+(3)",null,null,null,"LPG","Naphtha","Gasoline","Total Kerosene","Of which: Jet\nKerosene","Gas/ Diesel Oil","Of which: Road Diesel","Fuel Oil","Other\nProducts","Total Products \n(5)+(6)+(7)+(8) +(10)+(12)+(13)"]
[null,null,null,"(1)","(2)","(3)","(4)",null,null,null,"(5)","(6)","(7)","(8)","(9)","(10)","(11)","(12)","(13)","(14)"]
[null,"+","Production",null,null,null,{"$f":"SUM(D12:F12)","v":0},null,"+","Refinery Output",null,null,null,null,null,null,null,null,null,{"$f":"K12+L12+M12+N12+P12+R12+S12","v":0},null,null,"INDPROD",null,"REFGROUT"]
[null,"+","From Other sources",null,null,null,{"$f":"F13","v":0},null,"+","Receipts",null,null,null,null,null,null,null,null,null,{"$f":"K13+L13+M13+N13+P13+R13+S13","v":0},null,null,"OSOURCES",null,"RECEIPTS"]
[null,"+","Imports",null,null,null,{"$f":"SUM(D14:F14)","v":0},null,"+","Imports",null,null,null,null,null,null,null,null,null,0,null,null,"TOTIMPSB",null,"TOTIMPSB"]
[null,"-","Exports",null,null,null,{"$f":"SUM(D15:F15)","v":0},null,"-","Exports",null,null,null,null,null,null,null,null,null,0,null,null,"TOTEXPSB",null,"TOTEXPSB"]
[null,"+","Products Transferred\n/Backflows",null,null,null,{"$f":"F16","v":0},null,"-","Products Transferred",null,null,null,null,null,null,null,null,null,0,null,null,"TRANSBAK",null,"PTRANSF"]
[null,"-","Direct Use",null,null,null,{"$f":"SUM(D17:F17)","v":0},null,"+","Interproduct Transfers",null,null,null,null,null,null,null,null,null,0,null,null,"DIRECUSE",null,"IPTRANSF"]
[null,"-","Stock Change",null,null,null,{"$f":"SUM(D18:F18)","v":0},null,"-","Stock Change",null,null,null,null,null,null,null,null,null,0,null,null,"STCHANAT",null,"STCHANAT"]
[null,"-","Statistical Difference",{"$f":"D12+D14-D15-D17-D18-D20","v":0},{"$f":"E12+E14-E15-E17-E18-E20","v":0},{"$f":"F12+F13+F14-F15+F16-F17-F18-F20","v":0},{"$f":"G12+G13+G14-G15+G16-G17-G18-G20","v":0},null,"-","Statistical Difference",{"$f":"K12+K13+K14-K15-K16+K17-K18-K20","v":0},{"$f":"L12+L13+L14-L15-L16+L17-L18-L20","v":0},0,0,0,0,0,0,0,0,null,null,"STATDIFF",null,"STATDIFF"]
[null,"=","Refinery Intake",null,null,null,{"$f":"SUM(D20:F20)","v":0},null,"="," Demand",null,null,null,null,null,null,null,null,null,0,null,null,"REFINOBS",null,"DEMAND"]
[]
[null,null,"Automatic Checks: Crude, NGL, Feedstocks",null,null,null,null,null,null,null,"Automatic Checks: Petroleum Products"]
[null,null,"Total sum",{"$f":"IF(OR(G12<>SUM(D12:F12),G13<>SUM(F13),G14<>SUM(D14:F14),G15<>SUM(D15:F15),G16<>SUM(F16),G17<>SUM(D17:F17),G18<>SUM(D18:F18),G19<>SUM(D19:F19),G20<>SUM(D20:F20)),\"Total not equal to the sum of the elements\",\"OK\")","v":"OK"},null,null,null,null,null,null,"Total Products sum ",null,null,{"$f":"IF(OR(T12<>K12+L12+M12+N12+P12+R12+S12,T13<>K13+L13+M13+N13+P13+R13+S13,T14<>K14+L14+M14+N14+P14+R14+S14,T15<>K15+L15+M15+N15+P15+R15+S15,T16<>K16+L16+M16+N16+P16+R16+S16,T17<>K17+L17+M17+N17+P17+R17+S17,T18<>K18+L18+M18+N18+P18+R18+S18,T20<>K20+L20+M20+N20+P20+R20+S20,T19<>K19+L19+M19+N19+P19+R19+S19),\"Total Products column is not the sum of the elements\",\"OK\")","v":"OK"}]
[null,null,"Statistical Difference",{"$f":"IF(OR(D19<>(D12+D14-D15-D17-D18-D20),E19<>(E12+E14-E15-E17-E18-E20),F19<>(F12+F13+F14-F15+F16-F17-F18-F20),G19<>(G12+G13+G14-G15+G16-G17-G18-G20)),\"Statistical Difference not calculated correctly\",\"OK\")","v":"OK"},null,null,null,null,null,null,"Statistical Difference",null,null,{"$f":"IF(OR(K19<>(K12+K13+K14-K15-K16+K17-K18-K20),L19<>(L12+L13+L14-L15-L16+L17-L18-L20),M19<>(M12+M13+M14-M15-M16+M17-M18-M20),N19<>(N12+N13+N14-N15-N16+N17-N18-N20),O19<>(O12+O13+O14-O15-O16+O17-O18-O20),P19<>(P12+P13+P14-P15-P16+P17-P18-P20),Q19<>(Q12+Q13+Q14-Q15-Q16+Q17-Q18-Q20),R19<>(R12+R13+R14-R15-R16+R17-R18-R20),S19<>(S12+S13+S14-S15-S16+S17-S18-S20),T19<>(T12+T13+T14-T15-T16+T17-T18-T20)),\"Statistical Difference not calculated correctly\",\"OK\")","v":"OK"}]
[null,null,"Stat. Diff./Refinery Intake",{"$f":"IF(OR(ABS(D19)>0.1*D20,ABS(E19)>0.1*E20,ABS(F19)>0.1*F20,ABS(G19)>0.1*G20),\"Statistical Difference above 10% of Refinery Intake, please investigate.\",\"OK\")","v":"OK"},null,null,null,null,null,null,"Stat. Diff. /Demand",null,null,{"$f":"IF(OR(ABS(K19)>0.1*K20,ABS(L19)>0.1*L20,ABS(M19)>0.1*M20,ABS(N19)>0.1*N20,ABS(O19)>0.1*O20,ABS(P19)>0.1*P20,ABS(Q19)>0.1*Q20,ABS(R19)>0.1*R20,ABS(S19)>0.1*S20,ABS(T19)>0.1*T20),\"Statistical Difference above 10% of Demand, please investigate\",\"OK\")","v":"OK"}]
[null,null,"Products Transferred",{"$f":"IF(G16<T16,\"'Products Transferred/Backflows' for Total should be larger than 'Products Transferred' for Total Products\",\"OK\")","v":"OK"},null,null,null,null,null,null,"Negative Products Transferred",null,null,{"$f":"IF(OR(K16<0,L16<0,M16<0,N16<0,O16<0,P16<0,Q16<0,R16<0,S16<0,T16<0),\"Products Transferred should be positive\",\"OK\")","v":"OK"}]
[null,null,"Negative Products Transferred",null,{"$f":"IF(OR(F16<0,G16<0),\"Products transferred/backflows should be positive\",\"OK\")","v":"OK"},null,null,null,null,null,"Interproduct transfers",null,null,{"$f":"IF(T17<>0,\"Total Products Interproduct Transfers should be zero\",\"OK\")","v":"OK"}]
[null,null,"Blocked out cells",null,{"$f":"IF(OR(D13<>0,E13<>0,D16<>0,E16<>0),\"No data should be reported in blocked out cells\",\"OK\")","v":"OK"},null,null,null,null,null,"Jet Kerosene",null,null,{"$f":"IF(OR(O12>N12,O13>N13,O14>N14,O15>N15,O16>N16,O20>N20),\"Jet Kerosene should be smaller than Total Kerosene\",\"OK\")","v":"OK"}]
[null,null,"Refinery Losses",{"$f":"G20-T12","v":0},{"$f":"IF(D29<0,\"Reported figures imply a refinery gain. Losses should not be negative\",\"OK\")","v":"OK"},null,null,null,null,null,"Transport Diesel",null,null,{"$f":"IF(OR(Q12>P12,Q13>P13,Q14>P14,Q15>P15,Q16>P16,Q20>P20),\"Transport Diesel should be smaller than Gas/Diesel Oil\",\"OK\")","v":"OK"}]
[]
[]
[]
[]
[]
[null,null,null,"CRUDEOIL","NGL","OTHTONE","CRNGFEED",null,"ç Products è",null,"LPG","NAPHTHA","GASOLINE","KEROSENE","JETKERO","GASDIES","DIESEL","RESFUEL","OTHTTWO","TOTPRODS"]

{"sheet":"QuE_Imports","index":2,"n_rows":190,"n_cols":21,"rows_kept":190,"cut":false,"hidden":false,"merged":[[177,3,177,13],[178,3,178,13],[179,3,179,13],[180,3,180,13]]}
[null,"Trade by Origin"]
[]
[null,"Country:",{"$f":"CountryMessage","v":"(select your country on the 'Start' sheet)"}]
[]
[null,"Time period:",{"$f":"FirstMonth & \" \" & QuestYear","v":"MONTH ? 2022"}]
[null,null,null,null,null,null,null,null,null,null,null,null,null,null,null,null,null,null,null,null,"IMPORTS"]
[null,"Crude Imports",null,null,null,null,null,"Product Imports"]
[null,null,null,null,null,null,"Thousand Metric Tons",null,null,null,null,null,null,null,"Thousand Metric Tons"]
[null,null,null,"Crude Oil","NGL","Other","Total\n(1)+(2)+(3)","LPG","Naphtha","Gasoline","Total Kerosene","Of which: Jet\nKerosene","Gas/ Diesel Oil","Of which: road diesel","Fuel Oil","Other\nProducts","Total Products (5)+(6)+(7)+ (8)+(10)+(12)+(13)"]
[null,null,null,"(1)","(2)","(3)","(4)","(5)","(6)","(7)","(8)","(9)","(10)","(11)","(12)","(13)","(14)"]
[null,"Albania",1,null,null,null,{"$f":"SUM(D11:F11)","v":0},null,null,null,null,null,null,null,null,null,{"$f":"SUM(H11:P11)-L11-N11","v":0},null,null,"AL","ALBANIA"]
[null,"Algeria",2,null,null,null,{"$f":"SUM(D12:F12)","v":0},null,null,null,null,null,null,null,null,null,{"$f":"SUM(H12:P12)-L12-N12","v":0},null,null,"DZ","ALGERIA"]
[null,"Andorra",3,null,null,null,0,null,null,null,null,null,null,null,null,null,0,null,null,"AD","ANDORRA"]
[null,"Angola",4,null,null,null,0,null,null,null,null,null,null,null,null,null,0,null,null,"AO","ANGOLA"]
[null,"Argentina",5,null,null,null,0,null,null,null,null,null,null,null,null,null,0,null,null,"AR","ARGENTINA"]
[null,"Armenia",6,null,null,null,0,null,null,null,null,null,null,null,null,null,0,null,null,"AM","ARMENIA"]
[null,"Aruba",7,null,null,null,0,null,null,null,null,null,null,null,null,null,0,null,null,"AW","ARUBA"]
[null,"Australia",8,null,null,null,0,null,null,null,null,null,null,null,null,null,0,null,null,"AU","AUSTRALI"]
[null,"Austria",9,null,null,null,0,null,null,null,null,null,null,null,null,null,0,null,null,"AT","AUSTRIA"]
[null,"Azerbaijan",10,null,null,null,0,null,null,null,null,null,null,null,null,null,0,null,null,"AZ","AZERBAIJAN"]
[null,"Bahamas",11,null,null,null,0,null,null,null,null,null,null,null,null,null,0,null,null,"BS","BAHAMAS"]
[null,"Bahrain",12,null,null,null,0,null,null,null,null,null,null,null,null,null,0,null,null,"BH","BAHRAIN"]
[null,"Bangladesh",13,null,null,null,0,null,null,null,null,null,null,null,null,null,0,null,null,"BD","BANGLADESH"]
[null,"Barbados",14,null,null,null,0,null,null,null,null,null,null,null,null,null,0,null,null,"BB","BARBADOS"]
[null,"Belarus",15,null,null,null,0,null,null,null,null,null,null,null,null,null,0,null,null,"BY","BELARUS"]
[null,"Belgium",16,null,null,null,0,null,null,null,null,null,null,null,null,null,0,null,null,"BE","BELGIUM"]
[null,"Belize",17,null,null,null,0,null,null,null,null,null,null,null,null,null,0,null,null,"BZ","BELIZE"]
[null,"Benin",18,null,null,null,0,null,null,null,null,null,null,null,null,null,0,null,null,"BJ","BENIN"]
[null,"Bolivia",19,null,null,null,0,null,null,null,null,null,null,null,null,null,0,null,null,"BO","BOLIVIA"]
[null,"Bosnia and Herzegovina",20,null,null,null,0,null,null,null,null,null,null,null,null,null,0,null,null,"BA","BOSNIAHERZ"]
[null,"Brazil",21,null,null,null,0,null,null,null,null,null,null,null,null,null,0,null,null,"BR","BRAZIL"]
[null,"British Virgin Islands",22,null,null,null,0,null,null,null,null,null,null,null,null,null,0,null,null,"VG","BRITVIRGIN"]
[null,"Brunei Darussalam",23,null,null,null,0,null,null,null,null,null,null,null,null,null,0,null,null,"BN","BRUNEI"]
[null,"Bulgaria",24,null,null,null,0,null,null,null,null,null,null,null,null,null,0,null,null,"BG","BULGARIA"]
[null,"Cambodia",25,null,null,null,0,null,null,null,null,null,null,null,null,null,0,null,null,"KH","CAMBODIA"]
[null,"Cameroon",26,null,null,null,0,null,null,null,null,null,null,null,null,null,0,null,null,"CM","CAMEROON"]
[null,"Canada",27,null,null,null,0,null,null,null,null,null,null,null,null,null,0,null,null,"CA","CANADA"]
[null,"Cape Verde / Cabo Verde",28,null,null,null,0,null,null,null,null,null,null,null,null,null,0,null,null,"CV","CABOVERDE"]
[null,"Chile",29,null,null,null,0,null,null,null,null,null,null,null,null,null,0,null,null,"CL","CHILE"]
[null,"China, People's Republic of",30,null,null,null,0,null,null,null,null,null,null,null,null,null,0,null,null,"CN","CHINA"]
[null,"Colombia",31,null,null,null,0,null,null,null,null,null,null,null,null,null,0,null,null,"CO","COLOMBIA"]
[null,"Congo",32,null,null,null,0,null,null,null,null,null,null,null,null,null,0,null,null,"CG","CONGO"]
[null,"Costa Rica",33,null,null,null,0,null,null,null,null,null,null,null,null,null,0,null,null,"CR","COSTARICA"]
[null,"Côte d’Ivoire",34,null,null,null,0,null,null,null,null,null,null,null,null,null,0,null,null,"CI","COTEIVOIRE"]
[null,"Croatia",35,null,null,null,0,null,null,null,null,null,null,null,null,null,0,null,null,"HR","CROATIA"]
[null,"Cuba",36,null,null,null,0,null,null,null,null,null,null,null,null,null,0,null,null,"CU","CUBA"]
[null,"Curaçao",37,null,null,null,0,null,null,null,null,null,null,null,null,null,0,null,null,"CW","CURACAO"]
[null,"Cyprus",38,null,null,null,0,null,null,null,null,null,null,null,null,null,0,null,null,"CY","CYPRUS"]
[null,"Czech Republic",39,null,null,null,0,null,null,null,null,null,null,null,null,null,0,null,null,"CZ","CZECH"]
[null,"Korea, Democratic People's Republic of",40,null,null,null,0,null,null,null,null,null,null,null,null,null,0,null,null,"KP","KOREADPR"]
[null,"Congo, Democratic Republic of the",41,null,null,null,0,null,null,null,null,null,null,null,null,null,0,null,null,"CD","CONGOREP"]
[null,"Denmark",42,null,null,null,0,null,null,null,null,null,null,null,null,null,0,null,null,"DK","DENMARK"]
[null,"Djibouti",43,null,null,null,0,null,null,null,null,null,null,null,null,null,0,null,null,"DJ","DJIBOUTI"]
[null,"Dominican Republic",44,null,null,null,0,null,null,null,null,null,null,null,null,null,0,null,null,"DO","DOMINICANR"]
[null,"Ecuador",45,null,null,null,0,null,null,null,null,null,null,null,null,null,0,null,null,"EC","ECUADOR"]
[null,"Egypt",46,null,null,null,0,null,null,null,null,null,null,null,null,null,0,null,null,"EG","EGYPT"]
[null,"Equatorial Guinea",47,null,null,null,0,null,null,null,null,null,null,null,null,null,0,null,null,"GQ","EQGUINEA"]
[null,"Eritrea",48,null,null,null,0,null,null,null,null,null,null,null,null,null,0,null,null,"ER","ERITREA"]
[null,"Estonia",49,null,null,null,0,null,null,null,null,null,null,null,null,null,0,null,null,"EE","ESTONIA"]
[null,"Ethiopia",50,null,null,null,0,null,null,null,null,null,null,null,null,null,0,null,null,"ET","ETHIOPIA"]
[null,"Finland",51,null,null,null,0,null,null,null,null,null,null,null,null,null,0,null,null,"FI","FINLAND"]
[null,"France",52,null,null,null,0,null,null,null,null,null,null,null,null,null,0,null,null,"FR","FRANCE"]
[null,"Gabon",53,null,null,null,0,null,null,null,null,null,null,null,null,null,0,null,null,"GA","GABON"]
[null,"Georgia",54,null,null,null,0,null,null,null,null,null,null,null,null,null,0,null,null,"GE","GEORGIA"]
[null,"Germany",55,null,null,null,0,null,null,null,null,null,null,null,null,null,0,null,null,"DE","GERMANY"]
[null,"Ghana",56,null,null,null,0,null,null,null,null,null,null,null,null,null,0,null,null,"GH","GHANA"]
[null,"Gibraltar",57,null,null,null,0,null,null,null,null,null,null,null,null,null,0,null,null,"GI","GIBRALTAR"]
[null,"Greece",58,null,null,null,0,null,null,null,null,null,null,null,null,null,0,null,null,"GR","GREECE"]
[null,"Guatemala",59,null,null,null,0,null,null,null,null,null,null,null,null,null,0,null,null,"GT","GUATEMALA"]
[null,"Guinea-Bissau",60,null,null,null,0,null,null,null,null,null,null,null,null,null,0,null,null,"GW","GUINEABIS"]
[null,"Honduras",61,null,null,null,0,null,null,null,null,null,null,null,null,null,0,null,null,"HN","HONDURAS"]
[null,"Hong Kong, China",62,null,null,null,0,null,null,null,null,null,null,null,null,null,0,null,null,"HK","HONGKONG"]
[null,"Hungary",63,null,null,null,0,null,null,null,null,null,null,null,null,null,0,null,null,"HU","HUNGARY"]
[null,"Iceland",64,null,null,null,0,null,null,null,null,null,null,null,null,null,0,null,null,"IS","ICELAND"]
[null,"India",65,null,null,null,0,null,null,null,null,null,null,null,null,null,0,null,null,"IN","INDIA"]
[null,"Indonesia",66,null,null,null,{"$f":"SUM(D76:F76)","v":0},null,null,null,null,null,null,null,null,null,{"$f":"SUM(H76:P76)-L76-N76","v":0},null,null,"ID","INDONESIA"]
[null,"Iran, Islamic Republic of",67,null,null,null,0,null,null,null,null,null,null,null,null,null,0,null,null,"IR","IRAN"]
[null,"Iraq",68,null,null,null,0,null,null,null,null,null,null,null,null,null,0,null,null,"IQ","IRAQ"]
[null,"Ireland",69,null,null,null,0,null,null,null,null,null,null,null,null,null,0,null,null,"IE","IRELAND"]
[null,"Israel",70,null,null,null,0,null,null,null,null,null,null,null,null,null,0,null,null,"IL","ISRAEL"]
[null,"Italy",71,null,null,null,0,null,null,null,null,null,null,null,null,null,0,null,null,"IT","ITALY"]
[null,"Jamaica",72,null,null,null,0,null,null,null,null,null,null,null,null,null,0,null,null,"JM","JAMAICA"]
[null,"Japan",73,null,null,null,0,null,null,null,null,null,null,null,null,null,0,null,null,"JP","JAPAN"]
[null,"Jordan",74,null,null,null,0,null,null,null,null,null,null,null,null,null,0,null,null,"JO","JORDAN"]
[null,"Kazakhstan",75,null,null,null,0,null,null,null,null,null,null,null,null,null,0,null,null,"KZ","KAZAKHSTAN"]
[null,"Kenya",76,null,null,null,{"$f":"SUM(D86:F86)","v":0},null,null,null,null,null,null,null,null,null,0,null,null,"KE","KENYA"]
[null,"Korea",77,null,null,null,{"$f":"SUM(D87:F87)","v":0},null,null,null,null,null,null,null,null,null,0,null,null,"KR","KOREA"]
[null,"Kosovo*",78,null,null,null,0,null,null,null,null,null,null,null,null,null,0,null,null,"XK","KOSOVO"]
[null,"Kuwait",79,null,null,null,0,null,null,null,null,null,null,null,null,null,0,null,null,"KW","KUWAIT"]
[null,"Kyrgyzstan",80,null,null,null,0,null,null,null,null,null,null,null,null,null,0,null,null,"KG","KYRGYZSTAN"]
[null,"Lao People's Democratic Republic",81,null,null,null,0,null,null,null,null,null,null,null,null,null,0,null,null,"LA","LAO"]
[null,"Latvia",82,null,null,null,0,null,null,null,null,null,null,null,null,null,0,null,null,"LV","LATVIA"]
[null,"Lebanon",83,null,null,null,0,null,null,null,null,null,null,null,null,null,0,null,null,"LB","LEBANON"]
[null,"Liberia",84,null,null,null,0,null,null,null,null,null,null,null,null,null,0,null,null,"LR","LIBERIA"]
[null,"Libya",85,null,null,null,0,null,null,null,null,null,null,null,null,null,0,null,null,"LY","LIBYA"]
[null,"Liechtenstein",86,null,null,null,0,null,null,null,null,null,null,null,null,null,0,null,null,"LI","LIECHTENST"]
[null,"Lithuania",87,null,null,null,0,null,null,null,null,null,null,null,null,null,0,null,null,"LT","LITHUANIA"]
[null,"Luxembourg",88,null,null,null,0,null,null,null,null,null,null,null,null,null,0,null,null,"LU","LUXEMBOU"]
[null,"Madagascar",89,null,null,null,0,null,null,null,null,null,null,null,null,null,0,null,null,"MG","MADAGASCAR"]
[null,"Malaysia",90,null,null,null,0,null,null,null,null,null,null,null,null,null,0,null,null,"MY","MALAYSIA"]
[null,"Malta",91,null,null,null,0,null,null,null,null,null,null,null,null,null,0,null,null,"MT","MALTA"]
[null,"Marshall Islands",92,null,null,null,0,null,null,null,null,null,null,null,null,null,0,null,null,"MH","MARSHALL"]
[null,"Mauritania",93,null,null,null,0,null,null,null,null,null,null,null,null,null,0,null,null,"MR","MAURITANIA"]
[null,"Mauritius",94,null,null,null,0,null,null,null,null,null,null,null,null,null,0,null,null,"MU","MAURITIUS"]
[null,"Mexico",95,null,null,null,0,null,null,null,null,null,null,null,null,null,0,null,null,"MX","MEXICO"]
[null,"Moldova, Republic of",96,null,null,null,0,null,null,null,null,null,null,null,null,null,0,null,null,"MD","MOLDOVA"]
[null,"Mongolia",97,null,null,null,0,null,null,null,null,null,null,null,null,null,0,null,null,"MN","MONGOLIA"]
[null,"Montenegro",98,null,null,null,0,null,null,null,null,null,null,null,null,null,0,null,null,"ME","MONTENEGRO"]
[null,"Morocco",99,null,null,null,0,null,null,null,null,null,null,null,null,null,0,null,null,"MA","MOROCCO"]
[null,"Mozambique",100,null,null,null,0,null,null,null,null,null,null,null,null,null,0,null,null,"MZ","MOZAMBIQUE"]
[null,"Myanmar",101,null,null,null,0,null,null,null,null,null,null,null,null,null,0,null,null,"MM","MYANMAR"]
[null,"Namibia",102,null,null,null,0,null,null,null,null,null,null,null,null,null,0,null,null,"NA","NAMIBIA"]
[null,"Nepal",103,null,null,null,0,null,null,null,null,null,null,null,null,null,0,null,null,"NP","NEPAL"]
[null,"Netherlands",104,null,null,null,0,null,null,null,null,null,null,null,null,null,0,null,null,"NL","NETHLAND"]
[null,"New Caledonia",105,null,null,null,0,null,null,null,null,null,null,null,null,null,0,null,null,"NC","NEWCALEDON"]
[null,"New Zealand",106,null,null,null,0,null,null,null,null,null,null,null,null,null,0,null,null,"NZ","NZ"]
[null,"Niger",107,null,null,null,0,null,null,null,null,null,null,null,null,null,0,null,null,"NE","NIGER"]
[null,"Nigeria",108,null,null,null,0,null,null,null,null,null,null,null,null,null,0,null,null,"NG","NIGERIA"]
[null,"North Macedonia",109,null,null,null,0,null,null,null,null,null,null,null,null,null,0,null,null,"MK","NORTHMACED"]
[null,"Norway",110,null,null,null,0,null,null,null,null,null,null,null,null,null,0,null,null,"NO","NORWAY"]
[null,"Oman",111,null,null,null,0,null,null,null,null,null,null,null,null,null,0,null,null,"OM","OMAN"]
[null,"Other Africa",112,null,null,null,0,null,null,null,null,null,null,null,null,null,0,null,null,"O1","OTHERAFRIC"]
[null,"Other Asia Oceania",113,null,null,null,0,null,null,null,null,null,null,null,null,null,0,null,null,"O4","OTHERASIA"]
[null,"Other Europe",114,null,null,null,0,null,null,null,null,null,null,null,null,null,0,null,null,"O8","OTHEREUROP"]
[null,"Other Former Soviet Union",115,null,null,null,0,null,null,null,null,null,null,null,null,null,0,null,null,"P8","OTHFUSSR"]
[null,"Other Near and Middle East",116,null,null,null,0,null,null,null,null,null,null,null,null,null,0,null,null,"P4","OTHERNEARM"]
[null,"Other Non-OECD Americas",117,null,null,null,0,null,null,null,null,null,null,null,null,null,0,null,null,"P1","OTHERLATIN"]
[null,"Pakistan",118,null,null,null,0,null,null,null,null,null,null,null,null,null,0,null,null,"PK","PAKISTAN"]
[null,"Panama",119,null,null,null,0,null,null,null,null,null,null,null,null,null,0,null,null,"PA","PANAMA"]
[null,"Papua New Guinea",120,null,null,null,0,null,null,null,null,null,null,null,null,null,0,null,null,"PG","PAPUANEWGU"]
[null,"Peru",121,null,null,null,0,null,null,null,null,null,null,null,null,null,0,null,null,"PE","PERU"]
[null,"Philippines",122,null,null,null,0,null,null,null,null,null,null,null,null,null,0,null,null,"PH","PHILIPPINE"]
[null,"Poland",123,null,null,null,0,null,null,null,null,null,null,null,null,null,0,null,null,"PL","POLAND"]
[null,"Portugal",124,null,null,null,0,null,null,null,null,null,null,null,null,null,0,null,null,"PT","PORTUGAL"]
[null,"Qatar",125,null,null,null,0,null,null,null,null,null,null,null,null,null,0,null,null,"QA","QATAR"]
[null,"Romania",126,null,null,null,0,null,null,null,null,null,null,null,null,null,0,null,null,"RO","ROMANIA"]
[null,"Russian Federation",127,null,null,null,0,null,null,null,null,null,null,null,null,null,0,null,null,"RU","RUSSIA"]
[null,"Sao Tome and Principe",128,null,null,null,0,null,null,null,null,null,null,null,null,null,0,null,null,"ST","SAOTOME"]
[null,"Saudi Arabia",129,null,null,null,0,null,null,null,null,null,null,null,null,null,0,null,null,"SA","SAUDIARABI"]
[null,"Senegal",130,null,null,null,0,null,null,null,null,null,null,null,null,null,0,null,null,"SN","SENEGAL"]
[null,"Serbia",131,null,null,null,0,null,null,null,null,null,null,null,null,null,0,null,null,"RS","SERBIA"]
[null,"Sierra Leone",132,null,null,null,0,null,null,null,null,null,null,null,null,null,0,null,null,"SL","SIERRALEON"]
[null,"Singapore",133,null,null,null,0,null,null,null,null,null,null,null,null,null,0,null,null,"SG","SINGAPORE"]
[null,"Slovak Republic",134,null,null,null,0,null,null,null,null,null,null,null,null,null,0,null,null,"SK","SLOVAKIA"]
[null,"Slovenia",135,null,null,null,0,null,null,null,null,null,null,null,null,null,0,null,null,"SI","SLOVENIA"]
[null,"South Africa",136,null,null,null,0,null,null,null,null,null,null,null,null,null,0,null,null,"ZA","SOUTHAFRIC"]
[null,"South Sudan",137,null,null,null,0,null,null,null,null,null,null,null,null,null,0,null,null,"SS","SSUDAN"]
[null,"Spain",138,null,null,null,0,null,null,null,null,null,null,null,null,null,0,null,null,"ES","SPAIN"]
[null,"Sri Lanka",139,null,null,null,0,null,null,null,null,null,null,null,null,null,0,null,null,"LK","SRILANKA"]
[null,"Sudan",140,null,null,null,0,null,null,null,null,null,null,null,null,null,0,null,null,"SD","SUDAN"]
[null,"Sweden",141,null,null,null,{"$f":"SUM(D151:F151)","v":0},null,null,null,null,null,null,null,null,null,0,null,null,"SE","SWEDEN"]
[null,"Switzerland",142,null,null,null,0,null,null,null,null,null,null,null,null,null,0,null,null,"CH","SWITLAND"]
[null,"Syrian Arab Republic",143,null,null,null,0,null,null,null,null,null,null,null,null,null,0,null,null,"SY","SYRIA"]
[null,"Taiwan / Chinese Taipei",144,null,null,null,0,null,null,null,null,null,null,null,null,null,0,null,null,"TW","TAIPEI"]
[null,"Tajikistan",145,null,null,null,0,null,null,null,null,null,null,null,null,null,0,null,null,"TJ","TAJIKISTAN"]
[null,"Tanzania, United Republic of",146,null,null,null,0,null,null,null,null,null,null,null,null,null,0,null,null,"TZ","TANZANIA"]
[null,"Thailand",147,null,null,null,0,null,null,null,null,null,null,null,null,null,0,null,null,"TH","THAILAND"]
[null,"Timor-Leste",148,null,null,null,0,null,null,null,null,null,null,null,null,null,0,null,null,"TL","TIMORLESTE"]
[null,"Togo",149,null,null,null,0,null,null,null,null,null,null,null,null,null,0,null,null,"TG","TOGO"]
[null,"Trinidad and Tobago",150,null,null,null,0,null,null,null,null,null,null,null,null,null,0,null,null,"TT","TRINIDAD"]
[null,"Tunisia",151,null,null,null,0,null,null,null,null,null,null,null,null,null,0,null,null,"TN","TUNISIA"]
[null,"Turkey",152,null,null,null,0,null,null,null,null,null,null,null,null,null,0,null,null,"TR","TURKEY"]
[null,"Turkmenistan",153,null,null,null,0,null,null,null,null,null,null,null,null,null,0,null,null,"TM","TURKMENIST"]
[null,"Uganda",154,null,null,null,0,null,null,null,null,null,null,null,null,null,0,null,null,"UG","UGANDA"]
[null,"Ukraine",155,null,null,null,0,null,null,null,null,null,null,null,null,null,0,null,null,"UA","UKRAINE"]
[null,"United Arab Emirates",156,null,null,null,0,null,null,null,null,null,null,null,null,null,0,null,null,"AE","UAE"]
[null,"United Kingdom",157,null,null,null,0,null,null,null,null,null,null,null,null,null,0,null,null,"GB","UK"]
[null,"United States",158,null,null,null,0,null,null,null,null,null,null,null,null,null,0,null,null,"US","USA"]
[null,"Uruguay",159,null,null,null,0,null,null,null,null,null,null,null,null,null,0,null,null,"UY","URUGUAY"]
[null,"Uzbekistan",160,null,null,null,0,null,null,null,null,null,null,null,null,null,0,null,null,"UZ","UZBEKISTAN"]
[null,"Venezuela, Bolivarian Republic",161,null,null,null,0,null,null,null,null,null,null,null,null,null,0,null,null,"VE","VENEZUELA"]
[null,"Viet Nam",162,null,null,null,0,null,null,null,null,null,null,null,null,null,{"$f":"SUM(H172:P172)-L172-N172","v":0},null,null,"VN","VIETNAM"]
[null,"Yemen",163,null,null,null,0,null,null,null,null,null,null,null,null,null,0,null,null,"YE","YEMEN"]
[null,"Not elsewhere specified",164,null,null,null,0,null,null,null,null,null,null,null,null,null,0,null,null,"Y3","NONSPEC"]
[null,"Total Imports",165,{"$f":"SUM(D11:D174)","v":0},{"$f":"SUM(E11:E174)","v":0},{"$f":"SUM(F11:F174)","v":0},0,{"$f":"SUM(H11:H174)","v":0},0,0,0,0,0,0,0,0,0,null,null,"Y2","TOTIMPST"]
[]
[null,"Automatic Checks"]
[null,"Total sum Crude",null,{"$f":"IF(S178=0,\"OK\",\"The Total Imports figure does not equal the sum of its components for Total Crude.\")","v":"OK"},null,null,null,null,null,null,null,null,null,null,null,null,null,null,{"$f":"IF(AND(G175-SUM(G11:G174)=0,(G175-SUM(D175:F175)=0)),0,-1)","v":0}]
[null,"Total sum Products",null,{"$f":"IF(S179=0,\"OK\",\"The Total Imports figure does not equal the sum of its components for Total Products.\")","v":"OK"},null,null,null,null,null,null,null,null,null,null,null,null,null,null,{"$f":"IF(AND(Q175-SUM(Q11:Q174) = 0, (Q175-SUM(H175:K175,M175,O175,P175)=0)), 0, -1)","v":0}]
[null,"Imports of Crude Balance",null,{"$f":"IF(G175-QuE_Balance!G14=0,\"OK\",\"Total Imports do not equal Total Imports for Total Crude in Module 1 - Balance.\")","v":"OK"}]
[null,"Imports of Products Balance",null,{"$f":"IF(Q175-QuE_Balance!T14=0,\"OK\",\"Total Imports do not equal Total Imports for Total Products in Module 1 - Balance.\")","v":"OK"}]
[]
[]
[]
[]
[]
[]
[]
[]
[null,null,null,"CRUDEOIL","NGL","OTHTONE","CRNGFEED","LPG","NAPHTHA","GASOLINE","KEROSENE","JETKERO","GASDIES","DIESEL","RESFUEL","OTHTTWO","TOTPRODS"]

{"sheet":"QuE_Exports","index":3,"n_rows":190,"n_cols":21,"rows_kept":190,"cut":false,"hidden":false,"merged":[[177,3,177,13],[178,3,178,13],[179,3,179,13],[180,3,180,13]]}
[" ","Trade by Destination"]
[]
[null,"Country:",{"$f":"CountryMessage","v":"(select your country on the 'Start' sheet)"}]
[]
[null,"Time period:",{"$f":"FirstMonth & \" \" & QuestYear","v":"MONTH ? 2022"}]
[null,null,null,null,null,null,null,null,null,null,null,null,null,null,null,null,null,null,null,null,"EXPORTS"]
[null,"Crude Exports",null,null,null,null,null,"Product Exports"]
[null,null,null,null,null,null,"Thousand Metric Tons",null,null,null,null,null,null,null,"Thousand Metric Tons"]
[null,null,null,"Crude Oil","NGL","Other","Total\n(1)+(2)+(3)","LPG","Naphtha","Gasoline","Total Kerosene","Of which: Jet\nKerosene","Gas/ Diesel Oil","Of which: road diesel","Fuel Oil","Other\nProducts","Total Products (5)+(6)+(7)+ (8)+(10)+(12)+(13)"]
[null,null,null,"(1)","(2)","(3)","(4)","(5)","(6)","(7)","(8)","(9)","(10)","(11)","(12)","(13)","(14)"]
[null,"Albania",1,null,null,null,{"$f":"SUM(D11:F11)","v":0},null,null,null,null,null,null,null,null,null,{"$f":"+H11+I11+J11+K11+M11+O11+P11","v":0},null,null,"AL","ALBANIA"]
[null,"Algeria",2,null,null,null,{"$f":"SUM(D12:F12)","v":0},null,null,null,null,null,null,null,null,null,{"$f":"+H12+I12+J12+K12+M12+O12+P12","v":0},null,null,"DZ","ALGERIA"]
[null,"Andorra",3,null,null,null,0,null,null,null,null,null,null,null,null,null,0,null,null,"AD","ANDORRA"]
[null,"Angola",4,null,null,null,0,null,null,null,null,null,null,null,null,null,0,null,null,"AO","ANGOLA"]
[null,"Argentina",5,null,null,null,0,null,null,null,null,null,null,null,null,null,0,null,null,"AR","ARGENTINA"]
[null,"Armenia",6,null,null,null,0,null,null,null,null,null,null,null,null,null,0,null,null,"AM","ARMENIA"]
[null,"Aruba",7,null,null,null,0,null,null,null,null,null,null,null,null,null,0,null,null,"AW","ARUBA"]
[null,"Australia",8,null,null,null,0,null,null,null,null,null,null,null,null,null,0,null,null,"AU","AUSTRALI"]
[null,"Austria",9,null,null,null,0,null,null,null,null,null,null,null,null,null,0,null,null,"AT","AUSTRIA"]
[null,"Azerbaijan",10,null,null,null,0,null,null,null,null,null,null,null,null,null,0,null,null,"AZ","AZERBAIJAN"]
[null,"Bahamas",11,null,null,null,0,null,null,null,null,null,null,null,null,null,0,null,null,"BS","BAHAMAS"]
[null,"Bahrain",12,null,null,null,0,null,null,null,null,null,null,null,null,null,0,null,null,"BH","BAHRAIN"]
[null,"Bangladesh",13,null,null,null,0,null,null,null,null,null,null,null,null,null,0,null,null,"BD","BANGLADESH"]
[null,"Barbados",14,null,null,null,0,null,null,null,null,null,null,null,null,null,0,null,null,"BB","BARBADOS"]
[null,"Belarus",15,null,null,null,0,null,null,null,null,null,null,null,null,null,0,null,null,"BY","BELARUS"]
[null,"Belgium",16,null,null,null,0,null,null,null,null,null,null,null,null,null,0,null,null,"BE","BELGIUM"]
[null,"Belize",17,null,null,null,0,null,null,null,null,null,null,null,null,null,0,null,null,"BZ","BELIZE"]
[null,"Benin",18,null,null,null,0,null,null,null,null,null,null,null,null,null,0,null,null,"BJ","BENIN"]
[null,"Bolivia",19,null,null,null,0,null,null,null,null,null,null,null,null,null,0,null,null,"BO","BOLIVIA"]
[null,"Bosnia and Herzegovina",20,null,null,null,0,null,null,null,null,null,null,null,null,null,0,null,null,"BA","BOSNIAHERZ"]
[null,"Brazil",21,null,null,null,0,null,null,null,null,null,null,null,null,null,0,null,null,"BR","BRAZIL"]
[null,"British Virgin Islands",22,null,null,null,0,null,null,null,null,null,null,null,null,null,0,null,null,"VG","BRITVIRGIN"]
[null,"Brunei Darussalam",23,null,null,null,0,null,null,null,null,null,null,null,null,null,0,null,null,"BN","BRUNEI"]
[null,"Bulgaria",24,null,null,null,0,null,null,null,null,null,null,null,null,null,0,null,null,"BG","BULGARIA"]
[null,"Cambodia",25,null,null,null,0,null,null,null,null,null,null,null,null,null,0,null,null,"KH","CAMBODIA"]
[null,"Cameroon",26,null,null,null,0,null,null,null,null,null,null,null,null,null,0,null,null,"CM","CAMEROON"]
[null,"Canada",27,null,null,null,0,null,null,null,null,null,null,null,null,null,0,null,null,"CA","CANADA"]
[null,"Cape Verde / Cabo Verde",28,null,null,null,0,null,null,null,null,null,null,null,null,null,0,null,null,"CV","CABOVERDE"]
[null,"Chile",29,null,null,null,0,null,null,null,null,null,null,null,null,null,0,null,null,"CL","CHILE"]
[null,"China, People's Republic of",30,null,null,null,0,null,null,null,null,null,null,null,null,null,0,null,null,"CN","CHINA"]
[null,"Colombia",31,null,null,null,0,null,null,null,null,null,null,null,null,null,0,null,null,"CO","COLOMBIA"]
[null,"Congo",32,null,null,null,0,null,null,null,null,null,null,null,null,null,0,null,null,"CG","CONGO"]
[null,"Costa Rica",33,null,null,null,0,null,null,null,null,null,null,null,null,null,0,null,null,"CR","COSTARICA"]
[null,"Côte d’Ivoire",34,null,null,null,0,null,null,null,null,null,null,null,null,null,0,null,null,"CI","COTEIVOIRE"]
[null,"Croatia",35,null,null,null,0,null,null,null,null,null,null,null,null,null,0,null,null,"HR","CROATIA"]
[null,"Cuba",36,null,null,null,0,null,null,null,null,null,null,null,null,null,0,null,null,"CU","CUBA"]
[null,"Curaçao",37,null,null,null,0,null,null,null,null,null,null,null,null,null,0,null,null,"CW","CURACAO"]
[null,"Cyprus",38,null,null,null,0,null,null,null,null,null,null,null,null,null,0,null,null,"CY","CYPRUS"]
[null,"Czech Republic",39,null,null,null,0,null,null,null,null,null,null,null,null,null,0,null,null,"CZ","CZECH"]
[null,"Korea, Democratic People's Republic of",40,null,null,null,0,null,null,null,null,null,null,null,null,null,0,null,null,"KP","KOREADPR"]
[null,"Congo, Democratic Republic of the",41,null,null,null,0,null,null,null,null,null,null,null,null,null,0,null,null,"CD","CONGOREP"]
[null,"Denmark",42,null,null,null,0,null,null,null,null,null,null,null,null,null,0,null,null,"DK","DENMARK"]
[null,"Djibouti",43,null,null,null,0,null,null,null,null,null,null,null,null,null,0,null,null,"DJ","DJIBOUTI"]
[null,"Dominican Republic",44,null,null,null,0,null,null,null,null,null,null,null,null,null,0,null,null,"DO","DOMINICANR"]
[null,"Ecuador",45,null,null,null,0,null,null,null,null,null,null,null,null,null,0,null,null,"EC","ECUADOR"]
[null,"Egypt",46,null,null,null,0,null,null,null,null,null,null,null,null,null,0,null,null,"EG","EGYPT"]
[null,"Equatorial Guinea",47,null,null,null,0,null,null,null,null,null,null,null,null,null,0,null,null,"GQ","EQGUINEA"]
[null,"Eritrea",48,null,null,null,0,null,null,null,null,null,null,null,null,null,0,null,null,"ER","ERITREA"]
[null,"Estonia",49,null,null,null,0,null,null,null,null,null,null,null,null,null,0,null,null,"EE","ESTONIA"]
[null,"Ethiopia",50,null,null,null,0,null,null,null,null,null,null,null,null,null,0,null,null,"ET","ETHIOPIA"]
[null,"Finland",51,null,null,null,0,null,null,null,null,null,null,null,null,null,0,null,null,"FI","FINLAND"]
[null,"France",52,null,null,null,0,null,null,null,null,null,null,null,null,null,0,null,null,"FR","FRANCE"]
[null,"Gabon",53,null,null,null,0,null,null,null,null,null,null,null,null,null,0,null,null,"GA","GABON"]
[null,"Georgia",54,null,null,null,0,null,null,null,null,null,null,null,null,null,0,null,null,"GE","GEORGIA"]
[null,"Germany",55,null,null,null,0,null,null,null,null,null,null,null,null,null,0,null,null,"DE","GERMANY"]
[null,"Ghana",56,null,null,null,0,null,null,null,null,null,null,null,null,null,0,null,null,"GH","GHANA"]
[null,"Gibraltar",57,null,null,null,0,null,null,null,null,null,null,null,null,null,0,null,null,"GI","GIBRALTAR"]
[null,"Greece",58,null,null,null,0,null,null,null,null,null,null,null,null,null,0,null,null,"GR","GREECE"]
[null,"Guatemala",59,null,null,null,0,null,null,null,null,null,null,null,null,null,0,null,null,"GT","GUATEMALA"]
[null,"Guinea-Bissau",60,null,null,null,0,null,null,null,null,null,null,null,null,null,0,null,null,"GW","GUINEABIS"]
[null,"Honduras",61,null,null,null,0,null,null,null,null,null,null,null,null,null,0,null,null,"HN","HONDURAS"]
[null,"Hong Kong, China",62,null,null,null,0,null,null,null,null,null,null,null,null,null,0,null,null,"HK","HONGKONG"]
[null,"Hungary",63,null,null,null,0,null,null,null,null,null,null,null,null,null,0,null,null,"HU","HUNGARY"]
[null,"Iceland",64,null,null,null,0,null,null,null,null,null,null,null,null,null,0,null,null,"IS","ICELAND"]
[null,"India",65,null,null,null,0,null,null,null,null,null,null,null,null,null,0,null,null,"IN","INDIA"]
[null,"Indonesia",66,null,null,null,{"$f":"SUM(D76:F76)","v":0},null,null,null,null,null,null,null,null,null,{"$f":"+H76+I76+J76+K76+M76+O76+P76","v":0},null,null,"ID","INDONESIA"]
[null,"Iran, Islamic Republic of",67,null,null,null,0,null,null,null,null,null,null,null,null,null,0,null,null,"IR","IRAN"]
[null,"Iraq",68,null,null,null,0,null,null,null,null,null,null,null,null,null,0,null,null,"IQ","IRAQ"]
[null,"Ireland",69,null,null,null,0,null,null,null,null,null,null,null,null,null,0,null,null,"IE","IRELAND"]
[null,"Israel",70,null,null,null,0,null,null,null,null,null,null,null,null,null,0,null,null,"IL","ISRAEL"]
[null,"Italy",71,null,null,null,0,null,null,null,null,null,null,null,null,null,0,null,null,"IT","ITALY"]
[null,"Jamaica",72,null,null,null,0,null,null,null,null,null,null,null,null,null,0,null,null,"JM","JAMAICA"]
[null,"Japan",73,null,null,null,0,null,null,null,null,null,null,null,null,null,0,null,null,"JP","JAPAN"]
[null,"Jordan",74,null,null,null,0,null,null,null,null,null,null,null,null,null,0,null,null,"JO","JORDAN"]
[null,"Kazakhstan",75,null,null,null,0,null,null,null,null,null,null,null,null,null,0,null,null,"KZ","KAZAKHSTAN"]
[null,"Kenya",76,null,null,null,0,null,null,null,null,null,null,null,null,null,0,null,null,"KE","KENYA"]
[null,"Korea",77,null,null,null,0,null,null,null,null,null,null,null,null,null,0,null,null,"KR","KOREA"]
[null,"Kosovo*",78,null,null,null,0,null,null,null,null,null,null,null,null,null,0,null,null,"XK","KOSOVO"]
[null,"Kuwait",79,null,null,null,0,null,null,null,null,null,null,null,null,null,0,null,null,"KW","KUWAIT"]
[null,"Kyrgyzstan",80,null,null,null,0,null,null,null,null,null,null,null,null,null,0,null,null,"KG","KYRGYZSTAN"]
[null,"Lao People's Democratic Republic",81,null,null,null,0,null,null,null,null,null,null,null,null,null,0,null,null,"LA","LAO"]
[null,"Latvia",82,null,null,null,0,null,null,null,null,null,null,null,null,null,0,null,null,"LV","LATVIA"]
[null,"Lebanon",83,null,null,null,0,null,null,null,null,null,null,null,null,null,0,null,null,"LB","LEBANON"]
[null,"Liberia",84,null,null,null,0,null,null,null,null,null,null,null,null,null,0,null,null,"LR","LIBERIA"]
[null,"Libya",85,null,null,null,0,null,null,null,null,null,null,null,null,null,0,null,null,"LY","LIBYA"]
[null,"Liechtenstein",86,null,null,null,0,null,null,null,null,null,null,null,null,null,0,null,null,"LI","LIECHTENST"]
[null,"Lithuania",87,null,null,null,0,null,null,null,null,null,null,null,null,null,0,null,null,"LT","LITHUANIA"]
[null,"Luxembourg",88,null,null,null,0,null,null,null,null,null,null,null,null,null,0,null,null,"LU","LUXEMBOU"]
[null,"Madagascar",89,null,null,null,0,null,null,null,null,null,null,null,null,null,0,null,null,"MG","MADAGASCAR"]
[null,"Malaysia",90,null,null,null,0,null,null,null,null,null,null,null,null,null,0,null,null,"MY","MALAYSIA"]
[null,"Malta",91,null,null,null,0,null,null,null,null,null,null,null,null,null,0,null,null,"MT","MALTA"]
[null,"Marshall Islands",92,null,null,null,0,null,null,null,null,null,null,null,null,null,0,null,null,"MH","MARSHALL"]
[null,"Mauritania",93,null,null,null,0,null,null,null,null,null,null,null,null,null,0,null,null,"MR","MAURITANIA"]
[null,"Mauritius",94,null,null,null,0,null,null,null,null,null,null,null,null,null,0,null,null,"MU","MAURITIUS"]
[null,"Mexico",95,null,null,null,0,null,null,null,null,null,null,null,null,null,0,null,null,"MX","MEXICO"]
[null,"Moldova, Republic of",96,null,null,null,0,null,null,null,null,null,null,null,null,null,0,null,null,"MD","MOLDOVA"]
[null,"Mongolia",97,null,null,null,0,null,null,null,null,null,null,null,null,null,0,null,null,"MN","MONGOLIA"]
[null,"Montenegro",98,null,null,null,0,null,null,null,null,null,null,null,null,null,0,null,null,"ME","MONTENEGRO"]
[null,"Morocco",99,null,null,null,0,null,null,null,null,null,null,null,null,null,0,null,null,"MA","MOROCCO"]
[null,"Mozambique",100,null,null,null,0,null,null,null,null,null,null,null,null,null,0,null,null,"MZ","MOZAMBIQUE"]
[null,"Myanmar",101,null,null,null,0,null,null,null,null,null,null,null,null,null,0,null,null,"MM","MYANMAR"]
[null,"Namibia",102,null,null,null,0,null,null,null,null,null,null,null,null,null,0,null,null,"NA","NAMIBIA"]
[null,"Nepal",103,null,null,null,0,null,null,null,null,null,null,null,null,null,0,null,null,"NP","NEPAL"]
[null,"Netherlands",104,null,null,null,0,null,null,null,null,null,null,null,null,null,0,null,null,"NL","NETHLAND"]
[null,"New Caledonia",105,null,null,null,0,null,null,null,null,null,null,null,null,null,0,null,null,"NC","NEWCALEDON"]
[null,"New Zealand",106,null,null,null,0,null,null,null,null,null,null,null,null,null,0,null,null,"NZ","NZ"]
[null,"Niger",107,null,null,null,0,null,null,null,null,null,null,null,null,null,0,null,null,"NE","NIGER"]
[null,"Nigeria",108,null,null,null,0,null,null,null,null,null,null,null,null,null,0,null,null,"NG","NIGERIA"]
[null,"North Macedonia",109,null,null,null,0,null,null,null,null,null,null,null,null,null,0,null,null,"MK","NORTHMACED"]
[null,"Norway",110,null,null,null,0,null,null,null,null,null,null,null,null,null,0,null,null,"NO","NORWAY"]
[null,"Oman",111,null,null,null,0,null,null,null,null,null,null,null,null,null,0,null,null,"OM","OMAN"]
[null,"Other Africa",112,null,null,null,0,null,null,null,null,null,null,null,null,null,0,null,null,"O1","OTHERAFRIC"]
[null,"Other Asia Oceania",113,null,null,null,0,null,null,null,null,null,null,null,null,null,0,null,null,"O4","OTHERASIA"]
[null,"Other Europe",114,null,null,null,0,null,null,null,null,null,null,null,null,null,0,null,null,"O8","OTHEREUROP"]
[null,"Other Former Soviet Union",115,null,null,null,0,null,null,null,null,null,null,null,null,null,0,null,null,"P8","OTHFUSSR"]
[null,"Other Near and Middle East",116,null,null,null,0,null,null,null,null,null,null,null,null,null,0,null,null,"P4","OTHERNEARM"]
[null,"Other Non-OECD Americas",117,null,null,null,0,null,null,null,null,null,null,null,null,null,0,null,null,"P1","OTHERLATIN"]
[null,"Pakistan",118,null,null,null,0,null,null,null,null,null,null,null,null,null,0,null,null,"PK","PAKISTAN"]
[null,"Panama",119,null,null,null,0,null,null,null,null,null,null,null,null,null,0,null,null,"PA","PANAMA"]
[null,"Papua New Guinea",120,null,null,null,0,null,null,null,null,null,null,null,null,null,0,null,null,"PG","PAPUANEWGU"]
[null,"Peru",121,null,null,null,0,null,null,null,null,null,null,null,null,null,0,null,null,"PE","PERU"]
[null,"Philippines",122,null,null,null,0,null,null,null,null,null,null,null,null,null,0,null,null,"PH","PHILIPPINE"]
[null,"Poland",123,null,null,null,0,null,null,null,null,null,null,null,null,null,0,null,null,"PL","POLAND"]
[null,"Portugal",124,null,null,null,0,null,null,null,null,null,null,null,null,null,0,null,null,"PT","PORTUGAL"]
[null,"Qatar",125,null,null,null,0,null,null,null,null,null,null,null,null,null,0,null,null,"QA","QATAR"]
[null,"Romania",126,null,null,null,0,null,null,null,null,null,null,null,null,null,0,null,null,"RO","ROMANIA"]
[null,"Russian Federation",127,null,null,null,0,null,null,null,null,null,null,null,null,null,0,null,null,"RU","RUSSIA"]
[null,"Sao Tome and Principe",128,null,null,null,0,null,null,null,null,null,null,null,null,null,0,null,null,"ST","SAOTOME"]
[null,"Saudi Arabia",129,null,null,null,0,null,null,null,null,null,null,null,null,null,0,null,null,"SA","SAUDIARABI"]
[null,"Senegal",130,null,null,null,0,null,null,null,null,null,null,null,null,null,0,null,null,"SN","SENEGAL"]
[null,"Serbia",131,null,null,null,0,null,null,null,null,null,null,null,null,null,0,null,null,"RS","SERBIA"]
[null,"Sierra Leone",132,null,null,null,0,null,null,null,null,null,null,null,null,null,0,null,null,"SL","SIERRALEON"]
[null,"Singapore",133,null,null,null,0,null,null,null,null,null,null,null,null,null,0,null,null,"SG","SINGAPORE"]
[null,"Slovak Republic",134,null,null,null,0,null,null,null,null,null,null,null,null,null,0,null,null,"SK","SLOVAKIA"]
[null,"Slovenia",135,null,null,null,0,null,null,null,null,null,null,null,null,null,0,null,null,"SI","SLOVENIA"]
[null,"South Africa",136,null,null,null,0,null,null,null,null,null,null,null,null,null,0,null,null,"ZA","SOUTHAFRIC"]
[null,"South Sudan",137,null,null,null,0,null,null,null,null,null,null,null,null,null,0,null,null,"SS","SSUDAN"]
[null,"Spain",138,null,null,null,0,null,null,null,null,null,null,null,null,null,0,null,null,"ES","SPAIN"]
[null,"Sri Lanka",139,null,null,null,0,null,null,null,null,null,null,null,null,null,0,null,null,"LK","SRILANKA"]
[null,"Sudan",140,null,null,null,0,null,null,null,null,null,null,null,null,null,0,null,null,"SD","SUDAN"]
[null,"Sweden",141,null,null,null,0,null,null,null,null,null,null,null,null,null,0,null,null,"SE","SWEDEN"]
[null,"Switzerland",142,null,null,null,0,null,null,null,null,null,null,null,null,null,0,null,null,"CH","SWITLAND"]
[null,"Syrian Arab Republic",143,null,null,null,0,null,null,null,null,null,null,null,null,null,0,null,null,"SY","SYRIA"]
[null,"Taiwan / Chinese Taipei",144,null,null,null,0,null,null,null,null,null,null,null,null,null,0,null,null,"TW","TAIPEI"]
[null,"Tajikistan",145,null,null,null,0,null,null,null,null,null,null,null,null,null,0,null,null,"TJ","TAJIKISTAN"]
[null,"Tanzania, United Republic of",146,null,null,null,0,null,null,null,null,null,null,null,null,null,0,null,null,"TZ","TANZANIA"]
[null,"Thailand",147,null,null,null,0,null,null,null,null,null,null,null,null,null,0,null,null,"TH","THAILAND"]
[null,"Timor-Leste",148,null,null,null,0,null,null,null,null,null,null,null,null,null,0,null,null,"TL","TIMORLESTE"]
[null,"Togo",149,null,null,null,0,null,null,null,null,null,null,null,null,null,0,null,null,"TG","TOGO"]
[null,"Trinidad and Tobago",150,null,null,null,0,null,null,null,null,null,null,null,null,null,0,null,null,"TT","TRINIDAD"]
[null,"Tunisia",151,null,null,null,0,null,null,null,null,null,null,null,null,null,0,null,null,"TN","TUNISIA"]
[null,"Turkey",152,null,null,null,0,null,null,null,null,null,null,null,null,null,0,null,null,"TR","TURKEY"]
[null,"Turkmenistan",153,null,null,null,0,null,null,null,null,null,null,null,null,null,0,null,null,"TM","TURKMENIST"]
[null,"Uganda",154,null,null,null,0,null,null,null,null,null,null,null,null,null,0,null,null,"UG","UGANDA"]
[null,"Ukraine",155,null,null,null,0,null,null,null,null,null,null,null,null,null,0,null,null,"UA","UKRAINE"]
[null,"United Arab Emirates",156,null,null,null,0,null,null,null,null,null,null,null,null,null,0,null,null,"AE","UAE"]
[null,"United Kingdom",157,null,null,null,0,null,null,null,null,null,null,null,null,null,0,null,null,"GB","UK"]
[null,"United States",158,null,null,null,0,null,null,null,null,null,null,null,null,null,0,null,null,"US","USA"]
[null,"Uruguay",159,null,null,null,0,null,null,null,null,null,null,null,null,null,0,null,null,"UY","URUGUAY"]
[null,"Uzbekistan",160,null,null,null,0,null,null,null,null,null,null,null,null,null,0,null,null,"UZ","UZBEKISTAN"]
[null,"Venezuela, Bolivarian Republic",161,null,null,null,0,null,null,null,null,null,null,null,null,null,0,null,null,"VE","VENEZUELA"]
[null,"Viet Nam",162,null,null,null,{"$f":"SUM(D172:F172)","v":0},null,null,null,null,null,null,null,null,null,{"$f":"+H172+I172+J172+K172+M172+O172+P172","v":0},null,null,"VN","VIETNAM"]
[null,"Yemen",163,null,null,null,0,null,null,null,null,null,null,null,null,null,0,null,null,"YE","YEMEN"]
[null,"Not elsewhere specified",164,null,null,null,0,null,null,null,null,null,null,null,null,null,0,null,null,"Y3","NONSPEC"]
[null,"Total Exports",165,{"$f":"SUM(D11:D174)","v":0},{"$f":"SUM(E11:E174)","v":0},{"$f":"SUM(F11:F174)","v":0},{"$f":"SUM(D175:F175)","v":0},{"$f":"SUM(H11:H174)","v":0},0,0,0,0,0,0,0,0,{"$f":"+H175+I175+J175+K175+M175+O175+P175","v":0},null,null,"Y1","TOTEXPST"]
[]
[null,"Automatic Checks"]
[null,"Total sum Crude",null,{"$f":"IF(S178=0,\"OK\",\"The Total Exports figure does not equal the sum of its components for Total Crude.\")","v":"OK"},null,null,null,null,null,null,null,null,null,null,null,null,null,null,{"$f":"IF(AND(G175-SUM(G11:G174)=0,(G175-SUM(D175:F175)=0)),0,-1)","v":0}]
[null,"Total sum Products",null,{"$f":"IF(S179=0,\"OK\",\"The Total Exports figure does not equal the sum of its components for Total Products.\")","v":"OK"},null,null,null,null,null,null,null,null,null,null,null,null,null,null,{"$f":"IF(AND(Q175-SUM(Q11:Q174) = 0, (Q175-SUM(H175:K175,M175,O175,P175)=0)), 0, -1)","v":0}]
[null,"Exports of Crude Balance",null,{"$f":"IF(G175-QuE_Balance!G15=0,\"OK\",\"Total Exports do not equal Total Exports for Total Crude in Module 1 - Balance.\")","v":"OK"}]
[null,"Exports of Products Balance",null,{"$f":"IF(Q175-QuE_Balance!T15=0,\"OK\",\"Total Exports do not equal Total Exports for Total Products in Module 1 - Balance.\")","v":"OK"}]
[]
[]
[]
[]
[]
[]
[]
[]
[null,null,null,"CRUDEOIL","NGL","OTHTONE","CRNGFEED","LPG","NAPHTHA","GASOLINE","KEROSENE","JETKERO","GASDIES","DIESEL","RESFUEL","OTHTTWO","TOTPRODS"]

{"sheet":"QuE_Stocks","index":4,"n_rows":44,"n_cols":20,"rows_kept":44,"cut":false,"hidden":false,"merged":[[22,1,22,2],[2,1,2,2],[4,1,4,2],[11,1,11,2],[8,1,9,2]]}
[null,"STOCK LEVEL REPORT"]
[]
[2007.1,"Country:",null,{"$f":"CountryMessage","v":"(select your country on the 'Start' sheet)"}]
[]
[null,"Time period:",null,{"$f":"FirstMonth & \" \" & QuestYear","v":"MONTH ? 2022"},null,null,null,null,null,null,null,null,null,null,null,null,null,null,null,"BALANCE"]
[]
[null,"Crude, NGL and Other Stocks",null,null,null,null,null,"Product Closing stocks"]
[null,null,null,null,null,null,"Thousand Metric Tons",null,null,null,null,null,null,null,null,null,"Thousand Metric Tons"]
[null,null,null,null,null,null,null,"Petroleum Products"]
[null,null,null,"Crude Oil","NGL","Other","Total\n(1)+(2)+(3)","LPG","Naphtha","Gasoline","Total Kerosene","Of which: Jet\nKerosene","Gas/ Diesel Oil","Of which: Road Diesel","Fuel Oil","Other\nProducts","Total Products (5)+(6)+(7)+(8) +(10)+(12)+(13)"]
[null,null,null,"(1)","(2)","(3)","(4)","(5)","(6)","(7)","(8)","(9)","(10)","(11)","(12)","(13)","(14)"]
[null,"Closing stocks on National Territory",null,{"$f":"D13+D15+D16+D17","v":0},0,0,0,0,0,0,0,0,0,0,0,0,0,null,null,"CSNATTER"]
[null,null,"Industry",null,null,null,{"$f":"SUM(D13:F13)","v":0},null,null,null,null,null,null,null,null,null,{"$f":"H13+I13+J13+K13+M13+O13+P13","v":0},null,null,"CSIND"]
[null,null,"Of which: obligated industry stocks",null,null,null,{"$f":"SUM(D14:F14)","v":0},null,null,null,null,null,null,null,null,null,{"$f":"H14+I14+J14+K14+M14+O14+P14","v":0},null,null,"CSINDOBL"]
[null,null,"Agency",null,null,null,{"$f":"SUM(D15:F15)","v":0},null,null,null,null,null,null,null,null,null,{"$f":"H15+I15+J15+K15+M15+O15+P15","v":0},null,null,"CSHOLD"]
[null,null,"Government",null,null,null,{"$f":"SUM(D16:F16)","v":0},null,null,null,null,null,null,null,null,null,0,null,null,"CSGOVT"]
[null,null,"Closing stocks on National\n Territory with foreign claim",{"$f":"D18+D19+D20","v":0},{"$f":"E18+E19+E20","v":0},{"$f":"F18+F19+F20","v":0},{"$f":"G18+G19+G20","v":0},{"$f":"+H18+H19+H20","v":0},0,0,0,0,0,0,0,0,0,null,null,"CSOTHBF"]
[null,null,"Industry",null,null,null,{"$f":"SUM(D18:F18)","v":0},null,null,null,null,null,null,null,null,null,0,null,null,"CSOTHBFI"]
[null,null,"Agency",null,null,null,{"$f":"SUM(D19:F19)","v":0},null,null,null,null,null,null,null,null,null,0,null,null,"CSOTHBFA"]
[null,null,"Government",null,null,null,{"$f":"SUM(D20:F20)","v":0},null,null,null,null,null,null,null,null,null,0,null,null,"CSOTHBFG"]
[]
[]
[null,"Stocks held abroad",null,{"$f":"D24+D26+D27","v":0},0,0,0,0,0,0,0,0,0,0,0,0,0,null,null,"CSABRBF"]
[null,null,"Industry",null,null,null,{"$f":"SUM(D24:F24)","v":0},null,null,null,null,null,null,null,null,null,{"$f":"H24+I24+J24+K24+M24+O24+P24","v":0},null,null,"CSABRBFI"]
[null,null,"Of which: obligated industry stocks",null,null,null,{"$f":"SUM(D25:F25)","v":0},null,null,null,null,null,null,null,null,null,{"$f":"H25+I25+J25+K25+M25+O25+P25","v":0},null,null,"CSABRBFIOB"]
[null,null,"Agency",null,null,null,{"$f":"SUM(D26:F26)","v":0},null,null,null,null,null,null,null,null,null,{"$f":"H26+I26+J26+K26+M26+O26+P26","v":0},null,null,"CSABRBFA"]
[null,null,"Government",null,null,null,{"$f":"SUM(D27:F27)","v":0},null,null,null,null,null,null,null,null,null,{"$f":"H27+I27+J27+K27+M27+O27+P27","v":0},null,null,"CSABRBFG"]
[]
[null,null,"Automatic Checks: Crude, NGL, Feedstocks",null,null,null,null,"Automatic Checks: Petroleum Products"]
[null,null,"Total sum",{"$f":"IF(OR(G12<>SUM(D12:F12),G13<>SUM(D13:F13),G15<>SUM(D15:F15),G16<>SUM(D16:F16),G17<>SUM(D17:F17),G18<>SUM(D18:F18),G19<>SUM(D19:F19),G20<>SUM(D20:F20),G23<>SUM(D23:F23),G24<>SUM(D24:F24),G26<>SUM(D26:F26),G27<>SUM(D27:F27)),\"Total not equal to the sum of the elements\",\"OK\")","v":"OK"},null,null,null,"Total Products sum ",null,null,{"$f":"IF(OR(Q12<>SUM(H12:K12)+M12+O12+P12,Q13<>SUM(H13:K13)+M13+O13+P13,Q15<>SUM(H15:K15)+M15+O15+P15,Q16<>SUM(H16:K16)+M16+O16+P16,Q17<>SUM(H17:K17)+M17+O17+P17,Q18<>SUM(H18:K18)+M18+O18+P18,Q19<>SUM(H19:K19)+M19+O19+P19,Q20<>SUM(H20:K20)+M20+O20+P20,Q23<>SUM(H23:K23)+M23+O23+P23,Q24<>SUM(H24:K24)+M24+O24+P24,Q26<>SUM(H26:K26)+M26+O26+P26,Q27<>SUM(H27:K27)+M27+O27+P27),\"Total Products column not equal to the sum of the elements\",\"OK\")","v":"OK"}]
[null,null,null,null,null,null,null,"Jet Kerosene",null,null,{"$f":"IF(OR(L12>K12,L13>K13,L15>K15,L16>K16,L17>K17,L18>K18,L19>K19,L20>K20,L23>K23,L24>K24,L26>K26,L27>K27),\"Jet Kerosene should be smaller than Total Kerosene\",\"OK\")","v":"OK"}]
[null,null,null,null,null,null,null,"Transport Diesel",null,null,{"$f":"IF(OR(N12>M12,N13>M13,N15>M15,N16>M16,N17>M17,N18>M18,N19>M19,N20>M20,N23>M23,N24>M24,N26>M26,N27>M27),\"Transport Diesel should be smaller than Gas/Diesel Oil\",\"OK\")","v":"OK"}]
[]
[null,null,"Automatic Checks for:"]
[null,null,"Closing stocks on National Territory",null,{"$f":"IF(OR(SUM(D13,D15:D17)<>D12,SUM(E13,E15:E17)<>E12,SUM(F13,F15:F17)<>F12,SUM(G13,G15:G17)<>G12,SUM(H13,H15:H17)<>H12,SUM(I13,I15:I17)<>I12,SUM(J13,J15:J17)<>J12,SUM(K13,K15:K17)<>K12,SUM(L13,L15:L17)<>L12,SUM(M13,M15:M17)<>M12,SUM(N13,N15:N17)<>N12,SUM(O13,O15:O17)<>O12,SUM(P13,P15:P17)<>P12,SUM(Q13,Q15:Q17)<>Q12),\"Closing stocks on National Territory are not equal to the sum of Industry, Agency and Government stocks\",\"OK\")","v":"OK"}]
[null,null,"Closing stocks with foreign claim",null,{"$f":"IF(OR(SUM(D18:D20)<>D17,SUM(E18:E20)<>E17,SUM(F18:F20)<>F17,SUM(G18:G20)<>G17,SUM(H18:H20)<>H17,SUM(I18:I20)<>I17,SUM(J18:J20)<>J17,SUM(K18:K20)<>K17,SUM(L18:L20)<>L17,SUM(M18:M20)<>M17,SUM(N18:N20)<>N17,SUM(O18:O20)<>O17,SUM(P18:P20)<>P17,SUM(Q18:Q20)<>Q17),\"Closing stocks on National Territory with foreign claim are not equal to the sum of Industry, Agency and Government stocks\",\"OK\")","v":"OK"}]
[null,null,"Stocks held abroad",null,{"$f":"IF(OR(SUM(D24,D26:D27)<>D23,SUM(E24,E26:E27)<>E23,SUM(F24,F26:F27)<>F23,SUM(G24,G26:G27)<>G23,SUM(H24,H26:H27)<>H23,SUM(I24,I26:I27)<>I23,SUM(J24,J26:J27)<>J23,SUM(K24,K26:K27)<>K23,SUM(L24,L26:L27)<>L23,SUM(M24,M26:M27)<>M23,SUM(N24,N26:N27)<>N23,SUM(O24,O26:O27)<>O23,SUM(P24,P26:P27)<>P23,SUM(Q24,Q26:Q27)<>Q23),\"Stocks held abroad are not equal to the sum of Industry, Agency and Government stocks\",\"OK\")","v":"OK"}]
[]
[]
[]
[]
[]
[]
[null,null,null,"CRUDEOIL","NGL","OTHTONE","CRNGFEED","LPG","NAPHTHA","GASOLINE","KEROSENE","JETKERO","GASDIES","DIESEL","RESFUEL","OTHTTWO","TOTPRODS"]

{"sheet":"MOS_Table_1","index":5,"n_rows":130,"n_cols":45,"rows_kept":130,"cut":false,"hidden":true,"merged":[[10,11,11,11],[10,3,11,3],[10,4,11,4],[10,5,11,5],[10,6,11,6],[10,8,11,8],[10,9,11,9]]}
["MONTHLY OIL AND GAS QUESTIONNAIRE",null,null,null,null,null,null,null,null,2007.2]
[2012,"Country",null,{"$f":"CountryUser","v":"(select country)"},null,null,null,null,null,null,null,null,"Provisional"]
[null,"Month of data",null,{"$f":"FirstMonth & \" \" & QuestYear","v":"MONTH ? 2022"},null,"ALL DATA SHOULD BE ENTERED"]
[null,"Status of data (final/provisional)",null,null,null,"IN THOUSAND METRIC TONS"]
[null,"Prepared by",null,null,null,"WITH NO DECIMAL PLACE"]
[null,"Date of transmisssion"]
[null,null,null,null,null,null,null,null,null,null,null,null,null,null,null,null,null,null,null,null,null,null,null,null,null,null,null,null,null,null,null,null,null,null,null,null,null,null,null,null,null,null,null,null,"Datatype"]
["Table 1: SUPPLY OF CRUDE OIL, NGL, REFINERY FEEDSTOCKS, ADDITIVES AND OTHER HYDROCARBONS",null,null,null,null,null,null,null,null,null,null,null,null,null,null,null,null,null,null,null,null,null,null,null,null,null,null,null,null,null,null,null,null,null,null,null,null,null,null,null,null,null,null,null,"BALANCE"]
[]
[null,null,null,null,null,null,null,null,null,"Unit:  Thousand Metric Tons"]
[null,null,null,"Crude Oil","NGL","Refinery Feedstocks","Additives Oxygenates",null,"Other Hydrocarbons","Total",null,"Checks"]
[null,null,null,null,null,null,null,"Of which Biofuels"]
[null,null,null,"A","B","C","D","E","F","G",null,"H",null,null,null,null,null,null,null,null,null,null,null,null,null,null,null,null,null,null,null,null,null,null,null,null,null,null,null,null,null,null,null,null,"Item1 ê"]
["+","Indigenous production",1,null,null,null,null,null,null,{"$f":"SUM(D14:G14,I14)","v":0},null,{"$f":"IF(J14-SUM(G14,I14,D14:E14)=0,\"\",\"Total is not equal to the sum of each product\")","v":""},null,null,null,null,null,null,null,null,null,null,null,null,null,null,null,null,null,null,null,null,null,null,null,null,null,null,null,null,null,null,null,null,"INDPROD"]
["+","Receipts from other sources",2,null,null,null,null,null,null,0,null,{"$f":"IF(J15-SUM(G15,I15)=0,\"\",\"Total is not equal to the sum of each product\")","v":""},null,null,null,null,null,null,null,null,null,null,null,null,null,null,null,null,null,null,null,null,null,null,null,null,null,null,null,null,null,null,null,null,"OSOURCES"]
["+","Backflows1",3,null,null,null,null,null,null,0,null,{"$f":"IF(J16-SUM(F16)=0,\"\",\"Total is not equal to the sum of each product\")","v":""},null,null,null,null,null,null,null,null,null,null,null,null,null,null,null,null,null,null,null,null,null,null,null,null,null,null,null,null,null,null,null,null,"BACKFLOW"]
["+","Products transferred2",4,null,null,null,null,null,null,0,null,{"$f":"IF(J17-SUM(F17)=0,\"\",\"Total is not equal to the sum of each product\")","v":""},null,null,null,null,null,null,null,null,null,null,null,null,null,null,null,null,null,null,null,null,null,null,null,null,null,null,null,null,null,null,null,null,"PTRANSF"]
["+","Imports (Balance)3",5,null,null,null,null,null,null,0,null,{"$f":"IF(J18-SUM(D18:G18,I18)=0,\"\",\"Total is not equal to the sum of each product\")","v":""},null,null,null,null,null,null,null,null,null,null,null,null,null,null,null,null,null,null,null,null,null,null,null,null,null,null,null,null,null,null,null,null,"TOTIMPSB"]
["-","Exports (Balance)4",6,null,null,null,null,null,null,0,null,"",null,null,null,null,null,null,null,null,null,null,null,null,null,null,null,null,null,null,null,null,null,null,null,null,null,null,null,null,null,null,null,null,"TOTEXPSB"]
["-","Direct use5",7,null,null,null,null,null,null,0,null,"",null,null,null,null,null,null,null,null,null,null,null,null,null,null,null,null,null,null,null,null,null,null,null,null,null,null,null,null,null,null,null,null,"DIRECUSE"]
["-","Stock changes6",8,null,null,null,null,null,null,0,null,"",null,null,null,null,null,null,null,null,null,null,null,null,null,null,null,null,null,null,null,null,null,null,null,null,null,null,null,null,null,null,null,null,"STCHANAT"]
["=","Refinery intake (Calculated)",9,{"$f":"D14+D15+D16+D17+D18-D19-D20-D21","v":0},0,0,0,0,0,0,null,"",null,null,null,null,null,null,null,null,null,null,null,null,null,null,null,null,null,null,null,null,null,null,null,null,null,null,null,null,null,null,null,null,"REFINCAL"]
["-","Statistical difference",10,{"$f":"D22-D24","v":0},0,0,0,0,0,0,null,"",null,null,null,null,null,null,null,null,null,null,null,null,null,null,null,null,null,null,null,null,null,null,null,null,null,null,null,null,null,null,null,null,"STATDIFF"]
["=","Refinery intake (Observed)",11,null,null,null,null,null,null,0,null,"",null,null,null,null,null,null,null,null,null,null,null,null,null,null,null,null,null,null,null,null,null,null,null,null,null,null,null,null,null,null,null,null,"REFINOBS"]
[null,"Memo Item:       Refinery losses",12,null,null,null,null,null,null,0,null,"",null,null,null,null,null,null,null,null,null,null,null,null,null,null,null,null,null,null,null,null,null,null,null,null,null,null,null,null,null,null,null,null,"REFLOSS"]
[null,null,null,{"$f":"IF(MIN(D14,D18:D20,D24)<0,\"Negative number\",\"\")","v":""},{"$f":"IF(MIN(E14,E18:E20,E24)<0,\"Negative number\",\"\")","v":""},{"$f":"IF(MIN(F16:F20,F24)<0,\"Negative number\",\"\")","v":""},{"$f":"IF(MIN(G14:G15,G18:G20,G24:G24)<0,\"Negative number\",\"\")","v":""},{"$f":"IF(MIN(H14:H15,H18:H20,H24:H24)<0,\"Negative number\",\"\")","v":""},{"$f":"IF(MIN(I14:I15,I18:I20,I24)<0,\"Negative number\",\"\")","v":""},{"$f":"IF(MIN(J14:J20,J24)<0,\"Negative number\",\"\")","v":""}]
[null,null,null,null,null,null,null,{"$f":"IF(OR(H14>G14,H15>G15,H18>G18,H19>G19,H20>G20,H24>G24,H25>G25),\"Error: Of which Biofuels greater than Additives / Oxygenates\",\"\")","v":""}]
[1,"Total of Backflows (reference G3) should correspond to Total products of Backflows to refineries in Table 2 (reference Z19).",null,null,null,null,null,{"$f":"J16-MOS_Table_2!AC26","v":0},{"$f":"IF(H28=0,\"OK\",\"Total of Backflows not equal to Backflows to refineries of Total products in Table 2\")","v":"OK"}]
[2,"Total of Products transferred (reference G4) should correspond to Total products of Products transferred in Table 2 (reference Z9).",null,null,null,null,null,{"$f":"J17-MOS_Table_2!AC16","v":0},{"$f":"IF(H29=0,\"OK\",\"Total of Products transferred not equal to Total products of Products transferred in Table 2\")","v":"OK"}]
[3,"Imports (Balance) should correspond to Total imports for these products in Table 3 (references A105 to F105).",null,null,null,null,null,{"$f":"J18-MOS_Table_3!H172","v":0},{"$f":"IF(H30=0,\"OK\",\"Total Imports (Balance) do not equal Total Imports in Table 3\")","v":"OK"}]
[4,"Exports (Balance) should correspond to Total exports for these products in Table 4 (references A96 to F96).",null,null,null,null,null,{"$f":"J19-MOS_Table_4!H172","v":0},{"$f":"IF(H31=0,\"OK\",\"Total Exports do not equal Total Exports in Table 4\")","v":"OK"}]
[5,"Direct use should be carried over to Primary product receipts in Table 2 (line 1).",null,null,null,null,null,{"$f":"J20-MOS_Table_2!AC8","v":0},{"$f":"IF(H32=0,\"OK\",\"Total Direct use figure does not equal Total products of Primary product receipts in Table 2\")","v":"OK"}]
[6,"Stock changes should correspond to Closing level minus Opening level of Stocks on national territory, Table 5 (line 2 minus line 1).",null,null,null,null,null,{"$f":"J21-(MOS_Table_5!J9-MOS_Table_5!J8)","v":0},{"$f":"IF(H33=0,\"OK\",\"Stock changes not equal to Closing minus Opening levels on National territory, Table 5\")","v":"OK"}]
[]
[]
[]
[]
[]
[]
[]
[]
[]
[]
[]
[]
[]
[]
[]
[]
[]
[]
[]
[]
[]
[]
[]
[]
[]
[]
[]
[]
[]
[]
[]
[]
[]
[]
[]
[]
[]
[]
[]
[]
[]
[]
[]
[]
[]
[]
[]
[]
[]
[]
[]
[]
[]
[]
[]
[]
[]
[]
[]
[]
[]
[]
[]
[]
[]
[]
[]
[]
[]
[]
[]
[]
[]
[]
[]
[]
[]
[]
[]
[]
[]
[]
[]
[]
[]
[]
[]
[]
[]
[]
[]
[]
[]
[]
[]
[]
[null,"Products è",null,"CRUDEOIL","NGL","REFFEEDS","ADDITIVE","BIOFUELS","NONCRUDE","CRNGFEED"]

{"sheet":"MOS_Table_2","index":6,"n_rows":130,"n_cols":45,"rows_kept":130,"cut":false,"hidden":true,"merged":[[29,24,29,26],[30,18,30,20],[30,22,30,23],[30,25,30,27],[28,11,28,12],[28,16,28,17],[29,10,29,11],[29,15,29,16],[29,19,29,20],[29,21,29,22],[4,23,5,23],[4,26,5,26],[4,27,5,27],[4,28,5,28],[4,30,5,30],[4,20,5,20],[4,3,5,3],[4,4,5,4],[4,5,5,5],[4,6,5,6],[4,7,5,7],[4,8,5,8],[4,9,5,9],[4,12,5,12],[4,13,5,13],[4,14,5,14],[4,17,5,17]]}
["MONTHLY OIL AND GAS QUESTIONNAIRE",null,null,null,null,null,null,null,null,null,null,null,null,null,null,null,null,null,null,null,null,null,null,null,null,null,null,null,null,null,null,null,null,null,null,null,null,null,null,null,null,null,null,null,"Datatype"]
[null,{"$f":"CountryMessage","v":"(select your country on the 'Start' sheet)"},null,null,null,null,null,null,null,null,null,null,null,null,null,null,null,null,null,null,null,null,null,null,null,null,null,null,null,null,null,null,null,null,null,null,null,null,null,null,null,null,null,null,"BALANCE"]
[null,{"$f":"FirstMonth & \" \" & QuestYear","v":"MONTH ? 2022"}]
["Table 2: SUPPLY OF FINISHED PRODUCTS",null,null,null,null,null,null,null,null,null,null,null,null,null,null,null,null,null,null,null,null,null,null,null,null,null,null,null,"Unit:  Thousand Metric Tons"]
[null,null,null,"Crude\noil","Natural\ngas\nliquids","Refinery\ngas","Ethane","LPG","Naphtha","Total motor\ngasoline",null,null,"Aviation\ngasoline","Gasoline\ntype\njet fuel","Total\nkerosene\ntype\njet fuel",null,null,"Other\nkerosene",null,null,"Total\ngas/diesel\noil",null,null,"Total \nfuel oil",null,null,"Petroleum coke","Other products","Total products",null,"Probate"]
[null,null,null,null,null,null,null,null,null,null,"Biogasoline","Non-biogasoline",null,null,null,"Bio jet\nkerosene","Non-bio jet\nkerosene",null,"Road diesel","Heating and\nother gas oil",null,"Biodiesels","Non-bio\ngas/diesel\noil",null,"Fuel oil-\nlow sulphur \n(<1%)","Fuel oil-\nhigh sulphur\n (>=1%)"]
[null,null,null,"A","B","C","D","E","F","G","H","I","J","K","L","M","N","O","P","Q","R","S","T","U","V","W","X","Y","Z",null,"AA",null,null,null,null,null,null,null,null,null,null,null,null,null,"Item1 ê"]
["+","Primary product receipts1",1,null,null,null,null,null,null,null,null,null,null,null,null,null,null,null,null,null,null,null,null,null,null,null,null,null,{"$f":"SUM(D8:J8,M8:O8,R8,U8,X8,AA8:AB8)","v":0},null,{"$f":"IF(AC8-SUM(D8:J8,M8:O8,R8,U8,X8,AA8:AB8)=0,\"\",\"Total products is not equal to the sum of products\")","v":""},null,null,null,null,null,null,null,null,null,null,null,null,null,"PPRECPTS"]
["+","Refinery gross output",2,null,null,null,null,null,null,null,null,null,null,null,null,null,null,null,null,null,null,null,null,null,null,null,null,null,{"$f":"SUM(F9:J9,M9:O9,R9,U9,X9,AA9:AB9)","v":0},null,{"$f":"IF(AC9-SUM(F9:J9,M9:O9,R9,U9,X9,AA9:AB9)=0,\"\",\"Total products is not equal to the sum of products\")","v":""},null,null,null,null,null,null,null,null,null,null,null,null,null,"REFGROUT"]
["+","Recycled products",3,null,null,null,null,null,null,null,null,null,null,null,null,null,null,null,null,null,null,null,null,null,null,null,null,null,{"$f":"SUM(F10:J10,M10:O10,R10,U10,X10,AA10:AB10)","v":0},null,{"$f":"IF(AC10-SUM(F10:J10,M10:O10,R10,U10,X10,AA10:AB10)=0,\"\",\"Total products is not equal to the sum of products\")","v":""},null,null,null,null,null,null,null,null,null,null,null,null,null,"RECYCLED"]
["-","Refinery fuel",4,null,null,null,null,null,null,null,null,null,null,null,null,null,null,null,null,null,null,null,null,null,null,null,null,null,{"$f":"SUM(F11:J11,M11:O11,R11,U11,X11,AA11:AB11)","v":0},null,{"$f":"IF(AC11-SUM(F11:J11,M11:O11,R11,U11,X11,AA11:AB11)=0,\"\",\"Total products is not equal to the sum of products\")","v":""},null,null,null,null,null,null,null,null,null,null,null,null,null,"REFFUEL"]
["+","Imports (Balance)2",5,null,null,null,null,null,null,null,null,null,null,null,null,null,null,null,null,null,null,null,null,null,null,null,null,null,{"$f":"SUM(G12:J12,M12:O12,R12,U12,X12,AA12:AB12)","v":0},null,{"$f":"IF(AC12-SUM(G12:J12,M12:O12,R12,U12,X12,AA12:AB12)=0,\"\",\"Total products is not equal to the sum of products\")","v":""},null,null,null,null,null,null,null,null,null,null,null,null,null,"TOTIMPSB"]
["-","Exports (Balance)3",6,null,null,null,null,null,null,null,null,null,null,null,null,null,null,null,null,null,null,null,null,null,null,null,null,null,{"$f":"SUM(G13:J13,M13:O13,R13,U13,X13,AA13:AB13)","v":0},null,{"$f":"IF(AC13-SUM(G13:J13,M13:O13,R13,U13,X13,AA13:AB13)=0,\"\",\"Total products is not equal to the sum of products\")","v":""},null,null,null,null,null,null,null,null,null,null,null,null,null,"TOTEXPSB"]
["-","International marine bunkers",7,null,null,null,null,null,null,null,null,null,null,null,null,null,null,null,null,null,null,null,null,null,null,null,null,null,{"$f":"SUM(F14:J14,M14:O14,R14,U14,X14,AA14:AB14)","v":0},null,{"$f":"IF(AC14-SUM(F14:J14,M14:O14,R14,U14,X14,AA14:AB14)=0,\"\",\"Total products is not equal to the sum of products\")","v":""},null,null,null,null,null,null,null,null,null,null,null,null,null,"BUNKERS"]
["+","Interproduct transfers4",8,null,null,null,null,null,null,null,null,null,null,null,null,null,null,null,null,null,null,null,null,null,null,null,null,null,{"$f":"SUM(D15:J15,M15:O15,R15,U15,X15,AA15:AB15)","v":0},null,{"$f":"IF(AC15-SUM(D15:J15,M15:O15,R15,U15,X15,AA15:AB15)=0,\"\",\"Total products is not equal to the sum of products\")","v":""},null,null,null,null,null,null,null,null,null,null,null,null,null,"IPTRANSF"]
["-","Products transferred5",9,null,null,null,null,null,null,null,null,null,null,null,null,null,null,null,null,null,null,null,null,null,null,null,null,null,{"$f":"SUM(F16:J16,M16:O16,R16,U16,X16,AA16:AB16)","v":0},null,{"$f":"IF(AC16-SUM(F16:J16,M16:O16,R16,U16,X16,AA16:AB16)=0,\"\",\"Total products is not equal to the sum of products\")","v":""},null,null,null,null,null,null,null,null,null,null,null,null,null,"PTRANSF"]
["-","Stock changes6",10,null,null,null,null,null,null,null,null,null,null,null,null,null,null,null,null,null,null,null,null,null,null,null,null,null,{"$f":"SUM(G17:J17,M17:O17,R17,U17,X17,AA17:AB17)","v":0},null,{"$f":"IF(AC17-SUM(G17:J17,M17:O17,R17,U17,X17,AA17:AB17)=0,\"\",\"Total products is not equal to the sum of products\")","v":""},null,null,null,null,null,null,null,null,null,null,null,null,null,"STCHANAT"]
["=","Gross inland deliveries (Calculated)",11,{"$f":"D8+D15","v":0},{"$f":"E8+E15","v":0},{"$f":"F8+F9+F10-F11-F14+F15-F16","v":0},{"$f":"G8+G9+G10-G11+G12-G13-G14+G15-G16-G17","v":0},0,0,0,0,0,0,0,0,{"$f":"P8+P9+P10-P11+P12-P13-P14+P15-P16-P17","v":0},{"$f":"Q8+Q9+Q10-Q11+Q12-Q13-Q14+Q15-Q16-Q17","v":0},0,{"$f":"S8+S9+S10-S11+S12-S13-S14+S15-S16-S17","v":0},{"$f":"T8+T9+T10-T11+T12-T13-T14+T15-T16-T17","v":0},{"$f":"U8+U9+U10-U11+U12-U13-U14+U15-U16-U17","v":0},{"$f":"V8+V9+V10-V11+V12-V13-V14+V15-V16-V17","v":0},0,0,0,0,{"$f":"AA8+AA9+AA10-AA11+AA12-AA13-AA14+AA15-AA16-AA17","v":0},{"$f":"AB8+AB9+AB10-AB11+AB12-AB13-AB14+AB15-AB16-AB17","v":0},{"$f":"SUM(D18:J18,M18:O18,R18,U18,X18,AA18:AB18)","v":0},null,{"$f":"IF(AC18-SUM(D18:J18,M18:O18,R18,U18,X18,AA18:AB18)=0,\"\",\"Total products is not equal to the sum of products\")","v":""},null,null,null,null,null,null,null,null,null,null,null,null,null,"GDINCTRC"]
["-","Statistical difference",12,{"$f":"D18-D20","v":0},{"$f":"E18-E20","v":0},0,0,0,0,0,0,0,0,0,0,{"$f":"P18-P20","v":0},{"$f":"Q18-Q20","v":0},0,{"$f":"S18-S20","v":0},{"$f":"T18-T20","v":0},{"$f":"U18-U20","v":0},{"$f":"V18-V20","v":0},0,0,0,0,{"$f":"AA18-AA20","v":0},{"$f":"AB18-AB20","v":0},{"$f":"SUM(D19:J19,M19:O19,R19,U19,X19,AA19:AB19)","v":0},null,{"$f":"IF(AC19-SUM(D19:J19,M19:O19,R19,U19,X19,AA19:AB19)=0,\"\",\"Total products is not equal to the sum of products\")","v":""},null,null,null,null,null,null,null,null,null,null,null,null,null,"STATDIFF"]
["=","Gross inland deliveries (Observed)",13,null,null,null,null,null,null,null,null,null,null,null,null,null,null,null,null,null,null,null,null,null,null,null,null,null,{"$f":"SUM(D20:J20,M20:O20,R20,U20,X20,AA20:AB20)","v":0},null,{"$f":"IF(AC20-SUM(D20:J20,M20:O20,R20,U20,X20,AA20:AB20)=0,\"\",\"Total products is not equal to the sum of products\")","v":""},null,null,null,null,null,null,null,null,null,null,null,null,null,"GDINCTRO"]
[null,"Memo Items:7                    Deliveries to international aviation",14,null,null,null,null,null,null,null,null,null,null,null,null,null,null,null,null,null,null,null,null,null,null,null,null,null,{"$f":"SUM(M21:O21)","v":0},null,{"$f":"IF(AC21-SUM(M21:O21)=0,\"\",\"There is an error in this line\")","v":""},null,null,null,null,null,null,null,null,null,null,null,null,null,"INTLCIAV"]
[null,"Deliveries to main activity producer power plants",15,null,null,null,null,null,null,null,null,null,null,null,null,null,null,null,null,null,null,null,null,null,null,null,null,null,{"$f":"SUM(D22:J22,M22:O22,R22,U22,X22,AA22:AB22)","v":0},null,{"$f":"IF(AC22-SUM(D22:J22,M22:O22,R22,U22,X22,AA22:AB22)=0,\"\",\"Total products is not equal to the sum of products\")","v":""},null,null,null,null,null,null,null,null,null,null,null,null,null,"PUBELEC"]
[null,"Deliveries of automotive LPG",16,null,null,null,null,null,null,null,null,null,null,null,null,null,null,null,null,null,null,null,null,null,null,null,null,null,{"$f":"H23","v":0},null,{"$f":"IF(AC23-H23=0,\"\",\"Total products is not equal to deliveries of Automotive LPG reported\")","v":""},null,null,null,null,null,null,null,null,null,null,null,null,null,"AUDILPG"]
[null,"Deliveries of rail and marine diesel",17,null,null,null,null,null,null,null,null,null,null,null,null,null,null,null,null,null,null,null,null,null,null,null,null,null,{"$f":"U24","v":0},null,{"$f":"IF(AC24-U24=0,\"\",\"Total products is not equal to Deliveries of rail and marine diesel of Total gas/diesel oil\")","v":""},null,null,null,null,null,null,null,null,null,null,null,null,null,"ERAILMAR"]
[null,"Gross deliveries to the petrochemical industry8",18,null,null,null,null,null,null,null,null,null,null,null,null,null,null,null,null,null,null,null,null,null,null,null,null,null,{"$f":"SUM(D25:J25,M25:O25,R25,U25,X25,AA25:AB25)","v":0},null,{"$f":"IF(AC25-SUM(D25:J25,M25:O25,R25,U25,X25,AA25:AB25)=0,\"\",\"Total products is not equal to the sum of products\")","v":""},null,null,null,null,null,null,null,null,null,null,null,null,null,"GDPETCH"]
[null,"Backflows to refineries9",19,null,null,null,null,null,null,null,null,null,null,null,null,null,null,null,null,null,null,null,null,null,null,null,null,null,{"$f":"SUM(F26:J26,M26:O26,R26,U26,X26,AA26:AB26)","v":0},null,{"$f":"IF(AC26-SUM(F26:J26,M26:O26,R26,U26,X26,AA26:AB26)=0,\"\",\"Total products is not equal to the sum of products\")","v":""},null,null,null,null,null,null,null,null,null,null,null,null,null,"BACKFLOW"]
[null,"Net deliveries of Total products",20,null,null,null,null,null,null,null,null,null,null,null,null,null,null,null,null,null,null,null,null,null,null,null,null,null,{"$f":"AC20-AC26","v":0},null,null,null,null,null,null,null,null,null,null,null,null,null,null,null,"NETDELIC"]
[null,null,null,{"$f":"IF(MIN(D8,D18,D20,D22,D25)<0,\"Negative number\",\"\")","v":""},{"$f":"IF(MIN(E8,E18,E20,E22,E25)<0,\"Negative number\",\"\")","v":""},{"$f":"IF(MIN(F8:F11,F14,F16,F18,F20,F22,F25,F26)<0,\"Negative number\",\"\")","v":""},{"$f":"IF(MIN(G8:G14,G16,G18,G20,G22,G25,G26)<0,\"Negative number\",\"\")","v":""},{"$f":"IF(MIN(H8:H14,H16,H18,H20,H22,H23,H25,H26)<0,\"Negative number\",\"\")","v":""},{"$f":"IF(MIN(I8:I14,I16,I18,I20,I22,I25,I26)<0,\"Negative number\",\"\")","v":""},{"$f":"IF(MIN(J8:J14,J16,J18,J20,J22,J25,J26)<0,\"Negative number\",\"\")","v":""},{"$f":"IF(MIN(K8:K14,K16,K18,K20,K22,K25,K26)<0,\"Negative number\",\"\")","v":""},{"$f":"IF(MIN(L8:L14,L16,L18,L20,L22,L25,L26)<0,\"Negative number\",\"\")","v":""},{"$f":"IF(MIN(M8:M14,M16,M18,M20,M21,M22,M25,M26)<0,\"Negative number\",\"\")","v":""},{"$f":"IF(MIN(N8:N14,N16,N18,N20,N21,N22,N25,N26)<0,\"Negative number\",\"\")","v":""},{"$f":"IF(MIN(O8:O14,O16,O18,O20,O21,O22,O25,O26)<0,\"Negative number\",\"\")","v":""},{"$f":"IF(MIN(P8:P14,P16,P18,P20,P21,P22,P25,P26)<0,\"Negative number\",\"\")","v":""},{"$f":"IF(MIN(Q8:Q14,Q16,Q18,Q20,Q21,Q22,Q25,Q26)<0,\"Negative number\",\"\")","v":""},{"$f":"IF(MIN(R8:R14,R16,R18,R20,R22,R25,R26)<0,\"Negative number\",\"\")","v":""},{"$f":"IF(MIN(S8:S14,S16,S18,S20,S22,S25,S26)<0,\"Negative number\",\"\")","v":""},{"$f":"IF(MIN(T8:T14,T16,T18,T20,T22,T25,T26)<0,\"Negative number\",\"\")","v":""},{"$f":"IF(MIN(U8:U14,U16,U18,U20,U22,U24,U25,U26)<0,\"Negative number\",\"\")","v":""},{"$f":"IF(MIN(V8:V14,V16,V18,V20,V22,V24,V25,V26)<0,\"Negative number\",\"\")","v":""},{"$f":"IF(MIN(W8:W14,W16,W18,W20,W22,W24,W25,W26)<0,\"Negative number\",\"\")","v":""},{"$f":"IF(MIN(X8:X14,X16,X18,X20,X22,X25,X26)<0,\"Negative number\",\"\")","v":""},{"$f":"IF(MIN(Y8:Y14,Y16,Y18,Y20,Y22,Y25,Y26)<0,\"Negative number\",\"\")","v":""},{"$f":"IF(MIN(Z8:Z14,Z16,Z18,Z20,Z22,Z25,Z26)<0,\"Negative number\",\"\")","v":""},{"$f":"IF(MIN(AA8:AA14,AA16,AA18,AA20,AA22,AA25,AA26)<0,\"Negative number\",\"\")","v":""},{"$f":"IF(MIN(AB8:AB14,AB16,AB18,AB20,AB22,AB25,AB26)<0,\"Negative number\",\"\")","v":""},{"$f":"IF(MIN(AC8:AC14,AC16,AC18,AC20,AC21:AC27)<0,\"Negative number\",\"\")","v":""}]
[null,null,null,null,null,null,null,null,null,null,null,{"$f":"IF(OR(L8>J8,L9>J9,L10>J10,L11>J11,L12>J12,L13>J13,L14>J14,L16>J16,L18>J18,L20>J20,L22>J22,L25>J25,L26>J26),\"Error: Non-biogasoline\nis greater than Total.\",\"\")","v":""},null,null,null,null,{"$f":"IF(OR(Q8>O8,Q9>O9,Q10>O10,Q11>O11,Q12>O12,Q13>O13,Q14>O14,Q16>O16,Q18>O18,Q20>O20,Q22>O22,Q25>O25,Q26>O26),\"Error: Non-biogasoline\nis greater than Total.\",\"\")","v":""},null,null,null,{"$f":"IF(OR(U8<>S8+T8,U9<>S9+T9,U10<>S10+T10,U11<>S11+T11,U12<>S12+T12,U13<>S13+T13,U14<>S14+T14,U16<>S16+T16,U18<>S18+T18,U20<>S20+T20,U22<>S22+T22,T24<>U24,U25<>S25+T25,U26<>S26+T26),\"Error: Sum not equal Total.\",\"\")","v":""},null,null,{"$f":"IF(OR(X8<>Y8+Z8,X9<>Y9+Z9,X10<>Y10+Z10,X11<>Y11+Z11,X12<>Y12+Z12,X13<>Y13+Z13,X14<>Y14+Z14,X16<>Y16+Z16,X18<>Y18+Z18,X20<>Y20+Z20,X22<>Y22+Z22,X25<>Y25+Z25,X26<>Y26+Z26),\"Error: Sum not equal Total.\",\"\")","v":""}]
[null,null,null,null,null,null,null,null,null,null,{"$f":"IF(OR(K8>J8,K9>J9,K10>J10,K11>J11,K12>J12,K13>J13,K14>J14,K16>J16,K18>J18,K20>J20,K22>J22,K25>J25,K26>J26),\"Error: Biogasoline\nis greater than Total.\",\"\")","v":""},null,null,null,null,{"$f":"IF(OR(P8>O8,P9>O9,P10>O10,P11>O11,P12>O12,P13>O13,P14>O14,P16>O16,P18>O18,P20>O20,P21>O21,P22>O22,P25>O25,P26>O26),\"Error: Bjo jet kerosene\nis greater than Total.\",\"\")","v":""},null,null,null,{"$f":"IF(OR(T8>$U8,T9>$U9,T10>$U10,T11>$U11,T12>$U12,T13>$U13,T14>$U14,T16>$U16,T18>$U18,T20>$U20,T22>$U22,T24>$U24,T25>$U25,T26>$U26),\"Error: Heating and othergas oil\nis greater than Total gas/diesel oil.\",\"\")","v":""},null,{"$f":"IF(OR(V8>U8,V9>U9,V10>U10,V11>U11,V12>U12,V13>U13,V14>U14,V16>U16,V18>U18,V20>U20,V22>U22,V24>U24,V25>U25,V26>U26),\"Error: Biodiesels is greater than Total.\",\"\")","v":""},null,null,{"$f":"IF(OR(Y8>X8,Y9>X9,Y10>X10,Y11>X11,Y12>X12,Y13>X13,Y14>X14,Y16>X16,Y18>X18,Y20>X20,Y22>X22,Y25>X25,Y26>X26),\"Error: Fuel oil-low sulphur (<1%)\nis greater than Total.\",\"\")","v":""}]
[null,null,null,null,null,null,null,null,null,{"$f":"IF(OR(J8<>K8+L8,J9<>K9+L9,J10<>K10+L10,J11<>K11+L11,J12<>K12+L12,J13<>K13+L13,J14<>K14+L14,J15<>K15+L15,J16<>K16+L16,J17<>K17+L17,J18<>K18+L18,J19<>K19+L19,J20<>K20+L20,J22<>K22+L22,J25<>K25+L25,J26<>K26+L26),\"Error: Sum not equal Total.\",\"\")","v":""},null,null,null,null,{"$f":"IF(OR(O8<>P8+Q8,O9<>P9+Q9,O10<>P10+Q10,O11<>P11+Q11,O12<>P12+Q12,O13<>P13+Q13,O14<>P14+Q14,O16<>P16+Q16,O18<>P18+Q18,O20<>P20+Q20,O21<>P21+Q21,O22<>P22+Q22,O25<>P25+Q25,O26<>P26+Q26),\"Error: Sum not equal Total.\",\"\")","v":""},null,null,null,{"$f":"IF(OR(S8>$U8,S9>$U9,S10>$U10,S11>$U11,S12>$U12,S13>$U13,S14>$U14,S16>$U16,S18>$U18,S20>$U20,S22>$U22,S25>$U25,S26>$U26),\"Error: Road diesel is greater\nthan Total gas/diesel oil.\",\"\")","v":""},null,null,null,{"$f":"IF(OR(W8>U8,W9>U9,W10>U10,W11>U11,W12>U12,W13>U13,W14>U14,W16>U16,W18>U18,W20>U20,W22>U22,W24>U24,W25>U25,W26>U26),\"Error: Non-bio gas/diesel oil is greater than Total.\",\"\")","v":""},null,null,{"$f":"IF(OR(Z8>X8,Z9>X9,Z10>X10,Z11>X11,Z12>X12,Z13>X13,Z14>X14,Z16>X16,Z18>X18,Z20>X20,Z22>X22,Z25>X25,Z26>X26),\"Error: Fuel oil-high sulphur (>=1%) is greater than Total.\",\"\")","v":""}]
[1,"Total of Primary product receipts (reference Z1) should correspond to Total of Direct use in Table 1 (reference G7).",null,null,null,null,null,{"$f":"AC8-MOS_Table_1!J20","v":0},{"$f":"IF(H32=0,\"OK\",\"Total of 'Primary product receipts' not equal to total of 'Direct use' in Table 1.\")","v":"OK"}]
[2,"Imports (Balance) should correspond to Total Imports for these products in Table 3 (references G105 to AC105).",null,null,null,null,null,{"$f":"AC12-MOS_Table_3!AE172","v":0},{"$f":"IF(H33=0,\"OK\",\"Imports (Balance) for Total products is not equal to Total Imports in Table 3 for Total products.\")","v":"OK"}]
[3,"Exports (Balance)  should correspond to Total Exports for these products in Table 4 (references F96 to AC96).",null,null,null,null,null,{"$f":"AC13-MOS_Table_4!AE172","v":0},{"$f":"IF(H34=0,\"OK\",\"Exports (Balance) for Total products is not equal to Total Exports in Table 4 for Total products.\")","v":"OK"}]
[4,"Total of Interproduct transfers (reference Z8) should add to 0.",null,null,null,null,null,{"$f":"AC15","v":0},{"$f":"IF(H35=0,\"OK\",\"Interproduct transfers of Total products is not equal to 0.\")","v":"OK"}]
[5,"Total products of Products transferred (reference Z9) should correspond to Total of Products transferred in Table 1 (reference G4).",null,null,null,null,null,null,{"$f":"IF(G37=0,\"OK\",\"Products transferred of Total products is not equal to Products transferred of Total in Table 1.\")","v":"OK"}]
[6,"Stock changes is Closing level minus Opening level of Stocks on national territory, Table 5 (line 2 minus line 1).",null,null,null,null,{"$f":"AC16-MOS_Table_1!J17","v":0},{"$f":"AC17-(MOS_Table_5!AG9-MOS_Table_5!AG8)","v":0},{"$f":"IF(H37=0,\"OK\",\"Stock change for Total products is not equal to Closing stock level minus the Opening stock level on National territory in Table 5 for Total products.\")","v":"OK"}]
[7,"Memo item shouldn't be greater than the Gross inland deliveries (Observed):",null,null,null,null,null,null,{"$f":"IF(OR(H22+H23>H20,M21+M22>M20,N21+N22>N20,O22+O21>O20,P21+P22>P20,Q22+Q21>Q20,T22+T24>T20,U22+U24>U20,V22+V24>V20,W22+W24>W20),\"Sum of Memo Items shoud not exceed Gross inland deliveries (Observed).\",\"\")","v":""}]
[null,"         - Deliveries to international aviation.",null,null,null,null,null,{"$f":"IF(I39=\"OK\",0,1)","v":0},{"$f":"IF(OR(M21>M20,N21>N20,O21>O20,P21>P20,Q21>Q20),\"Deliveries to international aviation shoud not exceed Gross inland deliveries (Observed).\",\"OK\")","v":"OK"}]
[null,"         - Deliveries to main activity producer power plants.",null,null,null,null,null,{"$f":"IF(I40=\"OK\",0,1)","v":0},{"$f":"IF(OR(D22>D20,E22>E20,F22>F20,G22>G20,H22>H20,I22>I20,J22>J20,K22>K20,L22>L20,M22>M20,N22>N20,O22>O20,P22>P20,Q22>Q20,R22>R20,S22>S20,T22>T20,U22>U20,V22>V20,W22>W20,X22>X20,Y22>Y20,Z22>Z20,AA22>AA20,AB22>AB20),\"Deliveries to Main activity producer power plants should not exceed Gross inland deliveries (Observed).\",\"OK\")","v":"OK"}]
[null,"         - Deliveries of automotive LPG.",null,null,null,null,null,{"$f":"IF(I41=\"OK\",0,1)","v":0},{"$f":"IF((H23>H20),\"Deliveries of automotive LPG should not exceed Gross inland deliveries (Observed) of LPG.\",\"OK\")","v":"OK"}]
[null,"         - Deliveries of rail and marine diesel.",null,null,null,null,null,{"$f":"IF(I42=\"OK\",0,1)","v":0},{"$f":"IF(OR(T24>T20,U24>U20,V24>V20,W24>W20),\"Deliveries of rail and marine diesel should not exceed Gross inland deliveries (Observed).\",\"OK\")","v":"OK"}]
[8,"Gross deliveries to the petrochemical industry should not be greater than the Gross inland deliveries (Observed).",null,null,null,null,null,{"$f":"IF(I43=\"OK\",0,1)","v":0},{"$f":"IF(OR(D25>D20,E25>E20,F25>F20,G25>G20,H25>H20,I25>I20,J25>J20,K25>K20,L25>L20,M25>M20,N25>N20,O25>O20,P25>P20,Q25>Q20,R25>R20,S25>S20,T25>T20,,U25>U20,V25>V20,W25>W20,X25>X20,Y25>Y20,Z25>Z20,AA25>AA20,AB25>AB20),\"Deliveries to the Petrochemical sector should not exceed Gross inland deliveries (Observed).\",\"OK\")","v":"OK"}]
[9,"Total of Backflows to refineries (reference Z19) should correspond to Total of Backflows in Table 1 (reference G3).",null,null,null,null,null,{"$f":"AC26-MOS_Table_1!J16","v":0},{"$f":"IF(H44=0,\"OK\",\"Backflows to refineries of Total products is not equal to Total of Backflows in Table 1.\")","v":"OK"}]
[]
[]
[]
[]
[]
[]
[]
[]
[]
[]
[]
[]
[]
[]
[]
[]
[]
[]
[]
[]
[]
[]
[]
[]
[]
[]
[]
[]
[]
[]
[]
[]
[]
[]
[]
[]
[]
[]
[]
[]
[]
[]
[]
[]
[]
[]
[]
[]
[]
[]
[]
[]
[]
[]
[]
[]
[]
[]
[]
[]
[]
[]
[]
[]
[]
[]
[]
[]
[]
[]
[]
[]
[]
[]
[]
[]
[]
[]
[]
[]
[]
[]
[]
[]
[]
[null,"Products è",null,"CRUDEOIL","NGL","REFINGAS","ETHANE","LPG","NAPHTHA","MOTORGAS","BIOGASOL","NONBIOGASO","AVGAS","JETGAS","JETKERO","BIOJETKERO","NONBIOJETK","OTHKERO","DIESEL","HEATOIL","GASDIES","BIODIESEL","NONBIODIES","RESFUEL","LOWSULF","HIGHSULF","PETCOKE","OPRODS","TOTPRODS"]

{"sheet":"MOS_Table_3","index":7,"n_rows":190,"n_cols":45,"rows_kept":190,"cut":false,"hidden":true,"merged":[[4,30,5,30],[4,31,5,31],[4,33,5,33],[4,16,5,16],[4,19,5,19],[4,22,5,22],[4,25,5,25],[4,28,5,28],[4,29,5,29],[4,15,5,15],[4,2,5,2],[4,3,5,3],[4,4,5,4],[4,5,5,5],[4,6,5,6],[4,7,5,7],[4,8,5,8],[4,9,5,9],[4,10,5,10],[4,11,5,11],[4,14,5,14]]}
["MONTHLY OIL AND GAS QUESTIONNAIRE"]
[{"$f":"CountryMessage","v":"(select your country on the 'Start' sheet)"}]
[{"$f":"FirstMonth & \" \" & QuestYear","v":"MONTH ? 2022"},null,null,null,null,null,null,null,null,null,null,null,null,null,null,null,null,null,null,null,null,null,null,null,null,null,null,null,null,null,null,null,null,null,null,null,null,null,null,null,null,null,null,null,"Datatype"]
["Table 3: IMPORTS BY ORIGIN",null,null,null,null,null,null,null,null,null,null,null,null,null,null,null,null,null,null,null,null,null,null,null,null,null,null,null,null,null,null,"Unit:  Thousand Metric Tons",null,null,null,null,null,null,null,null,null,null,null,null,"IMPORTS"]
[null,null,"Crude\noil","Natural\ngas\nliquids","Refinery\nfeedstocks","Additives /\noxygenates","Other\nhydro-carbons","Total\n(A to E)","Ethane","LPG","Naphtha","Total motor\ngasoline",null,null,"Aviation\ngasoline","Gasoline\ntype\njet fuel","Total\nkerosene\ntype\njet fuel",null,null,"Other\nkerosene",null,null,"Total\ngas/diesel\noil",null,null,"Total \nfuel oil",null,null,"Petroleum coke","Other products","Total products","Total\noil",null,"Probate"]
[null,null,null,null,null,null,null,null,null,null,null,null,"Biogasoline","Non-biogasoline",null,null,null,"Bio jet\nkerosene","Non-bio jet\nkerosene",null,"Road diesel","Heating and\nother gas oil",null,"Biodiesels","Non-bio\ngas/diesel\noil",null,"Fuel oil-\nlow sulphur \n(<1%)","Fuel oil-\nhigh sulphur\n (>=1%)"]
[null,null,"A","B","C","D","E","F","G","H","I","J","K","L","M","N","O","P","Q","R","S","T","U","V","W","X","Y","Z","AA","AB","AC","AD",null,"AE",null,null,null,null,null,null,null,null,null,"Item1 ê"]
["Albania",1,null,null,null,null,null,{"$f":"SUM(C8:G8)","v":0},null,null,null,null,null,null,null,null,null,null,null,null,null,null,null,null,null,null,null,null,null,null,{"$f":"SUM(I8:L8,O8:Q8,T8,W8,Z8,AC8:AD8)","v":0},{"$f":"SUM(H8,AE8)","v":0},{"$f":"IF(H8-SUM(C8:G8)=0,0,1)+IF(AE8-SUM(I8:L8,O8:Q8,T8,W8,Z8,AC8:AD8)=0,0,1)+IF(AF8-SUM(AE8,H8)=0,0,1)","v":0},{"$f":"IF(AG8=0,\" \",IF(AG8=1,\"A total is not equal to the sum of its components: \",AG8&\" totals are not equal to the sum of their components: \"))&IF(AG8=0,\"\",IF(H8-SUM(C8:G8)=0,\"\",\"Total (column F). \")&IF(AE8-SUM(I8:L8,O8:Q8,T8,W8,Z8,AC8:AD8)=0,\"\",\"Total products. \")&IF(AF8-SUM(AE8,H8)=0,\"\",\"Total oil.\"))","v":" "},null,null,null,null,null,null,null,null,null,"AL","ALBANIA"]
["Algeria",2,null,null,null,null,null,0,null,null,null,null,null,null,null,null,null,null,null,null,null,null,null,null,null,null,null,null,null,null,{"$f":"SUM(I9:L9,O9:Q9,T9,W9,Z9,AC9:AD9)","v":0},{"$f":"SUM(H9,AE9)","v":0},{"$f":"IF(H9-SUM(C9:G9)=0,0,1)+IF(AE9-SUM(I9:L9,O9:Q9,T9,W9,Z9,AC9:AD9)=0,0,1)+IF(AF9-SUM(AE9,H9)=0,0,1)","v":0},{"$f":"IF(AG9=0,\" \",IF(AG9=1,\"A total is not equal to the sum of its components: \",AG9&\" totals are not equal to the sum of their components: \"))&IF(AG9=0,\"\",IF(H9-SUM(C9:G9)=0,\"\",\"Total (column F). \")&IF(AE9-SUM(I9:L9,O9:Q9,T9,W9,Z9,AC9:AD9)=0,\"\",\"Total products. \")&IF(AF9-SUM(AE9,H9)=0,\"\",\"Total oil.\"))","v":" "},null,null,null,null,null,null,null,null,null,"DZ","ALGERIA"]
["Andorra",3,null,null,null,null,null,0,null,null,null,null,null,null,null,null,null,null,null,null,null,null,null,null,null,null,null,null,null,null,0,0,0," ",null,null,null,null,null,null,null,null,null,"AD","ANDORRA"]
["Angola",4,null,null,null,null,null,0,null,null,null,null,null,null,null,null,null,null,null,null,null,null,null,null,null,null,null,null,null,null,0,0,0," ",null,null,null,null,null,null,null,null,null,"AO","ANGOLA"]
["Argentina",5,null,null,null,null,null,0,null,null,null,null,null,null,null,null,null,null,null,null,null,null,null,null,null,null,null,null,null,null,{"$f":"SUM(I12:L12,O12:Q12,T12,W12,Z12,AC12:AD12)","v":0},0,0," ",null,null,null,null,null,null,null,null,null,"AR","ARGENTINA"]
["Armenia",6,null,null,null,null,null,0,null,null,null,null,null,null,null,null,null,null,null,null,null,null,null,null,null,null,null,null,null,null,0,0,0," ",null,null,null,null,null,null,null,null,null,"AM","ARMENIA"]
["Aruba",7,null,null,null,null,null,0,null,null,null,null,null,null,null,null,null,null,null,null,null,null,null,null,null,null,null,null,null,null,0,0,0," ",null,null,null,null,null,null,null,null,null,"AW","ARUBA"]
["Australia",8,null,null,null,null,null,0,null,null,null,null,null,null,null,null,null,null,null,null,null,null,null,null,null,null,null,null,null,null,0,0,0," ",null,null,null,null,null,null,null,null,null,"AU","AUSTRALI"]
["Austria",9,null,null,null,null,null,0,null,null,null,null,null,null,null,null,null,null,null,null,null,null,null,null,null,null,null,null,null,null,0,0,0," ",null,null,null,null,null,null,null,null,null,"AT","AUSTRIA"]
["Azerbaijan",10,null,null,null,null,null,0,null,null,null,null,null,null,null,null,null,null,null,null,null,null,null,null,null,null,null,null,null,null,0,0,0," ",null,null,null,null,null,null,null,null,null,"AZ","AZERBAIJAN"]
["Bahamas",11,null,null,null,null,null,0,null,null,null,null,null,null,null,null,null,null,null,null,null,null,null,null,null,null,null,null,null,null,0,0,0," ",null,null,null,null,null,null,null,null,null,"BS","BAHAMAS"]
["Bahrain",12,null,null,null,null,null,0,null,null,null,null,null,null,null,null,null,null,null,null,null,null,null,null,null,null,null,null,null,null,0,0,0," ",null,null,null,null,null,null,null,null,null,"BH","BAHRAIN"]
["Bangladesh",13,null,null,null,null,null,0,null,null,null,null,null,null,null,null,null,null,null,null,null,null,null,null,null,null,null,null,null,null,0,0,0," ",null,null,null,null,null,null,null,null,null,"BD","BANGLADESH"]
["Barbados",14,null,null,null,null,null,0,null,null,null,null,null,null,null,null,null,null,null,null,null,null,null,null,null,null,null,null,null,null,0,0,0," ",null,null,null,null,null,null,null,null,null,"BB","BARBADOS"]
["Belarus",15,null,null,null,null,null,0,null,null,null,null,null,null,null,null,null,null,null,null,null,null,null,null,null,null,null,null,null,null,0,0,0," ",null,null,null,null,null,null,null,null,null,"BY","BELARUS"]
["Belgium",16,null,null,null,null,null,0,null,null,null,null,null,null,null,null,null,null,null,null,null,null,null,null,null,null,null,null,null,null,0,0,0," ",null,null,null,null,null,null,null,null,null,"BE","BELGIUM"]
["Belize",17,null,null,null,null,null,0,null,null,null,null,null,null,null,null,null,null,null,null,null,null,null,null,null,null,null,null,null,null,0,0,0," ",null,null,null,null,null,null,null,null,null,"BZ","BELIZE"]
["Benin",18,null,null,null,null,null,{"$f":"SUM(C25:G25)","v":0},null,null,null,null,null,null,null,null,null,null,null,null,null,null,null,null,null,null,null,null,null,null,0,0,0," ",null,null,null,null,null,null,null,null,null,"BJ","BENIN"]
["Bolivia",19,null,null,null,null,null,{"$f":"SUM(C26:G26)","v":0},null,null,null,null,null,null,null,null,null,null,null,null,null,null,null,null,null,null,null,null,null,null,0,0,0," ",null,null,null,null,null,null,null,null,null,"BO","BOLIVIA"]
["Bosnia and Herzegovina",20,null,null,null,null,null,0,null,null,null,null,null,null,null,null,null,null,null,null,null,null,null,null,null,null,null,null,null,null,0,0,0," ",null,null,null,null,null,null,null,null,null,"BA","BOSNIAHERZ"]
["Brazil",21,null,null,null,null,null,0,null,null,null,null,null,null,null,null,null,null,null,null,null,null,null,null,null,null,null,null,null,null,0,0,0," ",null,null,null,null,null,null,null,null,null,"BR","BRAZIL"]
["British Virgin Islands",22,null,null,null,null,null,0,null,null,null,null,null,null,null,null,null,null,null,null,null,null,null,null,null,null,null,null,null,null,0,0,0," ",null,null,null,null,null,null,null,null,null,"VG","BRITVIRGIN"]
["Brunei Darussalam",23,null,null,null,null,null,0,null,null,null,null,null,null,null,null,null,null,null,null,null,null,null,null,null,null,null,null,null,null,0,0,0," ",null,null,null,null,null,null,null,null,null,"BN","BRUNEI"]
["Bulgaria",24,null,null,null,null,null,0,null,null,null,null,null,null,null,null,null,null,null,null,null,null,null,null,null,null,null,null,null,null,0,0,0," ",null,null,null,null,null,null,null,null,null,"BG","BULGARIA"]
["Cambodia",25,null,null,null,null,null,0,null,null,null,null,null,null,null,null,null,null,null,null,null,null,null,null,null,null,null,null,null,null,0,0,0," ",null,null,null,null,null,null,null,null,null,"KH","CAMBODIA"]
["Cameroon",26,null,null,null,null,null,0,null,null,null,null,null,null,null,null,null,null,null,null,null,null,null,null,null,null,null,null,null,null,0,0,0," ",null,null,null,null,null,null,null,null,null,"CM","CAMEROON"]
["Canada",27,null,null,null,null,null,0,null,null,null,null,null,null,null,null,null,null,null,null,null,null,null,null,null,null,null,null,null,null,0,0,0," ",null,null,null,null,null,null,null,null,null,"CA","CANADA"]
["Cape Verde / Cabo Verde",28,null,null,null,null,null,0,null,null,null,null,null,null,null,null,null,null,null,null,null,null,null,null,null,null,null,null,null,null,0,0,0," ",null,null,null,null,null,null,null,null,null,"CV","CABOVERDE"]
["Chile",29,null,null,null,null,null,0,null,null,null,null,null,null,null,null,null,null,null,null,null,null,null,null,null,null,null,null,null,null,0,0,0," ",null,null,null,null,null,null,null,null,null,"CL","CHILE"]
["China, People's Republic of",30,null,null,null,null,null,{"$f":"SUM(C37:G37)","v":0},null,null,null,null,null,null,null,null,null,null,null,null,null,null,null,null,null,null,null,null,null,null,0,0,0," ",null,null,null,null,null,null,null,null,null,"CN","CHINA"]
["Colombia",31,null,null,null,null,null,0,null,null,null,null,null,null,null,null,null,null,null,null,null,null,null,null,null,null,null,null,null,null,0,0,0," ",null,null,null,null,null,null,null,null,null,"CO","COLOMBIA"]
["Congo",32,null,null,null,null,null,0,null,null,null,null,null,null,null,null,null,null,null,null,null,null,null,null,null,null,null,null,null,null,0,0,0," ",null,null,null,null,null,null,null,null,null,"CG","CONGO"]
["Costa Rica",33,null,null,null,null,null,0,null,null,null,null,null,null,null,null,null,null,null,null,null,null,null,null,null,null,null,null,null,null,0,0,0," ",null,null,null,null,null,null,null,null,null,"CR","COSTARICA"]
["Côte d’Ivoire",34,null,null,null,null,null,0,null,null,null,null,null,null,null,null,null,null,null,null,null,null,null,null,null,null,null,null,null,null,0,0,0," ",null,null,null,null,null,null,null,null,null,"CI","COTEIVOIRE"]
["Croatia",35,null,null,null,null,null,0,null,null,null,null,null,null,null,null,null,null,null,null,null,null,null,null,null,null,null,null,null,null,0,0,0," ",null,null,null,null,null,null,null,null,null,"HR","CROATIA"]
["Cuba",36,null,null,null,null,null,0,null,null,null,null,null,null,null,null,null,null,null,null,null,null,null,null,null,null,null,null,null,null,0,0,0," ",null,null,null,null,null,null,null,null,null,"CU","CUBA"]
["Curaçao",37,null,null,null,null,null,0,null,null,null,null,null,null,null,null,null,null,null,null,null,null,null,null,null,null,null,null,null,null,0,0,0," ",null,null,null,null,null,null,null,null,null,"CW","CURACAO"]
["Cyprus",38,null,null,null,null,null,0,null,null,null,null,null,null,null,null,null,null,null,null,null,null,null,null,null,null,null,null,null,null,0,0,0," ",null,null,null,null,null,null,null,null,null,"CY","CYPRUS"]
["Czech Republic",39,null,null,null,null,null,0,null,null,null,null,null,null,null,null,null,null,null,null,null,null,null,null,null,null,null,null,null,null,0,0,0," ",null,null,null,null,null,null,null,null,null,"CZ","CZECH"]
["Korea, Democratic People's Republic of",40,null,null,null,null,null,0,null,null,null,null,null,null,null,null,null,null,null,null,null,null,null,null,null,null,null,null,null,null,0,0,0," ",null,null,null,null,null,null,null,null,null,"KP","KOREADPR"]
["Congo, Democratic Republic of the",41,null,null,null,null,null,0,null,null,null,null,null,null,null,null,null,null,null,null,null,null,null,null,null,null,null,null,null,null,0,0,0," ",null,null,null,null,null,null,null,null,null,"CD","CONGOREP"]
["Denmark",42,null,null,null,null,null,0,null,null,null,null,null,null,null,null,null,null,null,null,null,null,null,null,null,null,null,null,null,null,0,0,0," ",null,null,null,null,null,null,null,null,null,"DK","DENMARK"]
["Djibouti",43,null,null,null,null,null,0,null,null,null,null,null,null,null,null,null,null,null,null,null,null,null,null,null,null,null,null,null,null,0,0,0," ",null,null,null,null,null,null,null,null,null,"DJ","DJIBOUTI"]
["Dominican Republic",44,null,null,null,null,null,0,null,null,null,null,null,null,null,null,null,null,null,null,null,null,null,null,null,null,null,null,null,null,0,0,0," ",null,null,null,null,null,null,null,null,null,"DO","DOMINICANR"]
["Ecuador",45,null,null,null,null,null,{"$f":"SUM(C52:G52)","v":0},null,null,null,null,null,null,null,null,null,null,null,null,null,null,null,null,null,null,null,null,null,null,0,{"$f":"SUM(H52,AE52)","v":0},0," ",null,null,null,null,null,null,null,null,null,"EC","ECUADOR"]
["Egypt",46,null,null,null,null,null,0,null,null,null,null,null,null,null,null,null,null,null,null,null,null,null,null,null,null,null,null,null,null,0,0,0," ",null,null,null,null,null,null,null,null,null,"EG","EGYPT"]
["Equatorial Guinea",47,null,null,null,null,null,0,null,null,null,null,null,null,null,null,null,null,null,null,null,null,null,null,null,null,null,null,null,null,0,0,0," ",null,null,null,null,null,null,null,null,null,"GQ","EQGUINEA"]
["Eritrea",48,null,null,null,null,null,0,null,null,null,null,null,null,null,null,null,null,null,null,null,null,null,null,null,null,null,null,null,null,0,0,0," ",null,null,null,null,null,null,null,null,null,"ER","ERITREA"]
["Estonia",49,null,null,null,null,null,0,null,null,null,null,null,null,null,null,null,null,null,null,null,null,null,null,null,null,null,null,null,null,0,0,0," ",null,null,null,null,null,null,null,null,null,"EE","ESTONIA"]
["Ethiopia",50,null,null,null,null,null,0,null,null,null,null,null,null,null,null,null,null,null,null,null,null,null,null,null,null,null,null,null,null,0,0,0," ",null,null,null,null,null,null,null,null,null,"ET","ETHIOPIA"]
["Finland",51,null,null,null,null,null,0,null,null,null,null,null,null,null,null,null,null,null,null,null,null,null,null,null,null,null,null,null,null,0,0,0," ",null,null,null,null,null,null,null,null,null,"FI","FINLAND"]
["France",52,null,null,null,null,null,0,null,null,null,null,null,null,null,null,null,null,null,null,null,null,null,null,null,null,null,null,null,null,0,0,0," ",null,null,null,null,null,null,null,null,null,"FR","FRANCE"]
["Gabon",53,null,null,null,null,null,0,null,null,null,null,null,null,null,null,null,null,null,null,null,null,null,null,null,null,null,null,null,null,0,0,0," ",null,null,null,null,null,null,null,null,null,"GA","GABON"]
["Georgia",54,null,null,null,null,null,0,null,null,null,null,null,null,null,null,null,null,null,null,null,null,null,null,null,null,null,null,null,null,0,0,0," ",null,null,null,null,null,null,null,null,null,"GE","GEORGIA"]
["Germany",55,null,null,null,null,null,0,null,null,null,null,null,null,null,null,null,null,null,null,null,null,null,null,null,null,null,null,null,null,0,0,0," ",null,null,null,null,null,null,null,null,null,"DE","GERMANY"]
["Ghana",56,null,null,null,null,null,0,null,null,null,null,null,null,null,null,null,null,null,null,null,null,null,null,null,null,null,null,null,null,0,0,0," ",null,null,null,null,null,null,null,null,null,"GH","GHANA"]
["Gibraltar",57,null,null,null,null,null,0,null,null,null,null,null,null,null,null,null,null,null,null,null,null,null,null,null,null,null,null,null,null,0,0,0," ",null,null,null,null,null,null,null,null,null,"GI","GIBRALTAR"]
["Greece",58,null,null,null,null,null,0,null,null,null,null,null,null,null,null,null,null,null,null,null,null,null,null,null,null,null,null,null,null,0,0,0," ",null,null,null,null,null,null,null,null,null,"GR","GREECE"]
["Guatemala",59,null,null,null,null,null,0,null,null,null,null,null,null,null,null,null,null,null,null,null,null,null,null,null,null,null,null,null,null,0,0,0," ",null,null,null,null,null,null,null,null,null,"GT","GUATEMALA"]
["Guinea-Bissau",60,null,null,null,null,null,0,null,null,null,null,null,null,null,null,null,null,null,null,null,null,null,null,null,null,null,null,null,null,0,0,0," ",null,null,null,null,null,null,null,null,null,"GW","GUINEABIS"]
["Honduras",61,null,null,null,null,null,0,null,null,null,null,null,null,null,null,null,null,null,null,null,null,null,null,null,null,null,null,null,null,0,0,0," ",null,null,null,null,null,null,null,null,null,"HN","HONDURAS"]
["Hong Kong, China",62,null,null,null,null,null,0,null,null,null,null,null,null,null,null,null,null,null,null,null,null,null,null,null,null,null,null,null,null,0,0,0," ",null,null,null,null,null,null,null,null,null,"HK","HONGKONG"]
["Hungary",63,null,null,null,null,null,0,null,null,null,null,null,null,null,null,null,null,null,null,null,null,null,null,null,null,null,null,null,null,0,0,0," ",null,null,null,null,null,null,null,null,null,"HU","HUNGARY"]
["Iceland",64,null,null,null,null,null,0,null,null,null,null,null,null,null,null,null,null,null,null,null,null,null,null,null,null,null,null,null,null,0,0,0," ",null,null,null,null,null,null,null,null,null,"IS","ICELAND"]
["India",65,null,null,null,null,null,0,null,null,null,null,null,null,null,null,null,null,null,null,null,null,null,null,null,null,null,null,null,null,0,0,0," ",null,null,null,null,null,null,null,null,null,"IN","INDIA"]
["Indonesia",66,null,null,null,null,null,0,null,null,null,null,null,null,null,null,null,null,null,null,null,null,null,null,null,null,null,null,null,null,{"$f":"SUM(I73:L73,O73:Q73,T73,W73,Z73,AC73:AD73)","v":0},{"$f":"SUM(H73,AE73)","v":0},{"$f":"IF(H73-SUM(C73:G73)=0,0,1)+IF(AE73-SUM(I73:L73,O73:Q73,T73,W73,Z73,AC73:AD73)=0,0,1)+IF(AF73-SUM(AE73,H73)=0,0,1)","v":0},{"$f":"IF(AG73=0,\" \",IF(AG73=1,\"A total is not equal to the sum of its components: \",AG73&\" totals are not equal to the sum of their components: \"))&IF(AG73=0,\"\",IF(H73-SUM(C73:G73)=0,\"\",\"Total (column F). \")&IF(AE73-SUM(I73:L73,O73:Q73,T73,W73,Z73,AC73:AD73)=0,\"\",\"Total products. \")&IF(AF73-SUM(AE73,H73)=0,\"\",\"Total oil.\"))","v":" "},null,null,null,null,null,null,null,null,null,"ID","INDONESIA"]
["Iran, Islamic Republic of",67,null,null,null,null,null,0,null,null,null,null,null,null,null,null,null,null,null,null,null,null,null,null,null,null,null,null,null,null,0,0,0," ",null,null,null,null,null,null,null,null,null,"IR","IRAN"]
["Iraq",68,null,null,null,null,null,0,null,null,null,null,null,null,null,null,null,null,null,null,null,null,null,null,null,null,null,null,null,null,0,0,0," ",null,null,null,null,null,null,null,null,null,"IQ","IRAQ"]
["Ireland",69,null,null,null,null,null,{"$f":"SUM(C76:G76)","v":0},null,null,null,null,null,null,null,null,null,null,null,null,null,null,null,null,null,null,null,null,null,null,0,0,0," ",null,null,null,null,null,null,null,null,null,"IE","IRELAND"]
["Israel",70,null,null,null,null,null,0,null,null,null,null,null,null,null,null,null,null,null,null,null,null,null,null,null,null,null,null,null,null,0,0,0," ",null,null,null,null,null,null,null,null,null,"IL","ISRAEL"]
["Italy",71,null,null,null,null,null,0,null,null,null,null,null,null,null,null,null,null,null,null,null,null,null,null,null,null,null,null,null,null,0,0,0," ",null,null,null,null,null,null,null,null,null,"IT","ITALY"]
["Jamaica",72,null,null,null,null,null,0,null,null,null,null,null,null,null,null,null,null,null,null,null,null,null,null,null,null,null,null,null,null,0,0,0," ",null,null,null,null,null,null,null,null,null,"JM","JAMAICA"]
["Japan",73,null,null,null,null,null,0,null,null,null,null,null,null,null,null,null,null,null,null,null,null,null,null,null,null,null,null,null,null,0,0,0," ",null,null,null,null,null,null,null,null,null,"JP","JAPAN"]
["Jordan",74,null,null,null,null,null,0,null,null,null,null,null,null,null,null,null,null,null,null,null,null,null,null,null,null,null,null,null,null,0,0,0," ",null,null,null,null,null,null,null,null,null,"JO","JORDAN"]
["Kazakhstan",75,null,null,null,null,null,0,null,null,null,null,null,null,null,null,null,null,null,null,null,null,null,null,null,null,null,null,null,null,0,0,0," ",null,null,null,null,null,null,null,null,null,"KZ","KAZAKHSTAN"]
["Kenya",76,null,null,null,null,null,0,null,null,null,null,null,null,null,null,null,null,null,null,null,null,null,null,null,null,null,null,null,null,0,0,0," ",null,null,null,null,null,null,null,null,null,"KE","KENYA"]
["Korea",77,null,null,null,null,null,0,null,null,null,null,null,null,null,null,null,null,null,null,null,null,null,null,null,null,null,null,null,null,0,0,0," ",null,null,null,null,null,null,null,null,null,"KR","KOREA"]
["Kosovo*",78,null,null,null,null,null,0,null,null,null,null,null,null,null,null,null,null,null,null,null,null,null,null,null,null,null,null,null,null,0,0,0," ",null,null,null,null,null,null,null,null,null,"XK","KOSOVO"]
["Kuwait",79,null,null,null,null,null,0,null,null,null,null,null,null,null,null,null,null,null,null,null,null,null,null,null,null,null,null,null,null,0,0,0," ",null,null,null,null,null,null,null,null,null,"KW","KUWAIT"]
["Kyrgyzstan",80,null,null,null,null,null,0,null,null,null,null,null,null,null,null,null,null,null,null,null,null,null,null,null,null,null,null,null,null,0,0,0," ",null,null,null,null,null,null,null,null,null,"KG","KYRGYZSTAN"]
["Lao People's Democratic Republic",81,null,null,null,null,null,0,null,null,null,null,null,null,null,null,null,null,null,null,null,null,null,null,null,null,null,null,null,null,0,0,0," ",null,null,null,null,null,null,null,null,null,"LA","LAO"]
["Latvia",82,null,null,null,null,null,0,null,null,null,null,null,null,null,null,null,null,null,null,null,null,null,null,null,null,null,null,null,null,0,0,0," ",null,null,null,null,null,null,null,null,null,"LV","LATVIA"]
["Lebanon",83,null,null,null,null,null,{"$f":"SUM(C90:G90)","v":0},null,null,null,null,null,null,null,null,null,null,null,null,null,null,null,null,null,null,null,null,null,null,0,0,0," ",null,null,null,null,null,null,null,null,null,"LB","LEBANON"]
["Liberia",84,null,null,null,null,null,0,null,null,null,null,null,null,null,null,null,null,null,null,null,null,null,null,null,null,null,null,null,null,0,0,0," ",null,null,null,null,null,null,null,null,null,"LR","LIBERIA"]
["Libya",85,null,null,null,null,null,0,null,null,null,null,null,null,null,null,null,null,null,null,null,null,null,null,null,null,null,null,null,null,0,0,0," ",null,null,null,null,null,null,null,null,null,"LY","LIBYA"]
["Liechtenstein",86,null,null,null,null,null,0,null,null,null,null,null,null,null,null,null,null,null,null,null,null,null,null,null,null,null,null,null,null,0,0,0," ",null,null,null,null,null,null,null,null,null,"LI","LIECHTENST"]
["Lithuania",87,null,null,null,null,null,0,null,null,null,null,null,null,null,null,null,null,null,null,null,null,null,null,null,null,null,null,null,null,0,0,0," ",null,null,null,null,null,null,null,null,null,"LT","LITHUANIA"]
["Luxembourg",88,null,null,null,null,null,0,null,null,null,null,null,null,null,null,null,null,null,null,null,null,null,null,null,null,null,null,null,null,0,0,0," ",null,null,null,null,null,null,null,null,null,"LU","LUXEMBOU"]
["Madagascar",89,null,null,null,null,null,0,null,null,null,null,null,null,null,null,null,null,null,null,null,null,null,null,null,null,null,null,null,null,0,0,0," ",null,null,null,null,null,null,null,null,null,"MG","MADAGASCAR"]
["Malaysia",90,null,null,null,null,null,0,null,null,null,null,null,null,null,null,null,null,null,null,null,null,null,null,null,null,null,null,null,null,0,0,0," ",null,null,null,null,null,null,null,null,null,"MY","MALAYSIA"]
["Malta",91,null,null,null,null,null,0,null,null,null,null,null,null,null,null,null,null,null,null,null,null,null,null,null,null,null,null,null,null,0,0,0," ",null,null,null,null,null,null,null,null,null,"MT","MALTA"]
["Marshall Islands",92,null,null,null,null,null,0,null,null,null,null,null,null,null,null,null,null,null,null,null,null,null,null,null,null,null,null,null,null,0,0,0," ",null,null,null,null,null,null,null,null,null,"MH","MARSHALL"]
["Mauritania",93,null,null,null,null,null,0,null,null,null,null,null,null,null,null,null,null,null,null,null,null,null,null,null,null,null,null,null,null,0,0,0," ",null,null,null,null,null,null,null,null,null,"MR","MAURITANIA"]
["Mauritius",94,null,null,null,null,null,0,null,null,null,null,null,null,null,null,null,null,null,null,null,null,null,null,null,null,null,null,null,null,0,0,0," ",null,null,null,null,null,null,null,null,null,"MU","MAURITIUS"]
["Mexico",95,null,null,null,null,null,0,null,null,null,null,null,null,null,null,null,null,null,null,null,null,null,null,null,null,null,null,null,null,0,0,0," ",null,null,null,null,null,null,null,null,null,"MX","MEXICO"]
["Moldova, Republic of",96,null,null,null,null,null,{"$f":"SUM(C103:G103)","v":0},null,null,null,null,null,null,null,null,null,null,null,null,null,null,null,null,null,null,null,null,null,null,0,0,0," ",null,null,null,null,null,null,null,null,null,"MD","MOLDOVA"]
["Mongolia",97,null,null,null,null,null,{"$f":"SUM(C104:G104)","v":0},null,null,null,null,null,null,null,null,null,null,null,null,null,null,null,null,null,null,null,null,null,null,0,0,0," ",null,null,null,null,null,null,null,null,null,"MN","MONGOLIA"]
["Montenegro",98,null,null,null,null,null,{"$f":"SUM(C105:G105)","v":0},null,null,null,null,null,null,null,null,null,null,null,null,null,null,null,null,null,null,null,null,null,null,0,0,0," ",null,null,null,null,null,null,null,null,null,"ME","MONTENEGRO"]
["Morocco",99,null,null,null,null,null,0,null,null,null,null,null,null,null,null,null,null,null,null,null,null,null,null,null,null,null,null,null,null,0,0,0," ",null,null,null,null,null,null,null,null,null,"MA","MOROCCO"]
["Mozambique",100,null,null,null,null,null,0,null,null,null,null,null,null,null,null,null,null,null,null,null,null,null,null,null,null,null,null,null,null,0,0,0," ",null,null,null,null,null,null,null,null,null,"MZ","MOZAMBIQUE"]
["Myanmar",101,null,null,null,null,null,0,null,null,null,null,null,null,null,null,null,null,null,null,null,null,null,null,null,null,null,null,null,null,0,0,0," ",null,null,null,null,null,null,null,null,null,"MM","MYANMAR"]
["Namibia",102,null,null,null,null,null,0,null,null,null,null,null,null,null,null,null,null,null,null,null,null,null,null,null,null,null,null,null,null,0,0,0," ",null,null,null,null,null,null,null,null,null,"NA","NAMIBIA"]
["Nepal",103,null,null,null,null,null,0,null,null,null,null,null,null,null,null,null,null,null,null,null,null,null,null,null,null,null,null,null,null,{"$f":"SUM(I110:L110,O110:Q110,T110,W110,Z110,AC110:AD110)","v":0},{"$f":"SUM(H110,AE110)","v":0},null,null,null,null,null,null,null,null,null,null,null,"NP","NEPAL"]
["Netherlands",104,null,null,null,null,null,0,null,null,null,null,null,null,null,null,null,null,null,null,null,null,null,null,null,null,null,null,null,null,0,0,null,null,null,null,null,null,null,null,null,null,null,"NL","NETHLAND"]
["New Caledonia",105,null,null,null,null,null,0,null,null,null,null,null,null,null,null,null,null,null,null,null,null,null,null,null,null,null,null,null,null,0,0,null,null,null,null,null,null,null,null,null,null,null,"NC","NEWCALEDON"]
["New Zealand",106,null,null,null,null,null,0,null,null,null,null,null,null,null,null,null,null,null,null,null,null,null,null,null,null,null,null,null,null,0,0,null,null,null,null,null,null,null,null,null,null,null,"NZ","NZ"]
["Niger",107,null,null,null,null,null,0,null,null,null,null,null,null,null,null,null,null,null,null,null,null,null,null,null,null,null,null,null,null,0,0,null,null,null,null,null,null,null,null,null,null,null,"NE","NIGER"]
["Nigeria",108,null,null,null,null,null,0,null,null,null,null,null,null,null,null,null,null,null,null,null,null,null,null,null,null,null,null,null,null,0,0,null,null,null,null,null,null,null,null,null,null,null,"NG","NIGERIA"]
["North Macedonia",109,null,null,null,null,null,0,null,null,null,null,null,null,null,null,null,null,null,null,null,null,null,null,null,null,null,null,null,null,0,0,null,null,null,null,null,null,null,null,null,null,null,"MK","NORTHMACED"]
["Norway",110,null,null,null,null,null,0,null,null,null,null,null,null,null,null,null,null,null,null,null,null,null,null,null,null,null,null,null,null,0,0,null,null,null,null,null,null,null,null,null,null,null,"NO","NORWAY"]
["Oman",111,null,null,null,null,null,0,null,null,null,null,null,null,null,null,null,null,null,null,null,null,null,null,null,null,null,null,null,null,0,0,null,null,null,null,null,null,null,null,null,null,null,"OM","OMAN"]
["Other Africa",112,null,null,null,null,null,0,null,null,null,null,null,null,null,null,null,null,null,null,null,null,null,null,null,null,null,null,null,null,0,0,null,null,null,null,null,null,null,null,null,null,null,"O1","OTHERAFRIC"]
["Other Asia Oceania",113,null,null,null,null,null,0,null,null,null,null,null,null,null,null,null,null,null,null,null,null,null,null,null,null,null,null,null,null,0,0,null,null,null,null,null,null,null,null,null,null,null,"O4","OTHERASIA"]
["Other Europe",114,null,null,null,null,null,0,null,null,null,null,null,null,null,null,null,null,null,null,null,null,null,null,null,null,null,null,null,null,0,0,null,null,null,null,null,null,null,null,null,null,null,"O8","OTHEREUROP"]
["Other Former Soviet Union",115,null,null,null,null,null,0,null,null,null,null,null,null,null,null,null,null,null,null,null,null,null,null,null,null,null,null,null,null,0,0,null,null,null,null,null,null,null,null,null,null,null,"P8","OTHFUSSR"]
["Other Near and Middle East",116,null,null,null,null,null,0,null,null,null,null,null,null,null,null,null,null,null,null,null,null,null,null,null,null,null,null,null,null,0,0,null,null,null,null,null,null,null,null,null,null,null,"P4","OTHERNEARM"]
["Other Non-OECD Americas",117,null,null,null,null,null,0,null,null,null,null,null,null,null,null,null,null,null,null,null,null,null,null,null,null,null,null,null,null,0,0,null,null,null,null,null,null,null,null,null,null,null,"P1","OTHERLATIN"]
["Pakistan",118,null,null,null,null,null,0,null,null,null,null,null,null,null,null,null,null,null,null,null,null,null,null,null,null,null,null,null,null,0,0,null,null,null,null,null,null,null,null,null,null,null,"PK","PAKISTAN"]
["Panama",119,null,null,null,null,null,0,null,null,null,null,null,null,null,null,null,null,null,null,null,null,null,null,null,null,null,null,null,null,0,0,null,null,null,null,null,null,null,null,null,null,null,"PA","PANAMA"]
["Papua New Guinea",120,null,null,null,null,null,0,null,null,null,null,null,null,null,null,null,null,null,null,null,null,null,null,null,null,null,null,null,null,0,0,null,null,null,null,null,null,null,null,null,null,null,"PG","PAPUANEWGU"]
["Peru",121,null,null,null,null,null,0,null,null,null,null,null,null,null,null,null,null,null,null,null,null,null,null,null,null,null,null,null,null,0,0,null,null,null,null,null,null,null,null,null,null,null,"PE","PERU"]
["Philippines",122,null,null,null,null,null,0,null,null,null,null,null,null,null,null,null,null,null,null,null,null,null,null,null,null,null,null,null,null,0,0,null,null,null,null,null,null,null,null,null,null,null,"PH","PHILIPPINE"]
["Poland",123,null,null,null,null,null,0,null,null,null,null,null,null,null,null,null,null,null,null,null,null,null,null,null,null,null,null,null,null,0,0,null,null,null,null,null,null,null,null,null,null,null,"PL","POLAND"]
["Portugal",124,null,null,null,null,null,0,null,null,null,null,null,null,null,null,null,null,null,null,null,null,null,null,null,null,null,null,null,null,0,0,null,null,null,null,null,null,null,null,null,null,null,"PT","PORTUGAL"]
["Qatar",125,null,null,null,null,null,0,null,null,null,null,null,null,null,null,null,null,null,null,null,null,null,null,null,null,null,null,null,null,0,0,null,null,null,null,null,null,null,null,null,null,null,"QA","QATAR"]
["Romania",126,null,null,null,null,null,0,null,null,null,null,null,null,null,null,null,null,null,null,null,null,null,null,null,null,null,null,null,null,0,0,null,null,null,null,null,null,null,null,null,null,null,"RO","ROMANIA"]
["Russian Federation",127,null,null,null,null,null,0,null,null,null,null,null,null,null,null,null,null,null,null,null,null,null,null,null,null,null,null,null,null,0,0,null,null,null,null,null,null,null,null,null,null,null,"RU","RUSSIA"]
["Sao Tome and Principe",128,null,null,null,null,null,0,null,null,null,null,null,null,null,null,null,null,null,null,null,null,null,null,null,null,null,null,null,null,0,0,null,null,null,null,null,null,null,null,null,null,null,"ST","SAOTOME"]
["Saudi Arabia",129,null,null,null,null,null,0,null,null,null,null,null,null,null,null,null,null,null,null,null,null,null,null,null,null,null,null,null,null,0,0,null,null,null,null,null,null,null,null,null,null,null,"SA","SAUDIARABI"]
["Senegal",130,null,null,null,null,null,0,null,null,null,null,null,null,null,null,null,null,null,null,null,null,null,null,null,null,null,null,null,null,0,0,null,null,null,null,null,null,null,null,null,null,null,"SN","SENEGAL"]
["Serbia",131,null,null,null,null,null,0,null,null,null,null,null,null,null,null,null,null,null,null,null,null,null,null,null,null,null,null,null,null,0,0,null,null,null,null,null,null,null,null,null,null,null,"RS","SERBIA"]
["Sierra Leone",132,null,null,null,null,null,0,null,null,null,null,null,null,null,null,null,null,null,null,null,null,null,null,null,null,null,null,null,null,0,0,null,null,null,null,null,null,null,null,null,null,null,"SL","SIERRALEON"]
["Singapore",133,null,null,null,null,null,{"$f":"SUM(C140:G140)","v":0},null,null,null,null,null,null,null,null,null,null,null,null,null,null,null,null,null,null,null,null,null,null,0,0,null,null,null,null,null,null,null,null,null,null,null,"SG","SINGAPORE"]
["Slovak Republic",134,null,null,null,null,null,0,null,null,null,null,null,null,null,null,null,null,null,null,null,null,null,null,null,null,null,null,null,null,0,0,null,null,null,null,null,null,null,null,null,null,null,"SK","SLOVAKIA"]
["Slovenia",135,null,null,null,null,null,0,null,null,null,null,null,null,null,null,null,null,null,null,null,null,null,null,null,null,null,null,null,null,0,0,null,null,null,null,null,null,null,null,null,null,null,"SI","SLOVENIA"]
["South Africa",136,null,null,null,null,null,0,null,null,null,null,null,null,null,null,null,null,null,null,null,null,null,null,null,null,null,null,null,null,0,0,null,null,null,null,null,null,null,null,null,null,null,"ZA","SOUTHAFRIC"]
["South Sudan",137,null,null,null,null,null,0,null,null,null,null,null,null,null,null,null,null,null,null,null,null,null,null,null,null,null,null,null,null,0,0,null,null,null,null,null,null,null,null,null,null,null,"SS","SSUDAN"]
["Spain",138,null,null,null,null,null,0,null,null,null,null,null,null,null,null,null,null,null,null,null,null,null,null,null,null,null,null,null,null,0,0,null,null,null,null,null,null,null,null,null,null,null,"ES","SPAIN"]
["Sri Lanka",139,null,null,null,null,null,0,null,null,null,null,null,null,null,null,null,null,null,null,null,null,null,null,null,null,null,null,null,null,0,0,null,null,null,null,null,null,null,null,null,null,null,"LK","SRILANKA"]
["Sudan",140,null,null,null,null,null,0,null,null,null,null,null,null,null,null,null,null,null,null,null,null,null,null,null,null,null,null,null,null,0,0,null,null,null,null,null,null,null,null,null,null,null,"SD","SUDAN"]
["Sweden",141,null,null,null,null,null,0,null,null,null,null,null,null,null,null,null,null,null,null,null,null,null,null,null,null,null,null,null,null,0,0,null,null,null,null,null,null,null,null,null,null,null,"SE","SWEDEN"]
["Switzerland",142,null,null,null,null,null,0,null,null,null,null,null,null,null,null,null,null,null,null,null,null,null,null,null,null,null,null,null,null,0,0,null,null,null,null,null,null,null,null,null,null,null,"CH","SWITLAND"]
["Syrian Arab Republic",143,null,null,null,null,null,0,null,null,null,null,null,null,null,null,null,null,null,null,null,null,null,null,null,null,null,null,null,null,0,0,null,null,null,null,null,null,null,null,null,null,null,"SY","SYRIA"]
["Taiwan / Chinese Taipei",144,null,null,null,null,null,0,null,null,null,null,null,null,null,null,null,null,null,null,null,null,null,null,null,null,null,null,null,null,0,0,null,null,null,null,null,null,null,null,null,null,null,"TW","TAIPEI"]
["Tajikistan",145,null,null,null,null,null,0,null,null,null,null,null,null,null,null,null,null,null,null,null,null,null,null,null,null,null,null,null,null,0,0,null,null,null,null,null,null,null,null,null,null,null,"TJ","TAJIKISTAN"]
["Tanzania, United Republic of",146,null,null,null,null,null,0,null,null,null,null,null,null,null,null,null,null,null,null,null,null,null,null,null,null,null,null,null,null,0,0,null,null,null,null,null,null,null,null,null,null,null,"TZ","TANZANIA"]
["Thailand",147,null,null,null,null,null,0,null,null,null,null,null,null,null,null,null,null,null,null,null,null,null,null,null,null,null,null,null,null,0,0,null,null,null,null,null,null,null,null,null,null,null,"TH","THAILAND"]
["Timor-Leste",148,null,null,null,null,null,0,null,null,null,null,null,null,null,null,null,null,null,null,null,null,null,null,null,null,null,null,null,null,0,0,null,null,null,null,null,null,null,null,null,null,null,"TL","TIMORLESTE"]
["Togo",149,null,null,null,null,null,0,null,null,null,null,null,null,null,null,null,null,null,null,null,null,null,null,null,null,null,null,null,null,0,0,null,null,null,null,null,null,null,null,null,null,null,"TG","TOGO"]
["Trinidad and Tobago",150,null,null,null,null,null,0,null,null,null,null,null,null,null,null,null,null,null,null,null,null,null,null,null,null,null,null,null,null,0,0,null,null,null,null,null,null,null,null,null,null,null,"TT","TRINIDAD"]
["Tunisia",151,null,null,null,null,null,0,null,null,null,null,null,null,null,null,null,null,null,null,null,null,null,null,null,null,null,null,null,null,0,0,null,null,null,null,null,null,null,null,null,null,null,"TN","TUNISIA"]
["Turkey",152,null,null,null,null,null,0,null,null,null,null,null,null,null,null,null,null,null,null,null,null,null,null,null,null,null,null,null,null,0,0,null,null,null,null,null,null,null,null,null,null,null,"TR","TURKEY"]
["Turkmenistan",153,null,null,null,null,null,0,null,null,null,null,null,null,null,null,null,null,null,null,null,null,null,null,null,null,null,null,null,null,0,0,null,null,null,null,null,null,null,null,null,null,null,"TM","TURKMENIST"]
["Uganda",154,null,null,null,null,null,0,null,null,null,null,null,null,null,null,null,null,null,null,null,null,null,null,null,null,null,null,null,null,0,0,null,null,null,null,null,null,null,null,null,null,null,"UG","UGANDA"]
["Ukraine",155,null,null,null,null,null,0,null,null,null,null,null,null,null,null,null,null,null,null,null,null,null,null,null,null,null,null,null,null,0,0,null,null,null,null,null,null,null,null,null,null,null,"UA","UKRAINE"]
["United Arab Emirates",156,null,null,null,null,null,0,null,null,null,null,null,null,null,null,null,null,null,null,null,null,null,null,null,null,null,null,null,null,0,0,null,null,null,null,null,null,null,null,null,null,null,"AE","UAE"]
["United Kingdom",157,null,null,null,null,null,0,null,null,null,null,null,null,null,null,null,null,null,null,null,null,null,null,null,null,null,null,null,null,0,0,null,null,null,null,null,null,null,null,null,null,null,"GB","UK"]
["United States",158,null,null,null,null,null,0,null,null,null,null,null,null,null,null,null,null,null,null,null,null,null,null,null,null,null,null,null,null,0,0,null,null,null,null,null,null,null,null,null,null,null,"US","USA"]
["Uruguay",159,null,null,null,null,null,0,null,null,null,null,null,null,null,null,null,null,null,null,null,null,null,null,null,null,null,null,null,null,0,0,null,null,null,null,null,null,null,null,null,null,null,"UY","URUGUAY"]
["Uzbekistan",160,null,null,null,null,null,0,null,null,null,null,null,null,null,null,null,null,null,null,null,null,null,null,null,null,null,null,null,null,0,0,null,null,null,null,null,null,null,null,null,null,null,"UZ","UZBEKISTAN"]
["Venezuela, Bolivarian Republic",161,null,null,null,null,null,0,null,null,null,null,null,null,null,null,null,null,null,null,null,null,null,null,null,null,null,null,null,null,0,0,null,null,null,null,null,null,null,null,null,null,null,"VE","VENEZUELA"]
["Viet Nam",162,null,null,null,null,null,0,null,null,null,null,null,null,null,null,null,null,null,null,null,null,null,null,null,null,null,null,null,null,0,0,null,null,null,null,null,null,null,null,null,null,null,"VN","VIETNAM"]
["Yemen",163,null,null,null,null,null,0,null,null,null,null,null,null,null,null,null,null,null,null,null,null,null,null,null,null,null,null,null,null,0,0,0," ",null,null,null,null,null,null,null,null,null,"YE","YEMEN"]
["Not elsewhere specified",164,null,null,null,null,null,0,null,null,null,null,null,null,null,null,null,null,null,null,null,null,null,null,null,null,null,null,null,null,0,0,0," ",null,null,null,null,null,null,null,null,null,"Y3","NONSPEC"]
["Total Imports1 2",165,{"$f":"SUM(C8:C171)","v":0},0,0,0,0,0,0,0,0,0,0,0,0,0,0,0,0,0,0,0,0,0,0,0,0,0,0,0,{"$f":"SUM(AE8:AE171)","v":0},0,0," ",null,null,null,null,null,null,null,null,null,"Y2","TOTIMPST"]
[null,null,{"$f":"IF(MIN(C8:C172)<0,\"Negative number\",\"\")","v":""},{"$f":"IF(MIN(D8:D172)<0,\"Negative number\",\"\")","v":""},"","","","","","","","","","","","","","","","","","","","","","","","","","","",""]
[]
["1. Total Imports of Total (F105) should be equal to Imports (Balance) of Total in Table 1 (G5)",null,null,null,null,null,null,{"$f":"H172-MOS_Table_1!J18","v":0},{"$f":"IF(H175=0,\"OK\",\"Total Imports of Total is not equal to Imports (Balance) of Total in Table 1.\")","v":"OK"}]
["    and Total Imports of Total products (AC105) should be equal to Imports (Balance) of Total products in Table 2 (Z5).",null,null,null,null,null,null,{"$f":"AE172-MOS_Table_2!AC12","v":0},{"$f":"IF(H176=0,\"OK\",\"Total Imports of Total products is not equal to Imports (Balance) for Total products in Table 2.\")","v":"OK"}]
["2. Total Imports should be equal to the sum of its components for Total (column F) ",null,null,null,null,null,null,{"$f":"H172-SUM(H8:H171)","v":0},{"$f":"IF(H177=0,\"OK\",\"Total Imports is not equal to the sum of its components for Total (column F).\")","v":"OK"}]
["    and for Total products (column AC).",null,null,null,null,null,null,{"$f":"AE172-SUM(AE8:AE171)","v":0},{"$f":"IF(H178=0,\"OK\",\"Total Imports is not equal to the sum of its components for Total products.\")","v":"OK"}]
[]
[]
[]
[]
[]
[]
[]
[]
[]
[]
[]
["Products è",null,"CRUDEOIL","NGL","REFFEEDS","ADDITIVE","NONCRUDE","CRNGFEED","ETHANE","LPG","NAPHTHA","MOTORGAS","BIOGASOL","NONBIOGASO","AVGAS","JETGAS","JETKERO","BIOJETKERO","NONBIOJETK","OTHKERO","DIESEL","HEATOIL","GASDIES","BIODIESEL","NONBIODIES","RESFUEL","LOWSULF","HIGHSULF","PETCOKE","OPRODS","TOTPRODS","TOTALOIL"]

{"sheet":"MOS_Table_4","index":8,"n_rows":199,"n_cols":45,"rows_kept":199,"cut":false,"hidden":true,"merged":[[4,30,5,30],[4,31,5,31],[4,33,5,33],[4,16,5,16],[4,19,5,19],[4,22,5,22],[4,25,5,25],[4,28,5,28],[4,29,5,29],[4,15,5,15],[4,2,5,2],[4,3,5,3],[4,4,5,4],[4,5,5,5],[4,6,5,6],[4,7,5,7],[4,8,5,8],[4,9,5,9],[4,10,5,10],[4,11,5,11],[4,14,5,14]]}
["MONTHLY OIL AND GAS QUESTIONNAIRE"]
[{"$f":"CountryMessage","v":"(select your country on the 'Start' sheet)"}]
[{"$f":"FirstMonth & \" \" & QuestYear","v":"MONTH ? 2022"},null,null,null,null,null,null,null,null,null,null,null,null,null,null,null,null,null,null,null,null,null,null,null,null,null,null,null,null,null,null,null,null,null,null,null,null,null,null,null,null,null,null,null,"Datatype"]
["Table 4: EXPORTS BY DESTINATION",null,null,null,null,null,null,null,null,null,null,null,null,null,null,null,null,null,null,null,null,null,null,null,null,null,null,null,null,null,null,"Unit:  Thousand Metric Tons",null,null,null,null,null,null,null,null,null,null,null,null,"EXPORTS"]
[null,null,"Crude\noil","Natural\ngas\nliquids","Refinery\nfeedstocks","Additives /\noxygenates","Other\nhydro-carbons","Total\n(A to E)","Ethane","LPG","Naphtha","Total motor\ngasoline",null,null,"Aviation\ngasoline","Gasoline\ntype\njet fuel","Total\nkerosene\ntype\njet fuel",null,null,"Other\nkerosene",null,null,"Total\ngas/diesel\noil",null,null,"Total \nfuel oil",null,null,"Petroleum coke","Other products","Total products","Total\noil",null,"Probate"]
[null,null,null,null,null,null,null,null,null,null,null,null,"Biogasoline","Non-biogasoline",null,null,null,"Bio jet\nkerosene","Non-bio jet\nkerosene",null,"Road diesel","Heating and\nother gas oil",null,"Biodiesels","Non-bio\ngas/diesel\noil",null,"Fuel oil-\nlow sulphur \n(<1%)","Fuel oil-\nhigh sulphur\n (>=1%)"]
[null,null,"A","B","C","D","E","F","G","H","I","J","K","L","M","N","O","P","Q","R","S","T","U","V","W","X","Y","Z","AA","AB","AC","AD",null,"AE",null,null,null,null,null,null,null,null,null,"Item1 ê"]
["Albania",1,null,null,null,null,null,{"$f":"SUM(C8:G8)","v":0},null,null,null,null,null,null,null,null,null,null,null,null,null,null,null,null,null,null,null,null,null,null,{"$f":"SUM(I8:K8,L8,O8:Q8,T8,W8,Z8,AC8:AD8)","v":0},{"$f":"SUM(H8,AE8)","v":0},{"$f":"IF(H8-SUM(C8:G8)=0,0,1)+IF(AE8-SUM(I8:L8,O8:Q8,T8,W8,Z8,AC8:AD8)=0,0,1)+IF(AF8-SUM(AE8,H8)=0,0,1)","v":0},{"$f":"IF(AG8=0,\" \",IF(AG8=1,\"A total is not equal to the sum of its components: \",AG8&\" totals are not equal to the sum of their components: \"))&IF(AG8=0,\"\",IF(H8-SUM(C8:G8)=0,\"\",\"Total (column F). \")&IF(AE8-SUM(I8:L8,O8:Q8,T8,W8,Z8,AC8:AD8)=0,\"\",\"Total products. \")&IF(AF8-SUM(AE8,H8)=0,\"\",\"Total oil.\"))","v":" "},null,null,null,null,null,null,null,null,null,"AL","ALBANIA"]
["Algeria",2,null,null,null,null,null,{"$f":"SUM(C9:G9)","v":0},null,null,null,null,null,null,null,null,null,null,null,null,null,null,null,null,null,null,null,null,null,null,{"$f":"SUM(I9:K9,L9,O9:Q9,T9,W9,Z9,AC9:AD9)","v":0},{"$f":"SUM(H9,AE9)","v":0},{"$f":"IF(H9-SUM(C9:G9)=0,0,1)+IF(AE9-SUM(I9:L9,O9:Q9,T9,W9,Z9,AC9:AD9)=0,0,1)+IF(AF9-SUM(AE9,H9)=0,0,1)","v":0},{"$f":"IF(AG9=0,\" \",IF(AG9=1,\"A total is not equal to the sum of its components: \",AG9&\" totals are not equal to the sum of their components: \"))&IF(AG9=0,\"\",IF(H9-SUM(C9:G9)=0,\"\",\"Total (column F). \")&IF(AE9-SUM(I9:L9,O9:Q9,T9,W9,Z9,AC9:AD9)=0,\"\",\"Total products. \")&IF(AF9-SUM(AE9,H9)=0,\"\",\"Total oil.\"))","v":" "},null,null,null,null,null,null,null,null,null,"DZ","ALGERIA"]
["Andorra",3,null,null,null,null,null,0,null,null,null,null,null,null,null,null,null,null,null,null,null,null,null,null,null,null,null,null,null,null,0,0,{"$f":"IF(H10-SUM(C10:G10)=0,0,1)+IF(AE10-SUM(I10:L10,O10:Q10,T10,W10,Z10,AC10:AD10)=0,0,1)+IF(AF10-SUM(AE10,H10)=0,0,1)","v":0},{"$f":"IF(AG10=0,\" \",IF(AG10=1,\"A total is not equal to the sum of its components: \",AG10&\" totals are not equal to the sum of their components: \"))&IF(AG10=0,\"\",IF(H10-SUM(C10:G10)=0,\"\",\"Total (column F). \")&IF(AE10-SUM(I10:L10,O10:Q10,T10,W10,Z10,AC10:AD10)=0,\"\",\"Total products. \")&IF(AF10-SUM(AE10,H10)=0,\"\",\"Total oil.\"))","v":" "},null,null,null,null,null,null,null,null,null,"AD","ANDORRA"]
["Angola",4,null,null,null,null,null,0,null,null,null,null,null,null,null,null,null,null,null,null,null,null,null,null,null,null,null,null,null,null,0,0,{"$f":"IF(H11-SUM(C11:G11)=0,0,1)+IF(AE11-SUM(I11:L11,O11:Q11,T11,W11,Z11,AC11:AD11)=0,0,1)+IF(AF11-SUM(AE11,H11)=0,0,1)","v":0},{"$f":"IF(AG11=0,\" \",IF(AG11=1,\"A total is not equal to the sum of its components: \",AG11&\" totals are not equal to the sum of their components: \"))&IF(AG11=0,\"\",IF(H11-SUM(C11:G11)=0,\"\",\"Total (column F). \")&IF(AE11-SUM(I11:L11,O11:Q11,T11,W11,Z11,AC11:AD11)=0,\"\",\"Total products. \")&IF(AF11-SUM(AE11,H11)=0,\"\",\"Total oil.\"))","v":" "},null,null,null,null,null,null,null,null,null,"AO","ANGOLA"]
["Argentina",5,null,null,null,null,null,0,null,null,null,null,null,null,null,null,null,null,null,null,null,null,null,null,null,null,null,null,null,null,0,0,0," ",null,null,null,null,null,null,null,null,null,"AR","ARGENTINA"]
["Armenia",6,null,null,null,null,null,0,null,null,null,null,null,null,null,null,null,null,null,null,null,null,null,null,null,null,null,null,null,null,0,0,0," ",null,null,null,null,null,null,null,null,null,"AM","ARMENIA"]
["Aruba",7,null,null,null,null,null,0,null,null,null,null,null,null,null,null,null,null,null,null,null,null,null,null,null,null,null,null,null,null,0,0,0," ",null,null,null,null,null,null,null,null,null,"AW","ARUBA"]
["Australia",8,null,null,null,null,null,0,null,null,null,null,null,null,null,null,null,null,null,null,null,null,null,null,null,null,null,null,null,null,0,0,0," ",null,null,null,null,null,null,null,null,null,"AU","AUSTRALI"]
["Austria",9,null,null,null,null,null,0,null,null,null,null,null,null,null,null,null,null,null,null,null,null,null,null,null,null,null,null,null,null,0,0,0," ",null,null,null,null,null,null,null,null,null,"AT","AUSTRIA"]
["Azerbaijan",10,null,null,null,null,null,0,null,null,null,null,null,null,null,null,null,null,null,null,null,null,null,null,null,null,null,null,null,null,0,0,0," ",null,null,null,null,null,null,null,null,null,"AZ","AZERBAIJAN"]
["Bahamas",11,null,null,null,null,null,0,null,null,null,null,null,null,null,null,null,null,null,null,null,null,null,null,null,null,null,null,null,null,0,0,0," ",null,null,null,null,null,null,null,null,null,"BS","BAHAMAS"]
["Bahrain",12,null,null,null,null,null,0,null,null,null,null,null,null,null,null,null,null,null,null,null,null,null,null,null,null,null,null,null,null,0,0,0," ",null,null,null,null,null,null,null,null,null,"BH","BAHRAIN"]
["Bangladesh",13,null,null,null,null,null,0,null,null,null,null,null,null,null,null,null,null,null,null,null,null,null,null,null,null,null,null,null,null,0,0,0," ",null,null,null,null,null,null,null,null,null,"BD","BANGLADESH"]
["Barbados",14,null,null,null,null,null,0,null,null,null,null,null,null,null,null,null,null,null,null,null,null,null,null,null,null,null,null,null,null,0,0,0," ",null,null,null,null,null,null,null,null,null,"BB","BARBADOS"]
["Belarus",15,null,null,null,null,null,0,null,null,null,null,null,null,null,null,null,null,null,null,null,null,null,null,null,null,null,null,null,null,0,0,0," ",null,null,null,null,null,null,null,null,null,"BY","BELARUS"]
["Belgium",16,null,null,null,null,null,0,null,null,null,null,null,null,null,null,null,null,null,null,null,null,null,null,null,null,null,null,null,null,0,0,0," ",null,null,null,null,null,null,null,null,null,"BE","BELGIUM"]
["Belize",17,null,null,null,null,null,0,null,null,null,null,null,null,null,null,null,null,null,null,null,null,null,null,null,null,null,null,null,null,0,0,0," ",null,null,null,null,null,null,null,null,null,"BZ","BELIZE"]
["Benin",18,null,null,null,null,null,0,null,null,null,null,null,null,null,null,null,null,null,null,null,null,null,null,null,null,null,null,null,null,0,0,0," ",null,null,null,null,null,null,null,null,null,"BJ","BENIN"]
["Bolivia",19,null,null,null,null,null,0,null,null,null,null,null,null,null,null,null,null,null,null,null,null,null,null,null,null,null,null,null,null,0,0,0," ",null,null,null,null,null,null,null,null,null,"BO","BOLIVIA"]
["Bosnia and Herzegovina",20,null,null,null,null,null,0,null,null,null,null,null,null,null,null,null,null,null,null,null,null,null,null,null,null,null,null,null,null,0,0,0," ",null,null,null,null,null,null,null,null,null,"BA","BOSNIAHERZ"]
["Brazil",21,null,null,null,null,null,0,null,null,null,null,null,null,null,null,null,null,null,null,null,null,null,null,null,null,null,null,null,null,0,0,0," ",null,null,null,null,null,null,null,null,null,"BR","BRAZIL"]
["British Virgin Islands",22,null,null,null,null,null,0,null,null,null,null,null,null,null,null,null,null,null,null,null,null,null,null,null,null,null,null,null,null,0,0,0," ",null,null,null,null,null,null,null,null,null,"VG","BRITVIRGIN"]
["Brunei Darussalam",23,null,null,null,null,null,0,null,null,null,null,null,null,null,null,null,null,null,null,null,null,null,null,null,null,null,null,null,null,0,0,0," ",null,null,null,null,null,null,null,null,null,"BN","BRUNEI"]
["Bulgaria",24,null,null,null,null,null,0,null,null,null,null,null,null,null,null,null,null,null,null,null,null,null,null,null,null,null,null,null,null,0,0,0," ",null,null,null,null,null,null,null,null,null,"BG","BULGARIA"]
["Cambodia",25,null,null,null,null,null,0,null,null,null,null,null,null,null,null,null,null,null,null,null,null,null,null,null,null,null,null,null,null,0,0,0," ",null,null,null,null,null,null,null,null,null,"KH","CAMBODIA"]
["Cameroon",26,null,null,null,null,null,0,null,null,null,null,null,null,null,null,null,null,null,null,null,null,null,null,null,null,null,null,null,null,0,0,0," ",null,null,null,null,null,null,null,null,null,"CM","CAMEROON"]
["Canada",27,null,null,null,null,null,0,null,null,null,null,null,null,null,null,null,null,null,null,null,null,null,null,null,null,null,null,null,null,0,0,0," ",null,null,null,null,null,null,null,null,null,"CA","CANADA"]
["Cape Verde / Cabo Verde",28,null,null,null,null,null,0,null,null,null,null,null,null,null,null,null,null,null,null,null,null,null,null,null,null,null,null,null,null,0,0,0," ",null,null,null,null,null,null,null,null,null,"CV","CABOVERDE"]
["Chile",29,null,null,null,null,null,0,null,null,null,null,null,null,null,null,null,null,null,null,null,null,null,null,null,null,null,null,null,null,0,0,0," ",null,null,null,null,null,null,null,null,null,"CL","CHILE"]
["China, People's Republic of",30,null,null,null,null,null,0,null,null,null,null,null,null,null,null,null,null,null,null,null,null,null,null,null,null,null,null,null,null,0,0,0," ",null,null,null,null,null,null,null,null,null,"CN","CHINA"]
["Colombia",31,null,null,null,null,null,0,null,null,null,null,null,null,null,null,null,null,null,null,null,null,null,null,null,null,null,null,null,null,0,0,0," ",null,null,null,null,null,null,null,null,null,"CO","COLOMBIA"]
["Congo",32,null,null,null,null,null,0,null,null,null,null,null,null,null,null,null,null,null,null,null,null,null,null,null,null,null,null,null,null,0,0,0," ",null,null,null,null,null,null,null,null,null,"CG","CONGO"]
["Costa Rica",33,null,null,null,null,null,0,null,null,null,null,null,null,null,null,null,null,null,null,null,null,null,null,null,null,null,null,null,null,0,0,0," ",null,null,null,null,null,null,null,null,null,"CR","COSTARICA"]
["Côte d’Ivoire",34,null,null,null,null,null,0,null,null,null,null,null,null,null,null,null,null,null,null,null,null,null,null,null,null,null,null,null,null,0,0,0," ",null,null,null,null,null,null,null,null,null,"CI","COTEIVOIRE"]
["Croatia",35,null,null,null,null,null,0,null,null,null,null,null,null,null,null,null,null,null,null,null,null,null,null,null,null,null,null,null,null,0,0,0," ",null,null,null,null,null,null,null,null,null,"HR","CROATIA"]
["Cuba",36,null,null,null,null,null,0,null,null,null,null,null,null,null,null,null,null,null,null,null,null,null,null,null,null,null,null,null,null,0,0,0," ",null,null,null,null,null,null,null,null,null,"CU","CUBA"]
["Curaçao",37,null,null,null,null,null,0,null,null,null,null,null,null,null,null,null,null,null,null,null,null,null,null,null,null,null,null,null,null,0,0,0," ",null,null,null,null,null,null,null,null,null,"CW","CURACAO"]
["Cyprus",38,null,null,null,null,null,0,null,null,null,null,null,null,null,null,null,null,null,null,null,null,null,null,null,null,null,null,null,null,0,0,0," ",null,null,null,null,null,null,null,null,null,"CY","CYPRUS"]
["Czech Republic",39,null,null,null,null,null,0,null,null,null,null,null,null,null,null,null,null,null,null,null,null,null,null,null,null,null,null,null,null,0,0,0," ",null,null,null,null,null,null,null,null,null,"CZ","CZECH"]
["Korea, Democratic People's Republic of",40,null,null,null,null,null,0,null,null,null,null,null,null,null,null,null,null,null,null,null,null,null,null,null,null,null,null,null,null,0,0,0," ",null,null,null,null,null,null,null,null,null,"KP","KOREADPR"]
["Congo, Democratic Republic of the",41,null,null,null,null,null,0,null,null,null,null,null,null,null,null,null,null,null,null,null,null,null,null,null,null,null,null,null,null,0,0,0," ",null,null,null,null,null,null,null,null,null,"CD","CONGOREP"]
["Denmark",42,null,null,null,null,null,0,null,null,null,null,null,null,null,null,null,null,null,null,null,null,null,null,null,null,null,null,null,null,0,0,0," ",null,null,null,null,null,null,null,null,null,"DK","DENMARK"]
["Djibouti",43,null,null,null,null,null,0,null,null,null,null,null,null,null,null,null,null,null,null,null,null,null,null,null,null,null,null,null,null,0,0,0," ",null,null,null,null,null,null,null,null,null,"DJ","DJIBOUTI"]
["Dominican Republic",44,null,null,null,null,null,0,null,null,null,null,null,null,null,null,null,null,null,null,null,null,null,null,null,null,null,null,null,null,0,0,0," ",null,null,null,null,null,null,null,null,null,"DO","DOMINICANR"]
["Ecuador",45,null,null,null,null,null,0,null,null,null,null,null,null,null,null,null,null,null,null,null,null,null,null,null,null,null,null,null,null,0,0,0," ",null,null,null,null,null,null,null,null,null,"EC","ECUADOR"]
["Egypt",46,null,null,null,null,null,{"$f":"SUM(C53:G53)","v":0},null,null,null,null,null,null,null,null,null,null,null,null,null,null,null,null,null,null,null,null,null,null,0,{"$f":"SUM(H53,AE53)","v":0},0," ",null,null,null,null,null,null,null,null,null,"EG","EGYPT"]
["Equatorial Guinea",47,null,null,null,null,null,0,null,null,null,null,null,null,null,null,null,null,null,null,null,null,null,null,null,null,null,null,null,null,0,0,0," ",null,null,null,null,null,null,null,null,null,"GQ","EQGUINEA"]
["Eritrea",48,null,null,null,null,null,0,null,null,null,null,null,null,null,null,null,null,null,null,null,null,null,null,null,null,null,null,null,null,0,0,0," ",null,null,null,null,null,null,null,null,null,"ER","ERITREA"]
["Estonia",49,null,null,null,null,null,0,null,null,null,null,null,null,null,null,null,null,null,null,null,null,null,null,null,null,null,null,null,null,0,0,0," ",null,null,null,null,null,null,null,null,null,"EE","ESTONIA"]
["Ethiopia",50,null,null,null,null,null,0,null,null,null,null,null,null,null,null,null,null,null,null,null,null,null,null,null,null,null,null,null,null,0,0,0," ",null,null,null,null,null,null,null,null,null,"ET","ETHIOPIA"]
["Finland",51,null,null,null,null,null,0,null,null,null,null,null,null,null,null,null,null,null,null,null,null,null,null,null,null,null,null,null,null,0,0,0," ",null,null,null,null,null,null,null,null,null,"FI","FINLAND"]
["France",52,null,null,null,null,null,0,null,null,null,null,null,null,null,null,null,null,null,null,null,null,null,null,null,null,null,null,null,null,0,0,0," ",null,null,null,null,null,null,null,null,null,"FR","FRANCE"]
["Gabon",53,null,null,null,null,null,0,null,null,null,null,null,null,null,null,null,null,null,null,null,null,null,null,null,null,null,null,null,null,0,0,0," ",null,null,null,null,null,null,null,null,null,"GA","GABON"]
["Georgia",54,null,null,null,null,null,0,null,null,null,null,null,null,null,null,null,null,null,null,null,null,null,null,null,null,null,null,null,null,0,0,0," ",null,null,null,null,null,null,null,null,null,"GE","GEORGIA"]
["Germany",55,null,null,null,null,null,0,null,null,null,null,null,null,null,null,null,null,null,null,null,null,null,null,null,null,null,null,null,null,0,0,0," ",null,null,null,null,null,null,null,null,null,"DE","GERMANY"]
["Ghana",56,null,null,null,null,null,0,null,null,null,null,null,null,null,null,null,null,null,null,null,null,null,null,null,null,null,null,null,null,0,0,0," ",null,null,null,null,null,null,null,null,null,"GH","GHANA"]
["Gibraltar",57,null,null,null,null,null,0,null,null,null,null,null,null,null,null,null,null,null,null,null,null,null,null,null,null,null,null,null,null,0,0,0," ",null,null,null,null,null,null,null,null,null,"GI","GIBRALTAR"]
["Greece",58,null,null,null,null,null,0,null,null,null,null,null,null,null,null,null,null,null,null,null,null,null,null,null,null,null,null,null,null,0,0,0," ",null,null,null,null,null,null,null,null,null,"GR","GREECE"]
["Guatemala",59,null,null,null,null,null,0,null,null,null,null,null,null,null,null,null,null,null,null,null,null,null,null,null,null,null,null,null,null,0,0,0," ",null,null,null,null,null,null,null,null,null,"GT","GUATEMALA"]
["Guinea-Bissau",60,null,null,null,null,null,0,null,null,null,null,null,null,null,null,null,null,null,null,null,null,null,null,null,null,null,null,null,null,0,0,0," ",null,null,null,null,null,null,null,null,null,"GW","GUINEABIS"]
["Honduras",61,null,null,null,null,null,0,null,null,null,null,null,null,null,null,null,null,null,null,null,null,null,null,null,null,null,null,null,null,0,0,0," ",null,null,null,null,null,null,null,null,null,"HN","HONDURAS"]
["Hong Kong, China",62,null,null,null,null,null,0,null,null,null,null,null,null,null,null,null,null,null,null,null,null,null,null,null,null,null,null,null,null,0,0,0," ",null,null,null,null,null,null,null,null,null,"HK","HONGKONG"]
["Hungary",63,null,null,null,null,null,0,null,null,null,null,null,null,null,null,null,null,null,null,null,null,null,null,null,null,null,null,null,null,0,0,0," ",null,null,null,null,null,null,null,null,null,"HU","HUNGARY"]
["Iceland",64,null,null,null,null,null,0,null,null,null,null,null,null,null,null,null,null,null,null,null,null,null,null,null,null,null,null,null,null,0,0,0," ",null,null,null,null,null,null,null,null,null,"IS","ICELAND"]
["India",65,null,null,null,null,null,0,null,null,null,null,null,null,null,null,null,null,null,null,null,null,null,null,null,null,null,null,null,null,0,0,0," ",null,null,null,null,null,null,null,null,null,"IN","INDIA"]
["Indonesia",66,null,null,null,null,null,{"$f":"SUM(C73:G73)","v":0},null,null,null,null,null,null,null,null,null,null,null,null,null,null,null,null,null,null,null,null,null,null,{"$f":"SUM(I73:K73,L73,O73:Q73,T73,W73,Z73,AC73:AD73)","v":0},{"$f":"SUM(H73,AE73)","v":0},{"$f":"IF(H73-SUM(C73:G73)=0,0,1)+IF(AE73-SUM(I73:L73,O73:Q73,T73,W73,Z73,AC73:AD73)=0,0,1)+IF(AF73-SUM(AE73,H73)=0,0,1)","v":0},{"$f":"IF(AG73=0,\" \",IF(AG73=1,\"A total is not equal to the sum of its components: \",AG73&\" totals are not equal to the sum of their components: \"))&IF(AG73=0,\"\",IF(H73-SUM(C73:G73)=0,\"\",\"Total (column F). \")&IF(AE73-SUM(I73:L73,O73:Q73,T73,W73,Z73,AC73:AD73)=0,\"\",\"Total products. \")&IF(AF73-SUM(AE73,H73)=0,\"\",\"Total oil.\"))","v":" "},null,null,null,null,null,null,null,null,null,"ID","INDONESIA"]
["Iran, Islamic Republic of",67,null,null,null,null,null,0,null,null,null,null,null,null,null,null,null,null,null,null,null,null,null,null,null,null,null,null,null,null,0,0,0," ",null,null,null,null,null,null,null,null,null,"IR","IRAN"]
["Iraq",68,null,null,null,null,null,0,null,null,null,null,null,null,null,null,null,null,null,null,null,null,null,null,null,null,null,null,null,null,0,0,0," ",null,null,null,null,null,null,null,null,null,"IQ","IRAQ"]
["Ireland",69,null,null,null,null,null,0,null,null,null,null,null,null,null,null,null,null,null,null,null,null,null,null,null,null,null,null,null,null,0,0,0," ",null,null,null,null,null,null,null,null,null,"IE","IRELAND"]
["Israel",70,null,null,null,null,null,0,null,null,null,null,null,null,null,null,null,null,null,null,null,null,null,null,null,null,null,null,null,null,0,0,0," ",null,null,null,null,null,null,null,null,null,"IL","ISRAEL"]
["Italy",71,null,null,null,null,null,0,null,null,null,null,null,null,null,null,null,null,null,null,null,null,null,null,null,null,null,null,null,null,0,0,0," ",null,null,null,null,null,null,null,null,null,"IT","ITALY"]
["Jamaica",72,null,null,null,null,null,0,null,null,null,null,null,null,null,null,null,null,null,null,null,null,null,null,null,null,null,null,null,null,0,0,0," ",null,null,null,null,null,null,null,null,null,"JM","JAMAICA"]
["Japan",73,null,null,null,null,null,0,null,null,null,null,null,null,null,null,null,null,null,null,null,null,null,null,null,null,null,null,null,null,0,0,0," ",null,null,null,null,null,null,null,null,null,"JP","JAPAN"]
["Jordan",74,null,null,null,null,null,0,null,null,null,null,null,null,null,null,null,null,null,null,null,null,null,null,null,null,null,null,null,null,0,0,0," ",null,null,null,null,null,null,null,null,null,"JO","JORDAN"]
["Kazakhstan",75,null,null,null,null,null,0,null,null,null,null,null,null,null,null,null,null,null,null,null,null,null,null,null,null,null,null,null,null,0,0,0," ",null,null,null,null,null,null,null,null,null,"KZ","KAZAKHSTAN"]
["Kenya",76,null,null,null,null,null,0,null,null,null,null,null,null,null,null,null,null,null,null,null,null,null,null,null,null,null,null,null,null,0,0,0," ",null,null,null,null,null,null,null,null,null,"KE","KENYA"]
["Korea",77,null,null,null,null,null,0,null,null,null,null,null,null,null,null,null,null,null,null,null,null,null,null,null,null,null,null,null,null,0,0,0," ",null,null,null,null,null,null,null,null,null,"KR","KOREA"]
["Kosovo*",78,null,null,null,null,null,0,null,null,null,null,null,null,null,null,null,null,null,null,null,null,null,null,null,null,null,null,null,null,0,0,0," ",null,null,null,null,null,null,null,null,null,"XK","KOSOVO"]
["Kuwait",79,null,null,null,null,null,0,null,null,null,null,null,null,null,null,null,null,null,null,null,null,null,null,null,null,null,null,null,null,0,0,0," ",null,null,null,null,null,null,null,null,null,"KW","KUWAIT"]
["Kyrgyzstan",80,null,null,null,null,null,0,null,null,null,null,null,null,null,null,null,null,null,null,null,null,null,null,null,null,null,null,null,null,0,0,0," ",null,null,null,null,null,null,null,null,null,"KG","KYRGYZSTAN"]
["Lao People's Democratic Republic",81,null,null,null,null,null,0,null,null,null,null,null,null,null,null,null,null,null,null,null,null,null,null,null,null,null,null,null,null,0,0,0," ",null,null,null,null,null,null,null,null,null,"LA","LAO"]
["Latvia",82,null,null,null,null,null,0,null,null,null,null,null,null,null,null,null,null,null,null,null,null,null,null,null,null,null,null,null,null,0,0,0," ",null,null,null,null,null,null,null,null,null,"LV","LATVIA"]
["Lebanon",83,null,null,null,null,null,0,null,null,null,null,null,null,null,null,null,null,null,null,null,null,null,null,null,null,null,null,null,null,0,0,0," ",null,null,null,null,null,null,null,null,null,"LB","LEBANON"]
["Liberia",84,null,null,null,null,null,0,null,null,null,null,null,null,null,null,null,null,null,null,null,null,null,null,null,null,null,null,null,null,0,0,0," ",null,null,null,null,null,null,null,null,null,"LR","LIBERIA"]
["Libya",85,null,null,null,null,null,0,null,null,null,null,null,null,null,null,null,null,null,null,null,null,null,null,null,null,null,null,null,null,0,0,0," ",null,null,null,null,null,null,null,null,null,"LY","LIBYA"]
["Liechtenstein",86,null,null,null,null,null,0,null,null,null,null,null,null,null,null,null,null,null,null,null,null,null,null,null,null,null,null,null,null,0,0,0," ",null,null,null,null,null,null,null,null,null,"LI","LIECHTENST"]
["Lithuania",87,null,null,null,null,null,0,null,null,null,null,null,null,null,null,null,null,null,null,null,null,null,null,null,null,null,null,null,null,0,0,0," ",null,null,null,null,null,null,null,null,null,"LT","LITHUANIA"]
["Luxembourg",88,null,null,null,null,null,0,null,null,null,null,null,null,null,null,null,null,null,null,null,null,null,null,null,null,null,null,null,null,0,0,0," ",null,null,null,null,null,null,null,null,null,"LU","LUXEMBOU"]
["Madagascar",89,null,null,null,null,null,0,null,null,null,null,null,null,null,null,null,null,null,null,null,null,null,null,null,null,null,null,null,null,0,0,0," ",null,null,null,null,null,null,null,null,null,"MG","MADAGASCAR"]
["Malaysia",90,null,null,null,null,null,0,null,null,null,null,null,null,null,null,null,null,null,null,null,null,null,null,null,null,null,null,null,null,0,0,0," ",null,null,null,null,null,null,null,null,null,"MY","MALAYSIA"]
["Malta",91,null,null,null,null,null,0,null,null,null,null,null,null,null,null,null,null,null,null,null,null,null,null,null,null,null,null,null,null,0,0,0," ",null,null,null,null,null,null,null,null,null,"MT","MALTA"]
["Marshall Islands",92,null,null,null,null,null,0,null,null,null,null,null,null,null,null,null,null,null,null,null,null,null,null,null,null,null,null,null,null,0,0,0," ",null,null,null,null,null,null,null,null,null,"MH","MARSHALL"]
["Mauritania",93,null,null,null,null,null,0,null,null,null,null,null,null,null,null,null,null,null,null,null,null,null,null,null,null,null,null,null,null,{"$f":"SUM(I100:K100,L100,O100:Q100,T100,W100,Z100,AC100:AD100)","v":0},{"$f":"SUM(H100,AE100)","v":0},null,null,null,null,null,null,null,null,null,null,null,"MR","MAURITANIA"]
["Mauritius",94,null,null,null,null,null,0,null,null,null,null,null,null,null,null,null,null,null,null,null,null,null,null,null,null,null,null,null,null,0,0,null,null,null,null,null,null,null,null,null,null,null,"MU","MAURITIUS"]
["Mexico",95,null,null,null,null,null,0,null,null,null,null,null,null,null,null,null,null,null,null,null,null,null,null,null,null,null,null,null,null,0,0,null,null,null,null,null,null,null,null,null,null,null,"MX","MEXICO"]
["Moldova, Republic of",96,null,null,null,null,null,0,null,null,null,null,null,null,null,null,null,null,null,null,null,null,null,null,null,null,null,null,null,null,0,0,null,null,null,null,null,null,null,null,null,null,null,"MD","MOLDOVA"]
["Mongolia",97,null,null,null,null,null,0,null,null,null,null,null,null,null,null,null,null,null,null,null,null,null,null,null,null,null,null,null,null,0,0,null,null,null,null,null,null,null,null,null,null,null,"MN","MONGOLIA"]
["Montenegro",98,null,null,null,null,null,0,null,null,null,null,null,null,null,null,null,null,null,null,null,null,null,null,null,null,null,null,null,null,0,0,null,null,null,null,null,null,null,null,null,null,null,"ME","MONTENEGRO"]
["Morocco",99,null,null,null,null,null,0,null,null,null,null,null,null,null,null,null,null,null,null,null,null,null,null,null,null,null,null,null,null,0,0,null,null,null,null,null,null,null,null,null,null,null,"MA","MOROCCO"]
["Mozambique",100,null,null,null,null,null,0,null,null,null,null,null,null,null,null,null,null,null,null,null,null,null,null,null,null,null,null,null,null,0,0,null,null,null,null,null,null,null,null,null,null,null,"MZ","MOZAMBIQUE"]
["Myanmar",101,null,null,null,null,null,0,null,null,null,null,null,null,null,null,null,null,null,null,null,null,null,null,null,null,null,null,null,null,0,0,null,null,null,null,null,null,null,null,null,null,null,"MM","MYANMAR"]
["Namibia",102,null,null,null,null,null,0,null,null,null,null,null,null,null,null,null,null,null,null,null,null,null,null,null,null,null,null,null,null,0,0,null,null,null,null,null,null,null,null,null,null,null,"NA","NAMIBIA"]
["Nepal",103,null,null,null,null,null,0,null,null,null,null,null,null,null,null,null,null,null,null,null,null,null,null,null,null,null,null,null,null,0,0,null,null,null,null,null,null,null,null,null,null,null,"NP","NEPAL"]
["Netherlands",104,null,null,null,null,null,0,null,null,null,null,null,null,null,null,null,null,null,null,null,null,null,null,null,null,null,null,null,null,0,0,null,null,null,null,null,null,null,null,null,null,null,"NL","NETHLAND"]
["New Caledonia",105,null,null,null,null,null,0,null,null,null,null,null,null,null,null,null,null,null,null,null,null,null,null,null,null,null,null,null,null,0,0,null,null,null,null,null,null,null,null,null,null,null,"NC","NEWCALEDON"]
["New Zealand",106,null,null,null,null,null,0,null,null,null,null,null,null,null,null,null,null,null,null,null,null,null,null,null,null,null,null,null,null,0,0,null,null,null,null,null,null,null,null,null,null,null,"NZ","NZ"]
["Niger",107,null,null,null,null,null,0,null,null,null,null,null,null,null,null,null,null,null,null,null,null,null,null,null,null,null,null,null,null,0,0,null,null,null,null,null,null,null,null,null,null,null,"NE","NIGER"]
["Nigeria",108,null,null,null,null,null,0,null,null,null,null,null,null,null,null,null,null,null,null,null,null,null,null,null,null,null,null,null,null,0,0,null,null,null,null,null,null,null,null,null,null,null,"NG","NIGERIA"]
["North Macedonia",109,null,null,null,null,null,0,null,null,null,null,null,null,null,null,null,null,null,null,null,null,null,null,null,null,null,null,null,null,0,0,null,null,null,null,null,null,null,null,null,null,null,"MK","NORTHMACED"]
["Norway",110,null,null,null,null,null,0,null,null,null,null,null,null,null,null,null,null,null,null,null,null,null,null,null,null,null,null,null,null,0,0,null,null,null,null,null,null,null,null,null,null,null,"NO","NORWAY"]
["Oman",111,null,null,null,null,null,0,null,null,null,null,null,null,null,null,null,null,null,null,null,null,null,null,null,null,null,null,null,null,0,0,null,null,null,null,null,null,null,null,null,null,null,"OM","OMAN"]
["Other Africa",112,null,null,null,null,null,0,null,null,null,null,null,null,null,null,null,null,null,null,null,null,null,null,null,null,null,null,null,null,0,0,null,null,null,null,null,null,null,null,null,null,null,"O1","OTHERAFRIC"]
["Other Asia Oceania",113,null,null,null,null,null,0,null,null,null,null,null,null,null,null,null,null,null,null,null,null,null,null,null,null,null,null,null,null,0,0,null,null,null,null,null,null,null,null,null,null,null,"O4","OTHERASIA"]
["Other Europe",114,null,null,null,null,null,0,null,null,null,null,null,null,null,null,null,null,null,null,null,null,null,null,null,null,null,null,null,null,0,0,null,null,null,null,null,null,null,null,null,null,null,"O8","OTHEREUROP"]
["Other Former Soviet Union",115,null,null,null,null,null,0,null,null,null,null,null,null,null,null,null,null,null,null,null,null,null,null,null,null,null,null,null,null,0,0,null,null,null,null,null,null,null,null,null,null,null,"P8","OTHFUSSR"]
["Other Near and Middle East",116,null,null,null,null,null,0,null,null,null,null,null,null,null,null,null,null,null,null,null,null,null,null,null,null,null,null,null,null,0,0,null,null,null,null,null,null,null,null,null,null,null,"P4","OTHERNEARM"]
["Other Non-OECD Americas",117,null,null,null,null,null,0,null,null,null,null,null,null,null,null,null,null,null,null,null,null,null,null,null,null,null,null,null,null,0,0,null,null,null,null,null,null,null,null,null,null,null,"P1","OTHERLATIN"]
["Pakistan",118,null,null,null,null,null,0,null,null,null,null,null,null,null,null,null,null,null,null,null,null,null,null,null,null,null,null,null,null,0,0,null,null,null,null,null,null,null,null,null,null,null,"PK","PAKISTAN"]
["Panama",119,null,null,null,null,null,0,null,null,null,null,null,null,null,null,null,null,null,null,null,null,null,null,null,null,null,null,null,null,0,0,null,null,null,null,null,null,null,null,null,null,null,"PA","PANAMA"]
["Papua New Guinea",120,null,null,null,null,null,0,null,null,null,null,null,null,null,null,null,null,null,null,null,null,null,null,null,null,null,null,null,null,0,0,null,null,null,null,null,null,null,null,null,null,null,"PG","PAPUANEWGU"]
["Peru",121,null,null,null,null,null,0,null,null,null,null,null,null,null,null,null,null,null,null,null,null,null,null,null,null,null,null,null,null,0,0,null,null,null,null,null,null,null,null,null,null,null,"PE","PERU"]
["Philippines",122,null,null,null,null,null,0,null,null,null,null,null,null,null,null,null,null,null,null,null,null,null,null,null,null,null,null,null,null,0,0,null,null,null,null,null,null,null,null,null,null,null,"PH","PHILIPPINE"]
["Poland",123,null,null,null,null,null,0,null,null,null,null,null,null,null,null,null,null,null,null,null,null,null,null,null,null,null,null,null,null,0,0,null,null,null,null,null,null,null,null,null,null,null,"PL","POLAND"]
["Portugal",124,null,null,null,null,null,0,null,null,null,null,null,null,null,null,null,null,null,null,null,null,null,null,null,null,null,null,null,null,0,0,null,null,null,null,null,null,null,null,null,null,null,"PT","PORTUGAL"]
["Qatar",125,null,null,null,null,null,0,null,null,null,null,null,null,null,null,null,null,null,null,null,null,null,null,null,null,null,null,null,null,0,0,null,null,null,null,null,null,null,null,null,null,null,"QA","QATAR"]
["Romania",126,null,null,null,null,null,0,null,null,null,null,null,null,null,null,null,null,null,null,null,null,null,null,null,null,null,null,null,null,0,0,null,null,null,null,null,null,null,null,null,null,null,"RO","ROMANIA"]
["Russian Federation",127,null,null,null,null,null,0,null,null,null,null,null,null,null,null,null,null,null,null,null,null,null,null,null,null,null,null,null,null,0,0,null,null,null,null,null,null,null,null,null,null,null,"RU","RUSSIA"]
["Sao Tome and Principe",128,null,null,null,null,null,0,null,null,null,null,null,null,null,null,null,null,null,null,null,null,null,null,null,null,null,null,null,null,0,0,null,null,null,null,null,null,null,null,null,null,null,"ST","SAOTOME"]
["Saudi Arabia",129,null,null,null,null,null,0,null,null,null,null,null,null,null,null,null,null,null,null,null,null,null,null,null,null,null,null,null,null,0,0,null,null,null,null,null,null,null,null,null,null,null,"SA","SAUDIARABI"]
["Senegal",130,null,null,null,null,null,0,null,null,null,null,null,null,null,null,null,null,null,null,null,null,null,null,null,null,null,null,null,null,0,0,null,null,null,null,null,null,null,null,null,null,null,"SN","SENEGAL"]
["Serbia",131,null,null,null,null,null,0,null,null,null,null,null,null,null,null,null,null,null,null,null,null,null,null,null,null,null,null,null,null,0,0,null,null,null,null,null,null,null,null,null,null,null,"RS","SERBIA"]
["Sierra Leone",132,null,null,null,null,null,0,null,null,null,null,null,null,null,null,null,null,null,null,null,null,null,null,null,null,null,null,null,null,0,0,null,null,null,null,null,null,null,null,null,null,null,"SL","SIERRALEON"]
["Singapore",133,null,null,null,null,null,0,null,null,null,null,null,null,null,null,null,null,null,null,null,null,null,null,null,null,null,null,null,null,0,0,null,null,null,null,null,null,null,null,null,null,null,"SG","SINGAPORE"]
["Slovak Republic",134,null,null,null,null,null,0,null,null,null,null,null,null,null,null,null,null,null,null,null,null,null,null,null,null,null,null,null,null,0,0,null,null,null,null,null,null,null,null,null,null,null,"SK","SLOVAKIA"]
["Slovenia",135,null,null,null,null,null,0,null,null,null,null,null,null,null,null,null,null,null,null,null,null,null,null,null,null,null,null,null,null,0,0,null,null,null,null,null,null,null,null,null,null,null,"SI","SLOVENIA"]
["South Africa",136,null,null,null,null,null,0,null,null,null,null,null,null,null,null,null,null,null,null,null,null,null,null,null,null,null,null,null,null,0,0,null,null,null,null,null,null,null,null,null,null,null,"ZA","SOUTHAFRIC"]
["South Sudan",137,null,null,null,null,null,0,null,null,null,null,null,null,null,null,null,null,null,null,null,null,null,null,null,null,null,null,null,null,0,0,null,null,null,null,null,null,null,null,null,null,null,"SS","SSUDAN"]
["Spain",138,null,null,null,null,null,0,null,null,null,null,null,null,null,null,null,null,null,null,null,null,null,null,null,null,null,null,null,null,0,0,null,null,null,null,null,null,null,null,null,null,null,"ES","SPAIN"]
["Sri Lanka",139,null,null,null,null,null,0,null,null,null,null,null,null,null,null,null,null,null,null,null,null,null,null,null,null,null,null,null,null,0,0,null,null,null,null,null,null,null,null,null,null,null,"LK","SRILANKA"]
["Sudan",140,null,null,null,null,null,0,null,null,null,null,null,null,null,null,null,null,null,null,null,null,null,null,null,null,null,null,null,null,0,0,null,null,null,null,null,null,null,null,null,null,null,"SD","SUDAN"]
["Sweden",141,null,null,null,null,null,0,null,null,null,null,null,null,null,null,null,null,null,null,null,null,null,null,null,null,null,null,null,null,0,0,null,null,null,null,null,null,null,null,null,null,null,"SE","SWEDEN"]
["Switzerland",142,null,null,null,null,null,0,null,null,null,null,null,null,null,null,null,null,null,null,null,null,null,null,null,null,null,null,null,null,0,0,null,null,null,null,null,null,null,null,null,null,null,"CH","SWITLAND"]
["Syrian Arab Republic",143,null,null,null,null,null,0,null,null,null,null,null,null,null,null,null,null,null,null,null,null,null,null,null,null,null,null,null,null,0,0,null,null,null,null,null,null,null,null,null,null,null,"SY","SYRIA"]
["Taiwan / Chinese Taipei",144,null,null,null,null,null,0,null,null,null,null,null,null,null,null,null,null,null,null,null,null,null,null,null,null,null,null,null,null,0,0,null,null,null,null,null,null,null,null,null,null,null,"TW","TAIPEI"]
["Tajikistan",145,null,null,null,null,null,0,null,null,null,null,null,null,null,null,null,null,null,null,null,null,null,null,null,null,null,null,null,null,0,0,null,null,null,null,null,null,null,null,null,null,null,"TJ","TAJIKISTAN"]
["Tanzania, United Republic of",146,null,null,null,null,null,0,null,null,null,null,null,null,null,null,null,null,null,null,null,null,null,null,null,null,null,null,null,null,0,0,null,null,null,null,null,null,null,null,null,null,null,"TZ","TANZANIA"]
["Thailand",147,null,null,null,null,null,0,null,null,null,null,null,null,null,null,null,null,null,null,null,null,null,null,null,null,null,null,null,null,0,0,null,null,null,null,null,null,null,null,null,null,null,"TH","THAILAND"]
["Timor-Leste",148,null,null,null,null,null,0,null,null,null,null,null,null,null,null,null,null,null,null,null,null,null,null,null,null,null,null,null,null,0,0,null,null,null,null,null,null,null,null,null,null,null,"TL","TIMORLESTE"]
["Togo",149,null,null,null,null,null,0,null,null,null,null,null,null,null,null,null,null,null,null,null,null,null,null,null,null,null,null,null,null,0,0,null,null,null,null,null,null,null,null,null,null,null,"TG","TOGO"]
["Trinidad and Tobago",150,null,null,null,null,null,0,null,null,null,null,null,null,null,null,null,null,null,null,null,null,null,null,null,null,null,null,null,null,0,0,null,null,null,null,null,null,null,null,null,null,null,"TT","TRINIDAD"]
["Tunisia",151,null,null,null,null,null,0,null,null,null,null,null,null,null,null,null,null,null,null,null,null,null,null,null,null,null,null,null,null,0,0,null,null,null,null,null,null,null,null,null,null,null,"TN","TUNISIA"]
["Turkey",152,null,null,null,null,null,0,null,null,null,null,null,null,null,null,null,null,null,null,null,null,null,null,null,null,null,null,null,null,0,0,null,null,null,null,null,null,null,null,null,null,null,"TR","TURKEY"]
["Turkmenistan",153,null,null,null,null,null,0,null,null,null,null,null,null,null,null,null,null,null,null,null,null,null,null,null,null,null,null,null,null,0,0,null,null,null,null,null,null,null,null,null,null,null,"TM","TURKMENIST"]
["Uganda",154,null,null,null,null,null,0,null,null,null,null,null,null,null,null,null,null,null,null,null,null,null,null,null,null,null,null,null,null,0,0,null,null,null,null,null,null,null,null,null,null,null,"UG","UGANDA"]
["Ukraine",155,null,null,null,null,null,0,null,null,null,null,null,null,null,null,null,null,null,null,null,null,null,null,null,null,null,null,null,null,0,0,null,null,null,null,null,null,null,null,null,null,null,"UA","UKRAINE"]
["United Arab Emirates",156,null,null,null,null,null,0,null,null,null,null,null,null,null,null,null,null,null,null,null,null,null,null,null,null,null,null,null,null,0,0,null,null,null,null,null,null,null,null,null,null,null,"AE","UAE"]
["United Kingdom",157,null,null,null,null,null,0,null,null,null,null,null,null,null,null,null,null,null,null,null,null,null,null,null,null,null,null,null,null,{"$f":"SUM(I164:K164,L164,O164:Q164,T164,W164,Z164,AC164:AD164)","v":0},{"$f":"SUM(H164,AE164)","v":0},null,null,null,null,null,null,null,null,null,null,null,"GB","UK"]
["United States",158,null,null,null,null,null,0,null,null,null,null,null,null,null,null,null,null,null,null,null,null,null,null,null,null,null,null,null,null,0,0,null,null,null,null,null,null,null,null,null,null,null,"US","USA"]
["Uruguay",159,null,null,null,null,null,0,null,null,null,null,null,null,null,null,null,null,null,null,null,null,null,null,null,null,null,null,null,null,0,0,null,null,null,null,null,null,null,null,null,null,null,"UY","URUGUAY"]
["Uzbekistan",160,null,null,null,null,null,0,null,null,null,null,null,null,null,null,null,null,null,null,null,null,null,null,null,null,null,null,null,null,0,0,null,null,null,null,null,null,null,null,null,null,null,"UZ","UZBEKISTAN"]
["Venezuela, Bolivarian Republic",161,null,null,null,null,null,0,null,null,null,null,null,null,null,null,null,null,null,null,null,null,null,null,null,null,null,null,null,null,0,0,null,null,null,null,null,null,null,null,null,null,null,"VE","VENEZUELA"]
["Viet Nam",162,null,null,null,null,null,0,null,null,null,null,null,null,null,null,null,null,null,null,null,null,null,null,null,null,null,null,null,null,0,0,null,null,null,null,null,null,null,null,null,null,null,"VN","VIETNAM"]
["Yemen",163,null,null,null,null,null,0,null,null,null,null,null,null,null,null,null,null,null,null,null,null,null,null,null,null,null,null,null,null,0,0,null,null,null,null,null,null,null,null,null,null,null,"YE","YEMEN"]
["Not elsewhere specified",164,null,null,null,null,null,0,null,null,null,null,null,null,null,null,null,null,null,null,null,null,null,null,null,null,null,null,null,null,0,0,0," ",null,null,null,null,null,null,null,null,null,"Y3","NONSPEC"]
["Total Exports1 2",165,{"$f":"SUM(C8:C171)","v":0},0,0,0,0,0,0,0,0,0,0,0,0,0,0,0,0,0,0,0,0,0,0,0,0,0,0,0,0,0,0," ",null,null,null,null,null,null,null,null,null,"Y2","TOTEXPST"]
[null,null,{"$f":"IF(MIN(C8:C172)<0,\"Negative number\",\"\")","v":""},{"$f":"IF(MIN(D8:D172)<0,\"Negative number\",\"\")","v":""},"","","","","","","","","","","","","","","","","","","","","","","","","","","",""]
[]
["1. Total Exports of Total (F96) should be equal to Exports (Balance) of Total in Table 1 (G6)",null,null,null,null,null,null,{"$f":"H172-MOS_Table_1!J19","v":0},{"$f":"IF(H175=0,\"OK\",\"Total Exports of Total is not equal to Exports (Balance) of Total in Table 1.\")","v":"OK"}]
["    and Total Exports of Total products (AC96) should be equal to Exports (Balance) of Total products in Table 2 (Z6).",null,null,null,null,null,null,{"$f":"AE172-MOS_Table_2!AC13","v":0},{"$f":"IF(H176=0,\"OK\",\"Total Exports of Total products is not equal to Exports (Balance) for Total products in Table 2.\")","v":"OK"}]
["2. Total Exports should be equal to the sum of its components for Total (column F) ",null,null,null,null,null,null,{"$f":"H172-SUM(H8:H171)","v":0},{"$f":"IF(H177=0,\"OK\",\"Total Exports is not equal to the sum of its components for Total (column F).\")","v":"OK"}]
["    and for Total products (Column AC).",null,null,null,null,null,null,{"$f":"AE172-SUM(AE8:AE171)","v":0},{"$f":"IF(H178=0,\"OK\",\"Total Exports is not equal to the sum of its components for Total products.\")","v":"OK"}]
[]
[]
[]
[]
[]
[]
[]
[]
[]
[]
[]
[]
[]
[]
[]
[]
[]
[]
[]
[]
["Products è",null,"CRUDEOIL","NGL","REFFEEDS","ADDITIVE","NONCRUDE","CRNGFEED","ETHANE","LPG","NAPHTHA","MOTORGAS","BIOGASOL","NONBIOGASO","AVGAS","JETGAS","JETKERO","BIOJETKERO","NONBIOJETK","OTHKERO","DIESEL","HEATOIL","GASDIES","BIODIESEL","NONBIODIES","RESFUEL","LOWSULF","HIGHSULF","PETCOKE","OPRODS","TOTPRODS","TOTALOIL"]

{"sheet":"MOS_Table_5","index":9,"n_rows":122,"n_cols":45,"rows_kept":122,"cut":false,"hidden":true,"merged":[[4,32,5,32],[4,33,5,33],[4,35,5,35],[4,18,5,18],[4,21,5,21],[4,24,5,24],[4,27,5,27],[4,30,5,30],[4,31,5,31],[4,17,5,17],[4,3,5,3],[4,4,5,4],[4,5,5,5],[4,6,5,6],[4,8,5,8],[4,9,5,9],[4,10,5,10],[4,11,5,11],[4,12,5,12],[4,13,5,13],[4,16,5,16]]}
["MONTHLY OIL AND GAS QUESTIONNAIRE"]
[{"$f":"CountryMessage","v":"(select your country on the 'Start' sheet)"}]
[{"$f":"FirstMonth & \" \" & QuestYear","v":"MONTH ? 2022"},null,null,null,null,null,null,null,null,null,null,null,null,null,null,null,null,null,null,null,null,null,null,null,null,null,null,null,null,null,null,null,null,null,null,null,null,null,null,null,null,null,null,null,"Datatype"]
["Table 5: STOCK LEVELS",null,null,null,"All opening stock levels should be equal to closing stock levels of the previous month",null,null,null,null,null,null,null,null,null,null,null,null,null,null,null,null,null,null,null,null,null,null,null,null,"Unit:  Thousand Metric Tons",null,null,null,null,null,null,null,null,null,null,null,null,null,null,"BALANCE"]
[null,null,null,"Crude\noil","Natural\ngas\nliquids","Refinery\nfeedstocks","Additives /\noxygenates",null,"Other\nhydro-carbons","Total\n(A to F, excl. E)","Ethane","LPG","Naphtha","Total motor\ngasoline",null,null,"Aviation\ngasoline","Gasoline\ntype\njet fuel","Total\nkerosene\ntype\njet fuel",null,null,"Other\nkerosene",null,null,"Total\ngas/diesel\noil",null,null,"Total \nfuel oil",null,null,"Petroleum coke","Other products","Total products","Total\noil",null,"Probate"]
[null,null,null,null,null,null,null,"Of which\nBiofuels",null,null,null,null,null,null,"Biogasoline","Non-biogasoline",null,null,null,"Bio jet\nkerosene","Non-bio jet\nkerosene",null,"Road diesel","Heating and\nother gas oil",null,"Biodiesels","Non-bio\ngas/diesel\noil",null,"Fuel oil-\nlow sulphur \n(<1%)","Fuel oil-\nhigh sulphur\n (>=1%)"]
[null,null,null,"A","B","C","D","E","F","G","H","I","J","K","L","M","N","O","P","Q","R","S","T","U","V","W","X","Y","Z","AA","AB","AC","AD","AE",null,"AF",null,null,null,null,null,null,null,null,"Item1 ê"]
["(a) All stocks on","Opening",1,{"$f":"D10+D12+D14+D16+D18+D20+D22+D24","v":0},{"$f":"E10+E12+E14+E16+E18+E20+E22+E24","v":0},0,{"$f":"G10+G12+G14+G16+G18+G20+G22+G24","v":0},{"$f":"H10+H12+H14+H16+H18+H20+H22+H24","v":0},0,{"$f":"J10+J12+J14+J16+J18+J20+J22+J24","v":0},0,{"$f":"L10+L12+L14+L16+L18+L20+L22+L24","v":0},{"$f":"M10+M12+M14+M16+M18+M20+M22+M24","v":0},0,0,0,0,0,0,0,0,0,0,0,0,0,0,0,0,0,0,0,{"$f":"SUM(K8:N8,Q8:S8,V8,Y8,AB8,AE8:AF8)","v":0},{"$f":"SUM(J8,AG8)","v":0},{"$f":"IF(J8-SUM(D8:G8,I8)=0,0,1)+IF(AG8-SUM(K8:N8,Q8:S8,V8,Y8,AB8,AE8:AF8)=0,0,1)+IF(AH8-SUM(AG8,J8)=0,0,1)","v":0},{"$f":"IF(AI8=0,\" \",IF(AI8=1,\"A total is not equal to the sum of its components: \",AI8&\" totals are not equal to the sum of their components: \"))&IF(AI8=0,\"\",IF(J8-SUM(D8:G8,I8)=0,\"\",\"Total crude. \")&IF(AG8-SUM(K8:N8,Q8:S8,V8,Y8,AB8,AE8:AF8)=0,\"\",\"Total products. \")&IF(AH8-SUM(AG8,J8)=0,\"\",\"Total oil.\"))","v":" "},null,null,null,null,null,null,null,null,"OSNATTER"]
["national territory (b+c+d+e+f+g+h+i) 1","Closing",2,{"$f":"D11+D13+D15+D17+D19+D21+D23+D25","v":0},0,0,{"$f":"G11+G13+G15+G17+G19+G21+G23+G25","v":0},{"$f":"H11+H13+H15+H17+H19+H21+H23+H25","v":0},0,0,0,{"$f":"L11+L13+L15+L17+L19+L21+L23+L25","v":0},0,0,0,0,0,0,0,0,0,0,0,0,0,0,0,0,0,0,0,0,{"$f":"SUM(K9:N9,Q9:S9,V9,Y9,AB9,AE9:AF9)","v":0},{"$f":"SUM(J9,AG9)","v":0},{"$f":"IF(J9-SUM(D9:G9,I9)=0,0,1)+IF(AG9-SUM(K9:N9,Q9:S9,V9,Y9,AB9,AE9:AF9)=0,0,1)+IF(AH9-SUM(AG9,J9)=0,0,1)","v":0},{"$f":"IF(AI9=0,\" \",IF(AI9=1,\"A total is not equal to the sum of its components: \",AI9&\" totals are not equal to the sum of their components: \"))&IF(AI9=0,\"\",IF(J9-SUM(D9:G9,I9)=0,\"\",\"Total crude. \")&IF(AG9-SUM(K9:N9,Q9:S9,V9,Y9,AB9,AE9:AF9)=0,\"\",\"Total products. \")&IF(AH9-SUM(AG9,J9)=0,\"\",\"Total oil.\"))","v":" "},null,null,null,null,null,null,null,null,"CSNATTER"]
["(b) Stocks held for other countries","Opening",3,null,null,null,null,null,null,{"$f":"SUM(D10:G10,I10)","v":0},null,null,null,null,null,null,null,null,null,null,null,null,null,null,null,null,null,null,null,null,null,null,0,0,0," ",null,null,null,null,null,null,null,null,"OSOTHBIL"]
["under official agreement","Closing",4,null,null,null,null,null,null,{"$f":"SUM(D11:G11,I11)","v":0},null,null,null,null,null,null,null,null,null,null,null,null,null,null,null,null,null,null,null,null,null,null,0,0,0," ",null,null,null,null,null,null,null,null,"CSOTHBIL"]
["(c) Stocks with known","Opening",5,null,null,null,null,null,null,0,null,null,null,null,null,null,null,null,null,null,null,null,null,null,null,null,null,null,null,null,null,null,0,0,0," ",null,null,null,null,null,null,null,null,"OSOTHFOR"]
["foreign destination","Closing",6,null,null,null,null,null,null,0,null,null,null,null,null,null,null,null,null,null,null,null,null,null,null,null,null,null,null,null,null,null,0,0,0," ",null,null,null,null,null,null,null,null,"CSOTHFOR"]
["(d) Stocks held in bonded areas","Opening",7,null,null,null,null,null,null,0,null,null,null,null,null,null,null,null,null,null,null,null,null,null,null,null,null,null,null,null,null,null,0,0,0," ",null,null,null,null,null,null,null,null,"OSBONDED"]
["and not included in (b) or (c)","Closing",8,null,null,null,null,null,null,0,null,null,null,null,null,null,null,null,null,null,null,null,null,null,null,null,null,null,null,null,null,null,0,0,0," ",null,null,null,null,null,null,null,null,"CSBONDED"]
["(e) Stocks held by major consumers,","Opening",9,null,null,null,null,null,null,0,null,null,null,null,null,null,null,null,null,null,null,null,null,null,null,null,null,null,null,null,null,null,0,0,0," ",null,null,null,null,null,null,null,null,"OSMAJCON"]
["obligated by law","Closing",10,null,null,null,null,null,null,0,null,null,null,null,null,null,null,null,null,null,null,null,null,null,null,null,null,null,null,null,null,null,0,0,0," ",null,null,null,null,null,null,null,null,"CSMAJCON"]
["(f) Stocks held on board incoming","Opening",11,null,null,null,null,null,null,0,null,null,null,null,null,null,null,null,null,null,null,null,null,null,null,null,null,null,null,null,null,null,0,0,0," ",null,null,null,null,null,null,null,null,"OSVESSEL"]
["ocean vessels in port or at mooring","Closing",12,null,null,null,null,null,null,0,null,null,null,null,null,null,null,null,null,null,null,null,null,null,null,null,null,null,null,null,null,null,0,0,0," ",null,null,null,null,null,null,null,null,"CSVESSEL"]
["(g) Stocks held by government","Opening",13,null,null,null,null,null,null,0,null,null,null,null,null,null,null,null,null,null,null,null,null,null,null,null,null,null,null,null,null,null,0,0,0," ",null,null,null,null,null,null,null,null,"OSGOVT"]
[" on national territory","Closing",14,null,null,null,null,null,null,0,null,null,null,null,null,null,null,null,null,null,null,null,null,null,null,null,null,null,null,null,null,null,0,0,0," ",null,null,null,null,null,null,null,null,"CSGOVT"]
["(h) Stocks held by stock holding ","Opening",15,null,null,null,null,null,null,0,null,null,null,null,null,null,null,null,null,null,null,null,null,null,null,null,null,null,null,null,null,null,{"$f":"SUM(K22:N22,Q22:S22,V22,Y22,AB22,AE22:AF22)","v":0},0,0," ",null,null,null,null,null,null,null,null,"OSHOLD"]
["organisation on national territory","Closing",16,null,null,null,null,null,null,0,null,null,null,null,null,null,null,null,null,null,null,null,null,null,null,null,null,null,null,null,null,null,0,0,0," ",null,null,null,null,null,null,null,null,"CSHOLD"]
["(i) All other stocks held on ","Opening",17,null,null,null,null,null,null,0,null,null,null,null,null,null,null,null,null,null,null,null,null,null,null,null,null,null,null,null,null,null,0,0,0," ",null,null,null,null,null,null,null,null,"OSALLOTH"]
["national territory","Closing",18,null,null,null,null,null,null,0,null,null,null,null,null,null,null,null,null,null,null,null,null,null,null,null,null,null,null,null,null,null,0,0,0," ",null,null,null,null,null,null,null,null,"CSALLOTH"]
["(j) Stocks held abroad under ","Opening",19,null,null,null,null,null,null,0,null,null,null,null,null,null,null,null,null,null,null,null,null,null,null,null,null,null,null,null,null,null,0,0,0," ",null,null,null,null,null,null,null,null,"OSABRBIL"]
["official agreement (o+p+q)*","Closing",20,null,null,null,null,null,null,0,null,null,null,null,null,null,null,null,null,null,null,null,null,null,null,null,null,null,null,null,null,null,{"$f":"SUM(K27:N27,Q27:S27,V27,Y27,AB27,AE27:AF27)","v":0},0,0," ",null,null,null,null,null,null,null,null,"CSABRBIL"]
["(k) Stocks held abroad designated definitely","Opening",21,null,null,null,null,null,null,0,null,null,null,null,null,null,null,null,null,null,null,null,null,null,null,null,null,null,null,null,null,null,{"$f":"SUM(K28:N28,Q28:S28,V28,Y28,AB28,AE28:AF28)","v":0},0,0," ",null,null,null,null,null,null,null,null,"OSABRFOR"]
["for import into your country","Closing",22,null,null,null,null,null,null,0,null,null,null,null,null,null,null,null,null,null,null,null,null,null,null,null,null,null,null,null,null,null,0,0,0," ",null,null,null,null,null,null,null,null,"CSABRFOR"]
["(l) Total","Opening",23,{"$f":"D8-D10-D12+D26+D28","v":0},0,0,{"$f":"G8-G10-G12+G26+G28","v":0},{"$f":"H8-H10-H12+H26+H28","v":0},0,0,0,{"$f":"L8-L10-L12+L26+L28","v":0},{"$f":"M8-M10-M12+M26+M28","v":0},0,0,0,0,0,0,0,0,0,0,0,0,0,0,0,0,0,0,0,0,0,0," ",null,null,null,null,null,null,null,null,"OSTOTAL"]
["stocks (a-b-c+j+k)","Closing",24,{"$f":"D9-D11-D13+D27+D29","v":0},0,0,{"$f":"G9-G11-G13+G27+G29","v":0},{"$f":"H9-H11-H13+H27+H29","v":0},0,0,0,{"$f":"L9-L11-L13+L27+L29","v":0},0,0,0,0,0,0,0,0,0,0,0,0,0,0,0,0,0,0,0,0,0,0,0," ",null,null,null,null,null,null,null,null,"CSTOTAL"]
["(m) Other stocks in","Opening",25,null,null,null,null,null,null,{"$f":"SUM(D32:G32,I32)","v":0},null,null,null,null,null,null,null,null,null,null,null,null,null,null,null,null,null,null,null,null,null,null,0,0,0," ",null,null,null,null,null,null,null,null,"OSOTHBON"]
["bonded areas","Closing",26,null,null,null,null,null,null,{"$f":"SUM(D33:G33,I33)","v":0},null,null,null,null,null,null,null,null,null,null,null,null,null,null,null,null,null,null,null,null,null,null,0,0,0," ",null,null,null,null,null,null,null,null,"CSOTHBON"]
["(n) Pipeline","Opening",27,null,null,null,null,null,null,0,null,null,null,null,null,null,null,null,null,null,null,null,null,null,null,null,null,null,null,null,null,null,0,0,0," ",null,null,null,null,null,null,null,null,"OSPIPE"]
["fill","Closing",28,null,null,null,null,null,null,0,null,null,null,null,null,null,null,null,null,null,null,null,null,null,null,null,null,null,null,null,null,null,0,0,0," ",null,null,null,null,null,null,null,null,"CSPIPE"]
["(o) Government stocks held abroad","Opening",29,null,null,null,null,null,null,0,null,null,null,null,null,null,null,null,null,null,null,null,null,null,null,null,null,null,null,null,null,null,0,0,0," ",null,null,null,null,null,null,null,null,"OSABILGV"]
["under official agreement*","Closing",30,null,null,null,null,null,null,0,null,null,null,null,null,null,null,null,null,null,null,null,null,null,null,null,null,null,null,null,null,null,0,0,0," ",null,null,null,null,null,null,null,null,"CSABILGV"]
["(p) Holding organisation's stocks held abroad","Opening",31,null,null,null,null,null,null,0,null,null,null,null,null,null,null,null,null,null,null,null,null,null,null,null,null,null,null,null,null,null,0,0,0," ",null,null,null,null,null,null,null,null,"OSABILHD"]
["under official agreement*","Closing",32,null,null,null,null,null,null,0,null,null,null,null,null,null,null,null,null,null,null,null,null,null,null,null,null,null,null,null,null,null,0,0,0," ",null,null,null,null,null,null,null,null,"CSABILHD"]
["(q) Other stocks held abroad","Opening",33,null,null,null,null,null,null,0,null,null,null,null,null,null,null,null,null,null,null,null,null,null,null,null,null,null,null,null,null,null,0,0,0," ",null,null,null,null,null,null,null,null,"OSABILOT"]
["under official agreement*","Closing",34,null,null,null,null,null,null,0,null,null,null,null,null,null,null,null,null,null,null,null,null,null,null,null,null,null,null,null,null,null,0,0,0," ",null,null,null,null,null,null,null,null,"CSABILOT"]
[null,null,null,{"$f":"IF(MIN(D8:D41)<0,\"Negative number\",\"\")","v":""},{"$f":"IF(MIN(E8:E41)<0,\"Negative number\",\"\")","v":""},"","","","","","","","","","","","","","","","","","","","","","","","","","","","",""]
[null,null,null,{"$f":"IF(AND(D8-SUM(D10,D12,D14,D16,D18,D20,D22,D24)=0,D9-SUM(D11,D13,D15,D17,D19,D21,D23,D25)=0),\"\",\"Error: category (a)\")","v":""},{"$f":"IF(AND(E8-SUM(E10,E12,E14,E16,E18,E20,E22,E24)=0,E9-SUM(E11,E13,E15,E17,E19,E21,E23,E25)=0),\"\",\"Error: category (a)\")","v":""},"","","","","","","","","","","","","","","","","","","","","","","","","","","","",""]
[null,null,null,{"$f":"IF(AND(D30-(D8-D10-D12+D26+D28)=0,(D31-(D9-D11-D13+D27+D29)=0)),\"\",\"Error: category (l)\")","v":""},"","","","","","","","","","","","","","","","","","","","","","","","","","","","","",""]
[]
["1. For All stocks on national territory the Closing minus Opening (line 2 minus line 1) should correspond to Stock changes in Table 1 (line 8) ",null,null,null,null,null,null,null,{"$f":"(J9-J8)-MOS_Table_1!J21","v":0},{"$f":"IF(I46=0,\"OK\",\"Closing stock minus Opening stock levels on National territory does not equal Stock changes in Table 1 for Total.\")","v":"OK"}]
["    and in Table 2 (line 10).",null,null,null,null,null,null,null,{"$f":"(AG9-AG8)-MOS_Table_2!AC17","v":0},{"$f":"IF(I47=0,\"OK\",\"Closing stock minus Opening stock levels on National territory does not equal Stock changes in Table 2 for Total Products.\")","v":"OK"}]
["*  Stocks held abroad under official government agreements (j) are the total of: government (o), stock holding organizations (p), and other stocks (q) held abroad under official government agreements.  The sum of catagories (o), (p) and (q) should equal to category (j) stocks."]
[]
[]
[]
[]
[]
[]
[]
[]
[]
[]
[]
[]
[]
[]
[]
[]
[]
[]
[]
[]
[]
[]
[]
[]
[]
[]
[]
[]
[]
[]
[]
[]
[]
[]
[]
[]
[]
[]
[]
[]
[]
[]
[]
[]
[]
[]
[]
[]
[]
[]
[]
[]
[]
[]
[]
[]
[]
[]
[]
[]
[]
[]
[]
[]
[]
[]
[]
[]
[]
[]
[]
[]
[]
[null,"Products è",null,"CRUDEOIL","NGL","REFFEEDS","ADDITIVE","BIOFUELS","NONCRUDE","CRNGFEED","ETHANE","LPG","NAPHTHA","MOTORGAS","BIOGASOL","NONBIOGASO","AVGAS","JETGAS","JETKERO","BIOJETKERO","NONBIOJETK","OTHKERO","DIESEL","HEATOIL","GASDIES","BIODIESEL","NONBIODIES","RESFUEL","LOWSULF","HIGHSULF","PETCOKE","OPRODS","TOTPRODS","TOTALOIL"]

{"sheet":"ProductDefinitions","index":10,"n_rows":80,"n_cols":2,"rows_kept":80,"cut":false,"hidden":false,"merged":[]}
[null,"DEFINITION OF PRODUCTS"]
[]
[]
[null,"REFINERY INPUTS"]
[null,"CRUDE OIL"]
[null,"Crude oil is a mineral oil of natural origin comprising a mixture of hydrocarbons and associated impurities, such as sulphur. It exists in the liquid phase under normal surface temperature and pressure and its physical characteristics (density, viscosity, etc.) are highly variable.  This category includes field or lease condensate recovered from associated and non-associated gas where it is commingled with the commercial crude oil stream."]
[null,"NATURAL GAS LIQUIDS (NGL)"]
[null,"NGL are liquid or liquefied hydrocarbons recovered from natural gas in separation facilities or gas processing plants.  Natural gas liquids include ethane, propane, butane (normal and iso-), (iso) pentane and pentanes plus (sometimes referred to as natural gasoline or plant condensate)."]
[null,"OTHERS"]
[null,"a.  Refinery Feedstocks"]
[null,"A refinery feedstock is a processed oil destined for further processing (e.g. straight run fuel oil or vacuum gas oil) excluding blending.  With further processing, it will be transformed into one or more components and/or finished products.  This definition also covers returns from the petrochemical industry to the refining industry (e.g. pyrolysis gasoline, C4 fractions, gas oil and fuel oil fractions)."]
[null,"b.1  Additives/Oxygenates"]
[null,"Additives are non-hydrocarbon compounds added to or blended with a product to modify fuel properties (octane, cetane, cold properties, etc.):"]
[null,"i.  oxygenates, such as alcohols (methanol, ethanol), ethers (such as MTBE (methyl tertiary butyl ether), ETBE (ethyl tertiary butyl ether), TAME (tertiary amyl methyl ether));"]
[null,"ii.  esters (e.g. rapeseed or dimethylester, etc.);"]
[null,"iii.  chemical compounds (such as TML, TEL and detergents)."]
[null,"b.2  Biofuels"]
[null,"Biofuels such as biogasoline and biodiesel that are blended into gasoline and diesel at oil refineries."]
[null,"i.  Biogasoline: a gasoline quality liquid fuel produced from biomass or used cooking oils, consists of bioethanol, biomethanol, BioETBE and bioMTBE;"]
[null,"ii.  Biodiesel: a diesel quality liquid fuel produced from biomass or used cooking oils,  consists of Biodiesel, bio-dimethylether, Fischer-Tropsh and cold pressed biooil;"]
[null,"iii.  Bioethanol:  ethanol produced from biomass and/or biodegradable fraction of waste;"]
[null,"iv.  Biomethanol:  methanol produced from biomass and/or the biodegradable fraction of waste;"]
[null,"v.  Biodimethylether:  a diesel quality fuel produced from biomass and/or the biodegradable fraction of waste;"]
[null,"vi.  Biooil:  a pyrolysis oil fuel produced from biomass"]
[null,"c.  Other Hydrocarbons"]
[null,"This category includes synthetic crude oil from tar sands, shale oil, etc., liquids from coal liquefaction, output of liquids from natural gas conversion into gasoline, hydrogen and emulsified oils (e.g. Orimulsion)."]
[]
[null,"PETROLEUM PRODUCTS"]
[null,"LIQUEFIED PETROLEUM GASES (LPG)"]
[null,"LPG are light paraffinic hydrocarbons derived from the refinery processes, crude oil stabilisation and natural gas processing plants.  They consist mainly of propane (C3H8) and butane (C4Hl0) or a combination of the two.  They could also include propylene, butylene, isobutene and isobutylene.  LPG are normally liquefied under pressure for transportation and storage. "]
[null,"NAPTHA"]
[null,"Naphtha is a feedstock destined for either the petrochemical industry (e.g. ethylene manufacture or aromatics production) or for gasoline production by reforming or isomerisation within the refinery.  Naphtha comprises material in the 30°C and 210°C distillation range or part of this range. Naphtha imported for blending is reported as an import of naphtha, then shown on the interproduct transfer row, as a negative entry for Naphtha, and a positive entry for the corresponding finished product."]
[null,"GASOLINE"]
[null,"Gasoline includes motor gasoline, aviation gasoline and gasoline type jet fuel as defined below:"]
[null,"a. Motor Gasoline"]
[null,"Motor gasoline consists of a mixture of light hydrocarbons distilling between 35°C and 215°C.  It is used as a fuel for land based spark ignition engines.  Motor gasoline may include additives, oxygenates and octane enhancers, including lead compounds such as TEL (Tetraethyl lead) and TML (tetramethyl lead). This category includes motor gasoline blending components (excluding additives/oxygenates) e.g. alkylates, isomerate, reformate, cracked gasoline destined for use as finished gasoline. "]
[null,"This category includes biogasoline: bioethanol (ethanol produced from biomass and/or the biodegradable fraction of waste), biomethanol (methanol produced from biomass and/or the biodegradable fraction of waste), bioETBE (ethyl-tertio-butyl-ether produced on the basis of bioethanol: the percentage by volume of bioETBE that is calculated as biofuel is 47%) and bioMTBE (methyl-tertio-butyl-ether produced on the basis of biomethanol: the percentage by volume of bioMTBE that is calculated as biofuel is 36%)."]
[null,"b. Aviation Gasoline"]
[null,"This is motor spirit prepared especially for aviation piston engines, with an octane number suited to the engine, a freezing point of -60°C and a distillation range usually within the limits of 30°C and 180°C."]
[null,"c. Gasoline Type Jet Fuel (Naphtha type Jet Fuel or JP4)"]
[null,"This includes all light hydrocarbon oils for use in aviation turbine power units, distilling between 100°C and 250°C.  They are obtained by blending kerosenes and gasoline or naphtha in such a way that the aromatic content does not exceed 25% in volume, and the vapour pressure is between 13.7kPa and 20.6kPa."]
[null,"TOTAL KEROSENE"]
[null,"This category includes kerosene type Jet Fuel and Other Kerosene as defined below:"]
[null,"a. Other Kerosene"]
[null,"Kerosene comprises refined petroleum distillate and is used in sectors other than aircraft transport. It distils between 150°C and 300°C."]
[null,"b. Of which: Kerosene Type Jet Fuel"]
[null,"This is a distillate used for aviation turbine power units.  It has the same distillation characteristics between 150°C and 300°C (generally not above 250°C) and flash point as kerosene.  In addition, it has particular specifications (such as freezing point) which are established by the International Air Transport Association (IATA). This category includes kerosene blending components."]
[null,"GAS/DIESEL OIL (DISTILLATE FUEL OIL)"]
[null,"Gas/diesel oil is primarily a medium distillate, distilling between 180°C and 380°C.  Several grades are available depending on uses: "]
[null,"a. Heating and other Gasoil:"]
[null," Light heating oil for industrial and commercial uses; "]
[null," Marine diesel and diesel used in rail traffic; "]
[null," Other gas oil including heavy gas oils which distil between 380°C and 540°C and which are used as petrochemical feedstocks. "]
[null,"This category includes blending components. "]
[null,"b. of which: Transport Diesel: on road diesel oil for diesel compression ignition (cars, trucks etc.), usually of low sulphur content; "]
[null,"This category includes biodiesel (a methyl-ester produced from vegetable or animal oil, of diesel quality), biodimethylether (dimethylether produced from biomass), Fischer Tropsch (Fischer Tropsch produced from biomass), cold pressed biooil (oil produced from oil seed through mechanical processing only) and all other liquid biofuels which are added to, blended with or used straight as transport diesel."]
[null,"FUEL OIL"]
[null,"This covers all residual (heavy) fuel oils (including those obtained by blending).  Kinematic viscosity is above 10 cSt at 80°C.  The flash point is always above 50°C and density is always more than 0.90 kg/l."]
[null,"OTHER PRODUCTS"]
[null,"Other Products is the sum of Refinery Gas (not liquefied), Ethane, Petroleum Coke, Lubricants, White Spirit & SBP, Bitumen, Paraffin Waxes and Other products as defined below. Please also include direct use of crude oil and NGL in the \"Other Products\" for the flows receipts and demand."]
[null,"a. Refinery Gas (not liquefied)"]
[null,"Refinery gas includes a mixture of non-condensible gases mainly consisting of hydrogen, methane, ethane and olefins obtained during distillation of crude oil or treatment of oil products (e.g. cracking) in refineries.  This also includes gases which are returned from the petrochemical industry."]
[null,"b. Ethane"]
[null,"A naturally gaseous straight-chain hydrocarbon, (C2H6) extracted from natural gas and refinery gas streams."]
[null,"c. Petroleum Coke"]
[null,"Petroleum coke is a black solid by-product, obtained mainly by cracking and carbonising petroleum derived feedstock, vacuum bottoms, tar and pitches in processes such as delayed coking or fluid coking. It consists mainly of carbon (90 to 95%) and has a low ash content.  It is used as a feedstock in coke ovens for the steel industry, for heating purposes, for electrode manufacture and for production of chemicals.  The two most important qualities are \"green coke\" and \"calcinated coke\".  This category also includes \"catalyst coke\" deposited on the catalyst during refining processes; this coke is not recoverable and is usually burned as refinery fuel.  "]
[null,"d. Lubricants"]
[null,"Lubricants are hydrocarbons produced from distillate by product; they are mainly used to reduce friction between bearing surfaces.  This category includes all finished grades of lubricating oil, from spindle oil to cylinder oil, and those used in greases, including motor oils and all grades of lubricating oil base stocks."]
[null,"e. White Spirit and SBP"]
[null,"White Spirit and SBP are defined as refined distillate intermediates with a distillation in the naphtha/kerosene range. They are sub-divided as:"]
[null,"i.  Industrial Spirit (SBP): Light oils distilling between 30° and 200°C.  There are 7 or 8 grades of industrial spirit, depending on the position of the cut in the distillation range.  The grades are defined according to the temperature difference between the 5% volume and 90% volume distillation points (which is not more than 60°C)."]
[null,"ii.  White Spirit: Industrial spirit with a flash point above 30°C.  The distillation range of white spirit is 135° to 200°C."]
[null,"f. Bitumen"]
[null,"Bitumen is a solid, semi-solid or viscous hydrocarbon with a colloidal structure, being brown to black in colour, obtained as a residue in the distillation of crude oil, by vacuum distillation of oil residues from atmospheric distillation.  Bitumen is often referred to as asphalt and is primarily used for construction of roads and for roofing material.  This category includes fluidized and cut back bitumen."]
[null,"g. Paraffin Waxes"]
[null,"These are saturated aliphatic hydrocarbons.  These waxes are residues extracted when dewaxing lubricant oils.  They have a crystalline structure which is more-or-less fine according to the grade.  Their main characteristics are as follows: they are colourless, odourless and translucent, with a melting point above 45°C. "]
[null,"h. Other Products"]
[null,"All products not specifically mentioned above, for example: tar and sulphur.  This category also includes aromatics (e.g. BTX or benzene, toluene and xylene) and olefins (e.g. propylene) produced within refineries. "]
[null,"TOTAL PRODUCTS"]
[null,"Total Products is the total output of the refinery which is the sum of all petroleum products mentioned above."]

{"sheet":"FlowDefinitions","index":11,"n_rows":34,"n_cols":2,"rows_kept":34,"cut":false,"hidden":false,"merged":[]}
[null,"DEFINITION OF FLOWS"]
[]
[]
[null,"PRODUCTION"]
[null,"Refers to Indigenous Production of Crude Oil, NGL and other Hydrocarbons: Report all production within national boundaries including off-shore production.  Production should only include marketable production, excluding volumes returned to formation.  Such production should include all crude oil, NGL, condensates and oil from shale and tar sands, etc.  It should also include the receipts of additives/oxygenates by refineries and blending plants from outside the refinery sector."]
[null,"FROM OTHER SOURCES"]
[null,"These refers to supplies of Additives, Biofuels and Other Hydrocarbons that are produced from non-oil sources such as: coal, natural gas and renewable energy such as biofuels."]
[null,"IMPORTS AND EXPORTS"]
[null,"Imports and Exports data should reflect amounts having crossed the national territorial boundaries, whether customs clearance has taken place or not.  Quantities of crude oil and products imported or exported under processing agreements (i.e. refining on account) should be included.  Petroleum products imported or exported directly by the petrochemical industry should be included. "]
[null,"Note 1: Re-exports of oil imported for processing within bonded areas should be included as exports of products from the processing country to the final destination."]
[null,"Note 2: Imports or exports of ethanol (reported in the Other column) should relate to the quantities destined for fuel use. "]
[null,"PRODUCTS TRANSFERRED/BACKFLOWS (Sum of Products Transferred and Backflows from Petrochemical Industry)"]
[null,"Products Transferred are imported petroleum products which are reclassified as feedstocks for further processing in the refinery, without delivery to final consumers.  For example, naphtha imported for upgrading would be first reported as imports of naphtha, and then appear also as products transferred of naphtha. "]
[null,"Backflows from Petrochemical Industry are finished or semi-finished products which are returned from final consumers to refineries for processing, blending or sale.  They are usually by-products of petrochemical manufacturing.  For integrated petrochemical industries this flow should be estimated.  Transfers from one refinery to another within the country should be excluded."]
[null,"DIRECT USE"]
[null,"Direct Use refers to Crude oil, NGL and other hydrocarbons which are used directly without being processed in oil refineries are reported as Direct use.  This includes, for example, crude oil burned for electricity generation."]
[null,"STOCK CHANGE"]
[null,"Stock changes should reflect the difference between opening stock level and closing stock level for stocks held on national territory. A stock build is shown as a positive number, and a stock draw as a negative number."]
[null,"STATISTICAL DIFFERENCES"]
[null,"These are calculated as (Production + Imports - Exports + Products Transferred/Backflows - Direct Use ± Stock Change) - Refinery Intake. "]
[null,"REFINERY INTAKE"]
[null,"This refers to the total amount of crude oil, NGL, other hydrocarbons and additives that are observed to have entered the refinery process."]
[null,"REFINERY OUTPUT"]
[null,"This is production of finished products at a refinery or blending plant. This category excludes Refinery Losses, but includes Refinery Fuel."]
[null,"RECEIPTS (Includes primary product receipts and recycled products)"]
[null,"Primary Product Receipts: Quantities of indigenous or imported crude oil (including condensate) and indigenous NGL which are used directly without being processed in an oil refinery.  For example, crude oil used to generate electricity should be placed in primary product receipts of Other Products. Quantities of indigenous NGL which are not included in refinery intake should be reported in primary product receipts of Other Products, then transferred through the Interproduct transfers line to the allocated product type.  Please note that this flow includes the amount of backflows from the petrochemical industry which, although not primary fuel, are used directly. "]
[null,"Recycled Products: These are finished products which pass a second time through the marketing network, after having been once delivered to final consumers (e.g. used lubricants which are reprocessed). These quantities should be distinguished from petrochemical Backflows.  "]
[null,"PRODUCTS TRANSFERRED"]
[null,"Products Transferred are imported petroleum products which are reclassified as feedstocks for further processing in the refinery, without delivery to final consumers.  For example, naphtha imported for upgrading would be first reported as imports of naphtha, and then appear also as products transferred of naphtha. "]
[null,"INTERPRODUCT TRANSFERS"]
[null,"Interproduct Transfers Result from reclassification of products either because their specification has changed, or because they are blended into another product. For example, quantities of kerosene may be reclassified as gasoil after blending with the latter in order to meet its winter diesel specification.  A negative entry for one product must be compensated by a positive entry (or several entries) for one or several products and vice versa.  The total net effect should be zero."]
[null,"DEMAND"]
[null,"The total demand of oil in a country includes the volume of oil required, on the one hand to supply all final consumers, energy transformation units (including refineries), energy producers within the country and on the other hand to provide all the national and foreign customers with fuels which they will use in international navigation and aviation (e.g. international aviation, marine bunkers, fishing etc.). "]
[null,"Total oil demand also includes volumes of crude oil, NGL and other hydrocarbons which are used directly without being processed in petroleum refineries (direct use). It concerns mainly oil which can be used unprocessed by power plants to generate electricity and heat."]

{"sheet":"StockDefinitions","index":12,"n_rows":30,"n_cols":2,"rows_kept":30,"cut":false,"hidden":false,"merged":[]}
[null,"DEFINITION OF STOCKS"]
[]
[null,"Please report closing stock levels, i.e. stock levels at the end of the month."]
[]
[null,"CLOSING STOCKS ON NATIONAL TERRITORY"]
[null,"This refers to total stocks on national territory including stocks held by governments, by major consumers or by stockholding organisations, stocks held on board incoming ocean vessels, stocks held in bonded areas and stocks held for others, whether under bilateral government agreement or not. National Territory Stocks are the sum of Industry stocks, Agency Stocks, Government Stocks and National Territory Stocks with foreign claim."]
[null,"INDUSTRY STOCKS"]
[null,"Include the portion of national territory stocks that are held by refiners, importers and major consumers and all other stocks on national territory not included in the Agency, Government and National Territory Stocks with foreign claim."]
[null,"Industry stocks for this form are equivalent to the sum of the following stock categories reported in Table 5 of the MOS:"]
[null,"Category 4 (row d), 5 (row e), 6 (row f) and 9 (row i)."]
[null,"OF WHICH: OBLIGATED INDUSTRY STOCKS"]
[null,"Include the portion of industry stocks on national territory that are held by refiners, importers and major consumers and all other stocks on which the government or the stockholding agency imposed a stockholding obligation."]
[]
[null,"AGENCY STOCKS"]
[null,"Include stocks held by both public and private corporations established to maintain stocks exclusively for emergency purposes.  It does not include mandatory stocks held by private companies. Agency stocks held outside of national territory, in other countries, should not be included here but reported instead under the category \"Stocks held abroad - Agency\"."]
[null,"Agency stocks for this form are equivalent to the Category 8 (row h) reported in Table 5 of the MOS."]
[]
[null,"GOVERNMENT STOCKS"]
[null,"Include the portion of national territory stocks that are government owned or controlled and held exclusively for emergency purposes. It does not include military stocks or stocks held by state oil companies or electric utilities, neither does it include stocks held directly by industry to fulfill mandatory stock obligations. Government stocks held outside of national territory, in other countries, should not be included here but reported instead under the category \"Stocks held abroad - Government\"."]
[null,"Government stocks for this form are equivalent to the Category 7 (row g) reported in Table 5 of the MOS."]
[]
[null,"NATIONAL TERRITORY STOCKS WITH FOREIGN CLAIM"]
[null,"Include stocks in your national territory which belong to another country and which are either destined for another country or to which the access is guaranteed by an agreement between the respective governments. This category is comprised of stocks held for other countries which are government controlled, held by stock holding organisations, and all other types of stocks belonging to another country but held in your country.  Please provide the breakdown of these stocks by type under categories Industry, Agency and Government Stocks. The definition of the different types of categories is explained above."]
[null,"National Territory Stocks with foreign claim for this form are equivalent to the sum of the following stock categories reported in Table 5 of the MOS:"]
[null,"Category 2 (row b), 3 (row c)."]
[]
[null,"STOCKS HELD ABROAD"]
[null,"Include stocks belonging to your country but held in another country, to which access is guaranteed by an agreement between the respective governments or which are awaiting import into your country. This category is comprised of stocks abroad owned by your government, stocks abroad held by stock holding organisations, and all other types of stocks belonging to your country but held in another country.  Please provide the breakdown of these stocks by type under categories Industry, Of which: obligated industry, Agency and Government Stocks.The definition of the different types of categories is explained above."]
[null,"Stocks held abroad for this form are equivalent to the sum of the following stock categories reported in Table 5 of the MOS:"]
[null,"Category 10 (row j), 11 (row k)."]

{"sheet":"Param","index":13,"n_rows":100,"n_cols":11,"rows_kept":100,"cut":false,"hidden":true,"merged":[]}
[]
[null,"SETTINGS"]
[]
[]
[]
[]
[null,null,"ParamCountry / CountryList"]
[null,null,"(select country)","SELECT","00"]
[null,null,"Australia","AUSTRALI","AU"]
[null,null,"Austria","AUSTRIA","AT"]
[null,null,"Belgium","BELGIUM","BE"]
[null,null,"Brazil","BRAZIL","BR"]
[null,null,"Canada","CANADA","CA"]
[null,null,"Chile","CHILE","CL"]
[null,null,"Czech Republic","CZECH","CZ"]
[null,null,"Denmark","DENMARK","DK"]
[null,null,"Estonia","ESTONIA","EE"]
[null,null,"Finland","FINLAND","FI"]
[null,null,"France","FRANCE","FR"]
[null,null,"Germany","GERMANY","DE"]
[null,null,"Greece","GREECE","GR"]
[null,null,"Hungary","HUNGARY","HU"]
[null,null,"Ireland","IRELAND","IE"]
[null,null,"Italy","ITALY","IT"]
[null,null,"Japan","JAPAN","JP"]
[null,null,"Korea","KOREA","KR"]
[null,null,"Luxembourg","LUXEMBOU","LU"]
[null,null,"Lithuania","LITHUANIA","LT"]
[null,null,"Mexico","MEXICO","MX"]
[null,null,"Netherlands","NETHLAND","NL"]
[null,null,"New Zealand","NZ","NZ"]
[null,null,"Norway","NORWAY","NO"]
[null,null,"Poland","POLAND","PL"]
[null,null,"Portugal","PORTUGAL","PT"]
[null,null,"Slovak Republic","SLOVAKIA","SK"]
[null,null,"Spain","SPAIN","ES"]
[null,null,"Sweden","SWEDEN","SE"]
[null,null,"Switzerland","SWITLAND","CH"]
[null,null,"Turkey","TURKEY","TR"]
[null,null,"United Kingdom","UK","GB"]
[null,null,"United States","USA","US"]
[null,null,"United States (Barrels)","USABBL","T4"]
[]
[]
[]
[]
[]
[null,null,"ParamMonth / MonthList / MonthCodes"]
[null,null,"MONTH ?","000"]
[null,null,"January","JAN"]
[null,null,"February","FEB"]
[null,null,"March","MAR"]
[null,null,"April","APR"]
[null,null,"May","MAY"]
[null,null,"June","JUN"]
[null,null,"July","JUL"]
[null,null,"August","AUG"]
[null,null,"September","SEP"]
[null,null,"October","OCT"]
[null,null,"November","NOV"]
[null,null,"December","DEC"]
[]
[]
[null,null,"MsgAfterRounding: ",true]
[]
[null,null,"DataFromMOS : ",false]
[]
[null,null,"UseBalCrude : ",true,null,"To activate or deactivate a module: tick the check boxes."]
[null,null,"UseBalPetro : ",true]
[null,null,"UseImportCrude : ",true]
[null,null,"UseImportPetro : ",true]
[null,null,"UseExportCrude : ",true]
[null,null,"UseExportPetro : ",true]
[null,null,"UseStocksCrude : ",true]
[null,null,"UseStocksPetro : ",true]
[]
[]
[]
[null,"CALCULATIONS",null,null,null,"ê","DO NOT TOUCH!",null,null,null,"ê"]
[]
[]
[]
[null,null,"MonthIndex: ",{"$f":"MATCH(FirstMonth,MonthList,0)","v":1}]
[]
[null,null,"QuestMonth: ",{"$f":"INDEX(ParamMonth,MonthIndex,2)","v":"000"}]
[]
[null,null,"CountryIndex: ",{"$f":"IF(CountryUser=0,1,MATCH(CountryUser,CountryList,0))","v":1}]
[]
[null,null,"QuestCountry: ",{"$f":"INDEX(ParamCountry,D87,3)","v":"00"}]
[null,null,"CountryCode: ",{"$f":"INDEX(ParamCountry,D87,2)","v":"SELECT"}]
[null,null,"CountryMessage:",{"$f":"IF(CountryIndex=1,\"(select your country on the 'Start' sheet)\",CountryUser)","v":"(select your country on the 'Start' sheet)"}]
[]
[null,null,"CsvMonth1: ","NOV","Paste by VBA"]
[null,null,"CsvYear1: ",2013,"Paste by VBA"]
[null,null,"PosiMonth1: ",{"$f":"IF(ISERROR(MATCH(D93,MonthCodes,0)),100,MATCH(D93,MonthCodes,0))","v":12}]
[]
[null,null,"CsvCountry:","CHILE","Paste by VBA"]
[null,null,null,{"$f":"IF(ISERROR(MATCH(CsvCountry,CountryIeaList,0))=FALSE,MATCH(CsvCountry,CountryIeaList,0),IF(ISERROR(MATCH(CsvCountry,CountryIsoList,0))=FALSE,MATCH(CsvCountry,CountryIsoList,0),0))","v":7}]
[null,null,"CsvCountryName:",{"$f":"IF(ISERROR(INDEX(ParamCountry,D98,1)),\"UNKNOWN\",INDEX(ParamCountry,D98,1))","v":"Chile"},"Read by VBA"]
[null,null,"CsvMonthName:",{"$f":"INDEX(MonthList,PosiMonth1,1)","v":"November"},"Read by VBA"]

{"sheet":"Formulas","index":14,"n_rows":348,"n_cols":222,"rows_kept":348,"cut":false,"hidden":true,"merged":[[8,218,9,218],[8,219,9,219],[8,220,9,220],[8,221,9,221],[8,204,9,204],[8,205,9,205],[8,206,9,206],[8,209,9,209],[8,212,9,212],[8,215,9,215],[8,201,9,201],[8,184,9,184],[8,185,9,185],[8,191,9,191],[8,192,9,192],[8,193,9,193],[8,194,9,194],[8,196,9,196],[8,197,9,197],[8,198,9,198],[8,199,9,199],[8,200,9,200],[8,183,9,183],[8,162,9,162],[8,163,9,163],[8,164,9,164],[8,165,9,165],[8,168,9,168],[8,169,9,169],[8,170,9,170],[8,173,9,173],[8,176,9,176],[8,179,9,179],[8,182,9,182],[8,161,9,161],[8,142,9,142],[8,145,9,145],[8,148,9,148],[8,149,9,149],[8,150,9,150],[8,151,9,151],[8,156,9,156],[8,157,9,157],[8,158,9,158],[8,159,9,159],[8,160,9,160],[8,139,9,139],[8,124,9,124],[8,125,9,125],[8,126,9,126],[8,127,9,127],[8,128,9,128],[8,129,9,129],[8,130,9,130],[8,131,9,131],[8,134,9,134],[8,135,9,135],[8,136,9,136],[8,101,9,101],[8,102,9,102],[8,103,9,103],[8,92,9,92],[8,93,9,93],[8,94,9,94],[8,95,9,95],[8,96,9,96],[8,117,9,117],[8,122,9,122],[8,123,9,123],[8,80,9,80],[8,81,9,81],[8,82,9,82],[8,83,9,83],[8,85,9,85],[8,86,9,86],[8,106,9,106],[8,109,9,109],[8,112,9,112],[8,115,9,115],[8,116,9,116],[8,97,9,97],[8,98,9,98],[189,22,189,23],[195,22,195,23],[8,22,9,23],[11,22,11,23],[16,22,16,23],[22,22,22,23],[181,22,182,23],[184,22,184,23]]}
[]
[null,"Formulas backup for forms WITH MOS",null,null,null,null,null,null,null,null,null,"Faire une macro de copie retour ?"]
[]
[null,"This sheet is used to reset the forms when asked. We do a 'copy / paste / formulas' from this sheet to the forms."]
[null,"If you need to update the formulas : 1/ Check the 'MOS' check box,   2/ Modify the formulas in QuE tables   3/ Copy/paste the formulas in the first table below."]
[null,null,null,null,null,null,null,null,null,null,null,null,null,null,null,null,null,null,null,null,null,null,null,null,null,null,null,null,null,null,null,null,null,null,null,null,null,null,null,null,null,null,null,null,null,null,null,null,null,null,null,null,null,null,null,null,null,null,null,null,null,null,null,null,null,null,null,null,null,null,null,null,null,null,null,null,null,"Table 1: SUPPLY OF CRUDE OIL, NGL, REFINERY FEEDSTOCKS, ADDITIVES AND OTHER HYDROCARBONS"]
[null,"Crude, NGL and Other Balance",null,null,null,null,null,null,"Product Balance",null,null,null,null,null,null,null,null,null,null,null,null,null,"Crude, NGL and Other Stocks",null,null,null,null,null,"Product Closing stocks",null,null,null,null,null,null,null,null,null,null,null,"Crude Imports",null,null,null,null,null,"Product Imports",null,null,null,null,null,null,null,null,null,null,null,"Crude Exports",null,null,null,null,null,"Product Exports"]
[null,null,null,null,null,null,"Thousand Metric Tons",null,null,null,null,null,null,null,null,null,null,"Thousand Metric Tons",null,null,null,null,null,null,null,null,null,"Thousand Metric Tons",null,null,null,null,null,null,null,null,null,"Thousand Metric Tons",null,null,null,null,null,null,null,"Thousand Metric Tons",null,null,null,null,null,null,null,"Thousand Metric Tons",null,null,null,null,null,null,null,null,null,"Thousand Metric Tons",null,null,null,null,null,null,null,"Thousand Metric Tons",null,null,null,null,null,null,null,null,null,null,null,null,null,null,"Unit:  Thousand Metric Tons",null,null,"Table 2: SUPPLY OF FINISHED PRODUCTS",null,null,null,null,null,null,null,null,null,null,null,null,null,null,null,null,null,null,null,null,null,null,null,null,null,null,null,"Unit:  Thousand Metric Tons",null,null,"Table 3: IMPORTS BY ORIGIN",null,null,null,null,null,null,null,null,null,null,null,null,null,null,null,null,null,null,null,null,null,null,null,null,null,null,null,null,null,null,"Unit:  Thousand Metric Tons",null,null,"Table 4: EXPORTS BY DESTINATION",null,null,null,null,null,null,null,null,null,null,null,null,null,null,null,null,null,null,null,null,null,null,null,null,null,null,null,null,null,null,"Unit:  Thousand Metric Tons",null,null,"Table 5: STOCK LEVELS",null,null,null,"All opening stock levels should be equal to closing stock levels of the previous month",null,null,null,null,null,null,null,null,null,null,null,null,null,null,null,null,null,null,null,null,null,null,null,null,null,null,null,null,"Unit:  Thousand Metric Tons"]
[null,null,null,null,null,null,null,null,null,null,"Petroleum Products",null,null,null,null,null,null,null,null,null,null,null,null,null,null,null,null,null,"Petroleum Products",null,null,null,null,null,null,null,null,null,null,null,null,null,null,null,null,null,null,null,null,null,null,null,null,null,null,null,null,null,null,null,null,null,null,null,null,null,null,null,null,null,null,null,null,null,null,null,null,null,null,null,"Crude Oil","NGL","Refinery Feedstocks","Additives Oxygenates",null,"Other Hydrocarbons","Total",null,null,null,null,null,"Crude\noil","Natural\ngas\nliquids","Refinery\ngas","Ethane","LPG","Naphtha","Total motor\ngasoline",null,null,"Aviation\ngasoline","Gasoline\ntype\njet fuel","Total\nkerosene\ntype\njet fuel",null,null,"Other\nkerosene",null,null,"Total\ngas/diesel\noil",null,null,"Total \nfuel oil",null,null,"Petroleum coke","Other products","Total products",null,null,null,null,"Crude\noil","Natural\ngas\nliquids","Refinery\nfeedstocks","Additives /\noxygenates","Other\nhydro-carbons","Total\n(A to E)","Ethane","LPG","Naphtha","Total motor\ngasoline",null,null,"Aviation\ngasoline","Gasoline\ntype\njet fuel","Total\nkerosene\ntype\njet fuel",null,null,"Other\nkerosene",null,null,"Total\ngas/diesel\noil",null,null,"Total \nfuel oil",null,null,"Petroleum coke","Other products","Total products","Total\noil",null,null,null,null,"Crude\noil","Natural\ngas\nliquids","Refinery\nfeedstocks","Additives /\noxygenates","Other\nhydro-carbons","Total\n(A to E)","Ethane","LPG","Naphtha","Total motor\ngasoline",null,null,"Aviation\ngasoline","Gasoline\ntype\njet fuel","Total\nkerosene\ntype\njet fuel",null,null,"Other\nkerosene",null,null,"Total\ngas/diesel\noil",null,null,"Total \nfuel oil",null,null,"Petroleum coke","Other products","Total products","Total\noil",null,null,null,null,null,"Crude\noil","Natural\ngas\nliquids","Refinery\nfeedstocks","Additives /\noxygenates",null,"Other\nhydro-carbons","Total\n(A to F, excl. E)","Ethane","LPG","Naphtha","Total motor\ngasoline",null,null,"Aviation\ngasoline","Gasoline\ntype\njet fuel","Total\nkerosene\ntype\njet fuel",null,null,"Other\nkerosene",null,null,"Total\ngas/diesel\noil",null,null,"Total \nfuel oil",null,null,"Petroleum coke","Other products","Total products","Total\noil"]
[null,null,null,"Crude Oil","NGL","Other","Total\n(1)+(2)+(3)",null,null,null,"LPG","Naphtha","Gasoline","Total Kerosene","Of which: Jet\nKerosene","Gas/ Diesel Oil","Of which: Road Diesel","Fuel Oil","Other\nProducts","Total Products \n(5)+(6)+(7)+(8) +(10)+(12)+(13)",null,null,null,null,"Crude Oil","NGL","Other","Total\n(1)+(2)+(3)","LPG","Naphtha","Gasoline","Total Kerosene","Of which: Jet\nKerosene","Gas/ Diesel Oil","Of which: Road Diesel","Fuel Oil","Other\nProducts","Total Products (5)+(6)+(7)+(8) +(10)+(12)+(13)",null,null,null,null,"Crude Oil","NGL","Other","Total\n(1)+(2)+(3)","LPG","Naphtha","Gasoline","Total Kerosene","Of which: Jet\nKerosene","Gas/ Diesel Oil","Of which: road diesel","Fuel Oil","Other\nProducts","Total Products (5)+(6)+(7)+ (8)+(10)+(12)+(13)",null,null,null,null,"Crude Oil","NGL","Other","Total\n(1)+(2)+(3)","LPG","Naphtha","Gasoline","Total Kerosene","Of which: Jet\nKerosene","Gas/ Diesel Oil","Of which: road diesel","Fuel Oil","Other\nProducts","Total Products (5)+(6)+(7)+ (8)+(10)+(12)+(13)",null,null,null,null,null,null,null,null,null,null,"Of which Biofuels",null,null,null,null,null,null,null,null,null,null,null,null,null,null,"Biogasoline","Non-biogasoline",null,null,null,"Bio jet\nkerosene","Non-bio jet\nkerosene",null,"Road diesel","Heating and\nother gas oil",null,"Biodiesels","Non-bio\ngas/diesel\noil",null,"Fuel oil-\nlow sulphur \n(<1%)","Fuel oil-\nhigh sulphur\n (>=1%)",null,null,null,null,null,null,null,null,null,null,null,null,null,null,null,null,null,"Biogasoline","Non-biogasoline",null,null,null,"Bio jet\nkerosene","Non-bio jet\nkerosene",null,"Road diesel","Heating and\nother gas oil",null,"Biodiesels","Non-bio\ngas/diesel\noil",null,"Fuel oil-\nlow sulphur \n(<1%)","Fuel oil-\nhigh sulphur\n (>=1%)",null,null,null,null,null,null,null,null,null,null,null,null,null,null,null,null,null,null,"Biogasoline","Non-biogasoline",null,null,null,"Bio jet\nkerosene","Non-bio jet\nkerosene",null,"Road diesel","Heating and\nother gas oil",null,"Biodiesels","Non-bio\ngas/diesel\noil",null,"Fuel oil-\nlow sulphur \n(<1%)","Fuel oil-\nhigh sulphur\n (>=1%)",null,null,null,null,null,null,null,null,null,null,null,null,null,"Of which\nBiofuels",null,null,null,null,null,null,"Biogasoline","Non-biogasoline",null,null,null,"Bio jet\nkerosene","Non-bio jet\nkerosene",null,"Road diesel","Heating and\nother gas oil",null,"Biodiesels","Non-bio\ngas/diesel\noil",null,"Fuel oil-\nlow sulphur \n(<1%)","Fuel oil-\nhigh sulphur\n (>=1%)"]
[null,null,null,"(1)","(2)","(3)","(4)",null,null,null,"(5)","(6)","(7)","(8)","(9)","(10)","(11)","(12)","(13)","(14)",null,null,null,null,"(1)","(2)","(3)","(4)","(5)","(6)","(7)","(8)","(9)","(10)","(11)","(12)","(13)","(14)",null,null,null,null,"(1)","(2)","(3)","(4)","(5)","(6)","(7)","(8)","(9)","(10)","(11)","(12)","(13)","(14)",null,null,null,null,"(1)","(2)","(3)","(4)","(5)","(6)","(7)","(8)","(9)","(10)","(11)","(12)","(13)","(14)",null,null,null,null,null,null,"A","B","C","D","E","F","G",null,null,null,null,null,"A","B","C","D","E","F","G","H","I","J","K","L","M","N","O","P","Q","R","S","T","U","V","W","X","Y","Z",null,null,null,null,"A","B","C","D","E","F","G","H","I","J","K","L","M","N","O","P","Q","R","S","T","U","V","W","X","Y","Z","AA","AB","AC","AD",null,null,null,null,"A","B","C","D","E","F","G","H","I","J","K","L","M","N","O","P","Q","R","S","T","U","V","W","X","Y","Z","AA","AB","AC","AD",null,null,null,null,null,"A","B","C","D","E","F","G","H","I","J","K","L","M","N","O","P","Q","R","S","T","U","V","W","X","Y","Z","AA","AB","AC","AD","AE"]
[null,"+","Production",{"$f":"MOS_Table_1!D14","v":0},{"$f":"MOS_Table_1!E14","v":0},{"$f":"MOS_Table_1!I14+MOS_Table_1!G14","v":0},{"$f":"SUM(D12:F12)","v":0},null,"+","Refinery Output",{"$f":"MOS_Table_2!H9","v":0},{"$f":"MOS_Table_2!I9","v":0},{"$f":"MOS_Table_2!M9+MOS_Table_2!N9+MOS_Table_2!J9","v":0},{"$f":"MOS_Table_2!P9+MOS_Table_2!Q9+MOS_Table_2!R9","v":0},{"$f":"MOS_Table_2!O9","v":0},{"$f":"MOS_Table_2!U9","v":0},{"$f":"MOS_Table_2!S9","v":0},{"$f":"MOS_Table_2!X9","v":0},{"$f":"MOS_Table_2!F9+MOS_Table_2!G9+MOS_Table_2!AA9+MOS_Table_2!AB9","v":0},{"$f":"K12+L12+M12+N12+P12+R12+S12","v":0},null,null,"Closing stocks on National Territory",null,{"$f":"Y13+Y15+Y16+Y17","v":0},0,0,0,0,0,0,0,0,0,0,0,0,0,null,null,"Albania",1,{"$f":"MOS_Table_3!AP9","v":0},{"$f":"MOS_Table_3!AQ9","v":0},{"$f":"SUM(MOS_Table_3!AR9,MOS_Table_3!AS9,MOS_Table_3!AT9)","v":0},{"$f":"SUM(AQ12:AS12)","v":0},{"$f":"MOS_Table_3!AW9","v":0},{"$f":"MOS_Table_3!AX9","v":0},{"$f":"SUM(MOS_Table_3!BB9,MOS_Table_3!BC9,MOS_Table_3!AY9)","v":0},{"$f":"SUM(MOS_Table_3!BE9:BG9)","v":0},{"$f":"MOS_Table_3!BD9","v":0},{"$f":"MOS_Table_3!BJ9","v":0},{"$f":"MOS_Table_3!BH9","v":0},{"$f":"MOS_Table_3!BM9","v":0},{"$f":"SUM(MOS_Table_3!AV9,MOS_Table_3!BP9,MOS_Table_3!BQ9)","v":0},{"$f":"SUM(AU12:BC12)-AY12-BA12","v":0},"","","Albania",1,{"$f":"MOS_Table_4!BH9","v":0},{"$f":"MOS_Table_4!BI9","v":0},{"$f":"MOS_Table_4!BJ9+MOS_Table_4!BK9+MOS_Table_4!BL9","v":0},{"$f":"SUM(BI12:BK12)","v":0},{"$f":"MOS_Table_4!BO9","v":0},{"$f":"MOS_Table_4!BP9","v":0},{"$f":"MOS_Table_4!BT9+MOS_Table_4!BU9+MOS_Table_4!BQ9","v":0},{"$f":"MOS_Table_4!BW9+MOS_Table_4!BX9+MOS_Table_4!BY9","v":0},{"$f":"MOS_Table_4!BV9","v":0},{"$f":"MOS_Table_4!CB9","v":0},{"$f":"MOS_Table_4!BZ9","v":0},{"$f":"MOS_Table_4!CE9","v":0},{"$f":"MOS_Table_4!BN9+MOS_Table_4!CH9+MOS_Table_4!CI9","v":0},{"$f":"+BM12+BN12+BO12+BP12+BR12+BT12+BU12","v":0},null,null,null,"+","Indigenous production",1,null,null,null,null,null,null,{"$f":"SUM(CC12:CF12,CH12)","v":0},null,null,"+","Primary product receipts1",1,null,null,null,null,null,null,null,null,null,null,null,null,null,null,null,null,null,null,null,null,null,null,null,null,null,{"$f":"SUM(CO12:CU12,CX12:CZ12,DC12,DF12,DI12,DL12:DM12)","v":0},null,null,"Albania",1,null,null,null,null,null,{"$f":"SUM(DS12:DW12)","v":0},null,null,null,null,null,null,null,null,null,null,null,null,null,null,null,null,null,null,null,null,null,null,{"$f":"SUM(DY12:EB12,EE12:EG12,EJ12,EM12,EP12,ES12:ET12)","v":0},{"$f":"SUM(DX12,EU12)","v":0},null,null,"Albania",1,null,null,null,null,null,{"$f":"SUM(FA12:FE12)","v":0},null,null,null,null,null,null,null,null,null,null,null,null,null,null,null,null,null,null,null,null,null,null,{"$f":"SUM(FG12:FI12,FJ12,FM12:FO12,FR12,FU12,FX12,GA12:GB12)","v":0},{"$f":"SUM(FF12,GC12)","v":0},null,null,"(a) All stocks on","Opening",1,{"$f":"GJ14+GJ16+GJ18+GJ20+GJ22+GJ24+GJ26+GJ28","v":0},{"$f":"GK14+GK16+GK18+GK20+GK22+GK24+GK26+GK28","v":0},0,{"$f":"GM14+GM16+GM18+GM20+GM22+GM24+GM26+GM28","v":0},{"$f":"GN14+GN16+GN18+GN20+GN22+GN24+GN26+GN28","v":0},0,{"$f":"GP14+GP16+GP18+GP20+GP22+GP24+GP26+GP28","v":0},0,{"$f":"GR14+GR16+GR18+GR20+GR22+GR24+GR26+GR28","v":0},{"$f":"GS14+GS16+GS18+GS20+GS22+GS24+GS26+GS28","v":0},0,0,0,0,0,0,0,0,0,0,0,0,0,0,0,0,0,0,0,{"$f":"SUM(GQ12:GT12,GW12:GY12,HB12,HE12,HH12,HK12:HL12)","v":0},{"$f":"SUM(GP12,HM12)","v":0}]
[null,"+","From Other sources",null,null,{"$f":"MOS_Table_1!G15+MOS_Table_1!I15","v":0},{"$f":"F13","v":0},null,"+","Receipts",{"$f":"MOS_Table_2!H8+MOS_Table_2!H10","v":0},{"$f":"MOS_Table_2!I8+MOS_Table_2!I10","v":0},{"$f":"(MOS_Table_2!M8+MOS_Table_2!N8+MOS_Table_2!J8)+(MOS_Table_2!M10+MOS_Table_2!N10+MOS_Table_2!J10)","v":0},{"$f":"(MOS_Table_2!P8+MOS_Table_2!Q8+MOS_Table_2!R8)+(MOS_Table_2!P10+MOS_Table_2!Q10+MOS_Table_2!R10)","v":0},{"$f":"MOS_Table_2!O8+MOS_Table_2!O10","v":0},{"$f":"MOS_Table_2!U8+MOS_Table_2!U10","v":0},{"$f":"MOS_Table_2!S8+MOS_Table_2!S10","v":0},{"$f":"MOS_Table_2!X8+MOS_Table_2!X10","v":0},{"$f":"(MOS_Table_2!D8+MOS_Table_2!E8+MOS_Table_2!F8+MOS_Table_2!G8+MOS_Table_2!AA8+MOS_Table_2!AB8)+(MOS_Table_2!F10+MOS_Table_2!G10+MOS_Table_2!AA10+MOS_Table_2!AB10)","v":0},{"$f":"K13+L13+M13+N13+P13+R13+S13","v":0},null,null,null,"Industry",{"$f":"MOS_Table_5!Y15+MOS_Table_5!Y17+MOS_Table_5!Y19+MOS_Table_5!Y25","v":0},{"$f":"MOS_Table_5!Z15+MOS_Table_5!Z17+MOS_Table_5!Z19+MOS_Table_5!Z25","v":0},{"$f":"(MOS_Table_5!AA15+MOS_Table_5!AA17+MOS_Table_5!AA19+MOS_Table_5!AA25) + (MOS_Table_5!AB15+MOS_Table_5!AB17+MOS_Table_5!AB19+MOS_Table_5!AB25) + (MOS_Table_5!AD15+MOS_Table_5!AD17+MOS_Table_5!AD19+MOS_Table_5!AD25)","v":0},{"$f":"SUM(Y13:AA13)","v":0},{"$f":"MOS_Table_5!AG15+MOS_Table_5!AG17+MOS_Table_5!AG19+MOS_Table_5!AG25","v":0},{"$f":"MOS_Table_5!AH15+MOS_Table_5!AH17+MOS_Table_5!AH19+MOS_Table_5!AH25","v":0},{"$f":"(MOS_Table_5!AI15+MOS_Table_5!AI17+MOS_Table_5!AI19+MOS_Table_5!AI25) + (MOS_Table_5!AL15+MOS_Table_5!AL17+MOS_Table_5!AL19+MOS_Table_5!AL25) + (MOS_Table_5!AM15+MOS_Table_5!AM17+MOS_Table_5!AM19+MOS_Table_5!AM25)","v":0},{"$f":"(MOS_Table_5!AO15+MOS_Table_5!AO17+MOS_Table_5!AO19+MOS_Table_5!AO25) + (MOS_Table_5!AP15+MOS_Table_5!AP17+MOS_Table_5!AP19+MOS_Table_5!AP25) + (MOS_Table_5!AQ15+MOS_Table_5!AQ17+MOS_Table_5!AQ19+MOS_Table_5!AQ25)","v":0},{"$f":"MOS_Table_5!AN15+MOS_Table_5!AN17+MOS_Table_5!AN19+MOS_Table_5!AN25","v":0},{"$f":"MOS_Table_5!AT15+MOS_Table_5!AT17+MOS_Table_5!AT19+MOS_Table_5!AT25","v":0},{"$f":"MOS_Table_5!AR15+MOS_Table_5!AR17+MOS_Table_5!AR19+MOS_Table_5!AR25","v":0},{"$f":"MOS_Table_5!AW15+MOS_Table_5!AW17+MOS_Table_5!AW19+MOS_Table_5!AW25","v":0},{"$f":"(MOS_Table_5!AF15+MOS_Table_5!AF17+MOS_Table_5!AF19+MOS_Table_5!AF25) + (MOS_Table_5!AZ15+MOS_Table_5!AZ17+MOS_Table_5!AZ19+MOS_Table_5!AZ25) + (MOS_Table_5!BA15+MOS_Table_5!BA17+MOS_Table_5!BA19+MOS_Table_5!BA25)","v":0},{"$f":"AC13+AD13+AE13+AF13+AH13+AJ13+AK13","v":0},null,null,"Algeria",2,{"$f":"MOS_Table_3!AP10","v":0},{"$f":"MOS_Table_3!AQ10","v":0},{"$f":"SUM(MOS_Table_3!AR10,MOS_Table_3!AS10,MOS_Table_3!AT10)","v":0},{"$f":"SUM(AQ13:AS13)","v":0},{"$f":"MOS_Table_3!AW10","v":0},{"$f":"MOS_Table_3!AX10","v":0},{"$f":"SUM(MOS_Table_3!BB10,MOS_Table_3!BC10,MOS_Table_3!AY10)","v":0},{"$f":"SUM(MOS_Table_3!BE10:BG10)","v":0},{"$f":"MOS_Table_3!BD10","v":0},{"$f":"MOS_Table_3!BJ10","v":0},{"$f":"MOS_Table_3!BH10","v":0},{"$f":"MOS_Table_3!BM10","v":0},{"$f":"SUM(MOS_Table_3!AV10,MOS_Table_3!BP10,MOS_Table_3!BQ10)","v":0},{"$f":"SUM(AU13:BC13)-AY13-BA13","v":0},null,null,"Algeria",2,{"$f":"MOS_Table_4!BH10","v":0},{"$f":"MOS_Table_4!BI10","v":0},{"$f":"MOS_Table_4!BJ10+MOS_Table_4!BK10+MOS_Table_4!BL10","v":0},{"$f":"SUM(BI13:BK13)","v":0},{"$f":"MOS_Table_4!BO10","v":0},{"$f":"MOS_Table_4!BP10","v":0},{"$f":"MOS_Table_4!BT10+MOS_Table_4!BU10+MOS_Table_4!BQ10","v":0},{"$f":"MOS_Table_4!BW10+MOS_Table_4!BX10+MOS_Table_4!BY10","v":0},{"$f":"MOS_Table_4!BV10","v":0},{"$f":"MOS_Table_4!CB10","v":0},{"$f":"MOS_Table_4!BZ10","v":0},{"$f":"MOS_Table_4!CE10","v":0},{"$f":"MOS_Table_4!BN10+MOS_Table_4!CH10+MOS_Table_4!CI10","v":0},{"$f":"+BM13+BN13+BO13+BP13+BR13+BT13+BU13","v":0},null,null,null,"+","Receipts from other sources",2,null,null,null,null,null,null,0,null,null,"+","Refinery gross output",2,null,null,null,null,null,null,null,null,null,null,null,null,null,null,null,null,null,null,null,null,null,null,null,null,null,{"$f":"SUM(CQ13:CU13,CX13:CZ13,DC13,DF13,DI13,DL13:DM13)","v":0},null,null,"Algeria",2,null,null,null,null,null,0,null,null,null,null,null,null,null,null,null,null,null,null,null,null,null,null,null,null,null,null,null,null,{"$f":"SUM(DY13:EB13,EE13:EG13,EJ13,EM13,EP13,ES13:ET13)","v":0},{"$f":"SUM(DX13,EU13)","v":0},null,null,"Algeria",2,null,null,null,null,null,{"$f":"SUM(FA13:FE13)","v":0},null,null,null,null,null,null,null,null,null,null,null,null,null,null,null,null,null,null,null,null,null,null,{"$f":"SUM(FG13:FI13,FJ13,FM13:FO13,FR13,FU13,FX13,GA13:GB13)","v":0},{"$f":"SUM(FF13,GC13)","v":0},null,null,"national territory (b+c+d+e+f+g+h+i) 1","Closing",2,{"$f":"GJ15+GJ17+GJ19+GJ21+GJ23+GJ25+GJ27+GJ29","v":0},0,0,{"$f":"GM15+GM17+GM19+GM21+GM23+GM25+GM27+GM29","v":0},{"$f":"GN15+GN17+GN19+GN21+GN23+GN25+GN27+GN29","v":0},0,0,0,{"$f":"GR15+GR17+GR19+GR21+GR23+GR25+GR27+GR29","v":0},0,0,0,0,0,0,0,0,0,0,0,0,0,0,0,0,0,0,0,0,{"$f":"SUM(GQ13:GT13,GW13:GY13,HB13,HE13,HH13,HK13:HL13)","v":0},{"$f":"SUM(GP13,HM13)","v":0}]
[null,"+","Imports",{"$f":"MOS_Table_1!D18","v":0},{"$f":"MOS_Table_1!E18","v":0},{"$f":"MOS_Table_1!F18+MOS_Table_1!G18+MOS_Table_1!I18","v":0},{"$f":"SUM(D14:F14)","v":0},null,"+","Imports",{"$f":"MOS_Table_2!H12","v":0},{"$f":"MOS_Table_2!I12","v":0},{"$f":"MOS_Table_2!M12+MOS_Table_2!N12+MOS_Table_2!J12","v":0},{"$f":"MOS_Table_2!P12+MOS_Table_2!Q12+MOS_Table_2!R12","v":0},{"$f":"MOS_Table_2!O12","v":0},{"$f":"MOS_Table_2!U12","v":0},{"$f":"MOS_Table_2!S12","v":0},{"$f":"MOS_Table_2!X12","v":0},{"$f":"MOS_Table_2!F12+MOS_Table_2!G12+MOS_Table_2!AA12+MOS_Table_2!AB12","v":0},0,null,null,null,"Of which: obligated industry stocks",null,null,null,{"$f":"SUM(Y14:AA14)","v":0},null,null,null,null,null,null,null,null,null,{"$f":"AC14+AD14+AE14+AF14+AH14+AJ14+AK14","v":0},null,null,"Andorra",3,{"$f":"MOS_Table_3!AP11","v":0},{"$f":"MOS_Table_3!AQ11","v":0},{"$f":"SUM(MOS_Table_3!AR11,MOS_Table_3!AS11,MOS_Table_3!AT11)","v":0},0,{"$f":"MOS_Table_3!AW11","v":0},{"$f":"MOS_Table_3!AX11","v":0},{"$f":"SUM(MOS_Table_3!BB11,MOS_Table_3!BC11,MOS_Table_3!AY11)","v":0},{"$f":"SUM(MOS_Table_3!BE11:BG11)","v":0},{"$f":"MOS_Table_3!BD11","v":0},{"$f":"MOS_Table_3!BJ11","v":0},{"$f":"MOS_Table_3!BH11","v":0},{"$f":"MOS_Table_3!BM11","v":0},{"$f":"SUM(MOS_Table_3!AV11,MOS_Table_3!BP11,MOS_Table_3!BQ11)","v":0},0,null,null,"Andorra",3,{"$f":"MOS_Table_4!BH11","v":0},{"$f":"MOS_Table_4!BI11","v":0},{"$f":"MOS_Table_4!BJ11+MOS_Table_4!BK11+MOS_Table_4!BL11","v":0},0,{"$f":"MOS_Table_4!BO11","v":0},{"$f":"MOS_Table_4!BP11","v":0},{"$f":"MOS_Table_4!BT11+MOS_Table_4!BU11+MOS_Table_4!BQ11","v":0},{"$f":"MOS_Table_4!BW11+MOS_Table_4!BX11+MOS_Table_4!BY11","v":0},{"$f":"MOS_Table_4!BV11","v":0},{"$f":"MOS_Table_4!CB11","v":0},{"$f":"MOS_Table_4!BZ11","v":0},{"$f":"MOS_Table_4!CE11","v":0},{"$f":"MOS_Table_4!BN11+MOS_Table_4!CH11+MOS_Table_4!CI11","v":0},0,null,null,null,"+","Backflows1",3,null,null,null,null,null,null,0,null,null,"+","Recycled products",3,null,null,null,null,null,null,null,null,null,null,null,null,null,null,null,null,null,null,null,null,null,null,null,null,null,{"$f":"SUM(CQ14:CU14,CX14:CZ14,DC14,DF14,DI14,DL14:DM14)","v":0},null,null,"Andorra",3,null,null,null,null,null,0,null,null,null,null,null,null,null,null,null,null,null,null,null,null,null,null,null,null,null,null,null,null,0,0,null,null,"Andorra",3,null,null,null,null,null,0,null,null,null,null,null,null,null,null,null,null,null,null,null,null,null,null,null,null,null,null,null,null,0,0,null,null,"(b) Stocks held for other countries","Opening",3,null,null,null,null,null,null,{"$f":"SUM(GJ14:GM14,GO14)","v":0},null,null,null,null,null,null,null,null,null,null,null,null,null,null,null,null,null,null,null,null,null,null,0,0]
[null,"-","Exports",{"$f":"MOS_Table_1!D19","v":0},{"$f":"MOS_Table_1!E19","v":0},{"$f":"MOS_Table_1!F19+MOS_Table_1!G19+MOS_Table_1!I19","v":0},{"$f":"SUM(D15:F15)","v":0},null,"-","Exports",{"$f":"MOS_Table_2!H13","v":0},{"$f":"MOS_Table_2!I13","v":0},{"$f":"MOS_Table_2!M13+MOS_Table_2!N13+MOS_Table_2!J13","v":0},{"$f":"MOS_Table_2!P13+MOS_Table_2!Q13+MOS_Table_2!R13","v":0},{"$f":"MOS_Table_2!O13","v":0},{"$f":"MOS_Table_2!U13","v":0},{"$f":"MOS_Table_2!S13","v":0},{"$f":"MOS_Table_2!X13","v":0},{"$f":"MOS_Table_2!F13+MOS_Table_2!G13+MOS_Table_2!AA13+MOS_Table_2!AB13","v":0},0,null,null,null,"Agency",{"$f":"MOS_Table_5!Y23","v":0},{"$f":"MOS_Table_5!Z23","v":0},{"$f":"MOS_Table_5!AA23+MOS_Table_5!AB23+MOS_Table_5!AD23","v":0},{"$f":"SUM(Y15:AA15)","v":0},{"$f":"MOS_Table_5!AG23","v":0},{"$f":"MOS_Table_5!AH23","v":0},{"$f":"MOS_Table_5!AI23+MOS_Table_5!AL23+MOS_Table_5!AM23","v":0},{"$f":"MOS_Table_5!AO23+MOS_Table_5!AP23+MOS_Table_5!AQ23","v":0},{"$f":"MOS_Table_5!AN23","v":0},{"$f":"MOS_Table_5!AT23","v":0},{"$f":"MOS_Table_5!AR23","v":0},{"$f":"MOS_Table_5!AW23","v":0},{"$f":"MOS_Table_5!AF23+MOS_Table_5!AZ23+MOS_Table_5!BA23","v":0},{"$f":"AC15+AD15+AE15+AF15+AH15+AJ15+AK15","v":0},null,null,"Angola",4,{"$f":"MOS_Table_3!AP12","v":0},{"$f":"MOS_Table_3!AQ12","v":0},{"$f":"SUM(MOS_Table_3!AR12,MOS_Table_3!AS12,MOS_Table_3!AT12)","v":0},0,{"$f":"MOS_Table_3!AW12","v":0},{"$f":"MOS_Table_3!AX12","v":0},{"$f":"SUM(MOS_Table_3!BB12,MOS_Table_3!BC12,MOS_Table_3!AY12)","v":0},{"$f":"SUM(MOS_Table_3!BE12:BG12)","v":0},{"$f":"MOS_Table_3!BD12","v":0},{"$f":"MOS_Table_3!BJ12","v":0},{"$f":"MOS_Table_3!BH12","v":0},{"$f":"MOS_Table_3!BM12","v":0},{"$f":"SUM(MOS_Table_3!AV12,MOS_Table_3!BP12,MOS_Table_3!BQ12)","v":0},0,null,null,"Angola",4,{"$f":"MOS_Table_4!BH12","v":0},{"$f":"MOS_Table_4!BI12","v":0},{"$f":"MOS_Table_4!BJ12+MOS_Table_4!BK12+MOS_Table_4!BL12","v":0},0,{"$f":"MOS_Table_4!BO12","v":0},{"$f":"MOS_Table_4!BP12","v":0},{"$f":"MOS_Table_4!BT12+MOS_Table_4!BU12+MOS_Table_4!BQ12","v":0},{"$f":"MOS_Table_4!BW12+MOS_Table_4!BX12+MOS_Table_4!BY12","v":0},{"$f":"MOS_Table_4!BV12","v":0},{"$f":"MOS_Table_4!CB12","v":0},{"$f":"MOS_Table_4!BZ12","v":0},{"$f":"MOS_Table_4!CE12","v":0},{"$f":"MOS_Table_4!BN12+MOS_Table_4!CH12+MOS_Table_4!CI12","v":0},0,null,null,null,"+","Products transferred2",4,null,null,null,null,null,null,0,null,null,"-","Refinery fuel",4,null,null,null,null,null,null,null,null,null,null,null,null,null,null,null,null,null,null,null,null,null,null,null,null,null,{"$f":"SUM(CQ15:CU15,CX15:CZ15,DC15,DF15,DI15,DL15:DM15)","v":0},null,null,"Angola",4,null,null,null,null,null,0,null,null,null,null,null,null,null,null,null,null,null,null,null,null,null,null,null,null,null,null,null,null,0,0,null,null,"Angola",4,null,null,null,null,null,0,null,null,null,null,null,null,null,null,null,null,null,null,null,null,null,null,null,null,null,null,null,null,0,0,null,null,"under official agreement","Closing",4,null,null,null,null,null,null,{"$f":"SUM(GJ15:GM15,GO15)","v":0},null,null,null,null,null,null,null,null,null,null,null,null,null,null,null,null,null,null,null,null,null,null,0,0]
[null,"+","Products Transferred\n/Backflows",null,null,{"$f":"MOS_Table_1!F16+MOS_Table_1!F17","v":0},{"$f":"F16","v":0},null,"-","Products Transferred",{"$f":"MOS_Table_2!H16","v":0},{"$f":"MOS_Table_2!I16","v":0},{"$f":"MOS_Table_2!M16+MOS_Table_2!N16+MOS_Table_2!J16","v":0},{"$f":"MOS_Table_2!P16+MOS_Table_2!Q16+MOS_Table_2!R16","v":0},{"$f":"MOS_Table_2!O16","v":0},{"$f":"MOS_Table_2!U16","v":0},{"$f":"MOS_Table_2!S16","v":0},{"$f":"MOS_Table_2!X16","v":0},{"$f":"MOS_Table_2!F16+MOS_Table_2!G16+MOS_Table_2!AA16+MOS_Table_2!AB16","v":0},0,null,null,null,"Government",{"$f":"MOS_Table_5!Y21","v":0},{"$f":"MOS_Table_5!Z21","v":0},{"$f":"MOS_Table_5!AA21+MOS_Table_5!AB21+MOS_Table_5!AD21","v":0},{"$f":"SUM(Y16:AA16)","v":0},{"$f":"MOS_Table_5!AG21","v":0},{"$f":"MOS_Table_5!AH21","v":0},{"$f":"MOS_Table_5!AI21+MOS_Table_5!AL21+MOS_Table_5!AM21","v":0},{"$f":"MOS_Table_5!AO21+MOS_Table_5!AP21+MOS_Table_5!AQ21","v":0},{"$f":"MOS_Table_5!AN21","v":0},{"$f":"MOS_Table_5!AT21","v":0},{"$f":"MOS_Table_5!AR21","v":0},{"$f":"MOS_Table_5!AW21","v":0},{"$f":"MOS_Table_5!AF21+MOS_Table_5!AZ21+MOS_Table_5!BA21","v":0},0,null,null,"Argentina",5,{"$f":"MOS_Table_3!AP13","v":0},{"$f":"MOS_Table_3!AQ13","v":0},{"$f":"SUM(MOS_Table_3!AR13,MOS_Table_3!AS13,MOS_Table_3!AT13)","v":0},0,{"$f":"MOS_Table_3!AW13","v":0},{"$f":"MOS_Table_3!AX13","v":0},{"$f":"SUM(MOS_Table_3!BB13,MOS_Table_3!BC13,MOS_Table_3!AY13)","v":0},{"$f":"SUM(MOS_Table_3!BE13:BG13)","v":0},{"$f":"MOS_Table_3!BD13","v":0},{"$f":"MOS_Table_3!BJ13","v":0},{"$f":"MOS_Table_3!BH13","v":0},{"$f":"MOS_Table_3!BM13","v":0},{"$f":"SUM(MOS_Table_3!AV13,MOS_Table_3!BP13,MOS_Table_3!BQ13)","v":0},0,null,null,"Argentina",5,{"$f":"MOS_Table_4!BH13","v":0},{"$f":"MOS_Table_4!BI13","v":0},{"$f":"MOS_Table_4!BJ13+MOS_Table_4!BK13+MOS_Table_4!BL13","v":0},0,{"$f":"MOS_Table_4!BO13","v":0},{"$f":"MOS_Table_4!BP13","v":0},{"$f":"MOS_Table_4!BT13+MOS_Table_4!BU13+MOS_Table_4!BQ13","v":0},{"$f":"MOS_Table_4!BW13+MOS_Table_4!BX13+MOS_Table_4!BY13","v":0},{"$f":"MOS_Table_4!BV13","v":0},{"$f":"MOS_Table_4!CB13","v":0},{"$f":"MOS_Table_4!BZ13","v":0},{"$f":"MOS_Table_4!CE13","v":0},{"$f":"MOS_Table_4!BN13+MOS_Table_4!CH13+MOS_Table_4!CI13","v":0},0,null,null,null,"+","Imports (Balance)3",5,null,null,null,null,null,null,0,null,null,"+","Imports (Balance)2",5,null,null,null,null,null,null,null,null,null,null,null,null,null,null,null,null,null,null,null,null,null,null,null,null,null,{"$f":"SUM(CR16:CU16,CX16:CZ16,DC16,DF16,DI16,DL16:DM16)","v":0},null,null,"Argentina",5,null,null,null,null,null,0,null,null,null,null,null,null,null,null,null,null,null,null,null,null,null,null,null,null,null,null,null,null,{"$f":"SUM(DY16:EB16,EE16:EG16,EJ16,EM16,EP16,ES16:ET16)","v":0},0,null,null,"Argentina",5,null,null,null,null,null,0,null,null,null,null,null,null,null,null,null,null,null,null,null,null,null,null,null,null,null,null,null,null,0,0,null,null,"(c) Stocks with known","Opening",5,null,null,null,null,null,null,0,null,null,null,null,null,null,null,null,null,null,null,null,null,null,null,null,null,null,null,null,null,null,0,0]
[null,"-","Direct Use",{"$f":"MOS_Table_1!D20","v":0},{"$f":"MOS_Table_1!E20","v":0},{"$f":"MOS_Table_1!F20+MOS_Table_1!G20+MOS_Table_1!I20","v":0},{"$f":"SUM(D17:F17)","v":0},null,"+","Interproduct Transfers",{"$f":"MOS_Table_2!H15","v":0},{"$f":"MOS_Table_2!I15","v":0},{"$f":"MOS_Table_2!M15+MOS_Table_2!N15+MOS_Table_2!J15","v":0},{"$f":"MOS_Table_2!P15+MOS_Table_2!Q15+MOS_Table_2!R15","v":0},{"$f":"MOS_Table_2!O15","v":0},{"$f":"MOS_Table_2!U15","v":0},{"$f":"MOS_Table_2!S15","v":0},{"$f":"MOS_Table_2!X15","v":0},{"$f":"MOS_Table_2!D15+MOS_Table_2!E15+MOS_Table_2!F15+MOS_Table_2!G15+MOS_Table_2!AA15+MOS_Table_2!AB15","v":0},0,null,null,"Closing stocks on National Territory with foreign claim",null,{"$f":"MOS_Table_5!Y11+MOS_Table_5!Y13","v":0},{"$f":"MOS_Table_5!Z11+MOS_Table_5!Z13","v":0},{"$f":"(MOS_Table_5!AA11+MOS_Table_5!AA13)+(MOS_Table_5!AB11+MOS_Table_5!AB13)+(MOS_Table_5!AD11+MOS_Table_5!AD13)","v":0},{"$f":"AB18+AB19+AB20","v":0},{"$f":"MOS_Table_5!AG11+MOS_Table_5!AG13","v":0},{"$f":"MOS_Table_5!AH11+MOS_Table_5!AH13","v":0},{"$f":"(MOS_Table_5!AI11+MOS_Table_5!AI13) + (MOS_Table_5!AL11+MOS_Table_5!AL13) + (MOS_Table_5!AM11+MOS_Table_5!AM13)","v":0},{"$f":"(MOS_Table_5!AO11+MOS_Table_5!AO13) + (MOS_Table_5!AP11+MOS_Table_5!AP13) + (MOS_Table_5!AQ11+MOS_Table_5!AQ13)","v":0},{"$f":"MOS_Table_5!AN11+MOS_Table_5!AN13","v":0},{"$f":"MOS_Table_5!AT11+MOS_Table_5!AT13","v":0},{"$f":"MOS_Table_5!AR11+MOS_Table_5!AR13","v":0},{"$f":"MOS_Table_5!AW11+MOS_Table_5!AW13","v":0},{"$f":"(MOS_Table_5!AF11+MOS_Table_5!AF13) + (MOS_Table_5!AZ11+MOS_Table_5!AZ13) + (MOS_Table_5!BA11+MOS_Table_5!BA13)","v":0},0,null,null,"Armenia",6,{"$f":"MOS_Table_3!AP14","v":0},{"$f":"MOS_Table_3!AQ14","v":0},{"$f":"SUM(MOS_Table_3!AR14,MOS_Table_3!AS14,MOS_Table_3!AT14)","v":0},0,{"$f":"MOS_Table_3!AW14","v":0},{"$f":"MOS_Table_3!AX14","v":0},{"$f":"SUM(MOS_Table_3!BB14,MOS_Table_3!BC14,MOS_Table_3!AY14)","v":0},{"$f":"SUM(MOS_Table_3!BE14:BG14)","v":0},{"$f":"MOS_Table_3!BD14","v":0},{"$f":"MOS_Table_3!BJ14","v":0},{"$f":"MOS_Table_3!BH14","v":0},{"$f":"MOS_Table_3!BM14","v":0},{"$f":"SUM(MOS_Table_3!AV14,MOS_Table_3!BP14,MOS_Table_3!BQ14)","v":0},0,null,null,"Armenia",6,{"$f":"MOS_Table_4!BH14","v":0},{"$f":"MOS_Table_4!BI14","v":0},{"$f":"MOS_Table_4!BJ14+MOS_Table_4!BK14+MOS_Table_4!BL14","v":0},0,{"$f":"MOS_Table_4!BO14","v":0},{"$f":"MOS_Table_4!BP14","v":0},{"$f":"MOS_Table_4!BT14+MOS_Table_4!BU14+MOS_Table_4!BQ14","v":0},{"$f":"MOS_Table_4!BW14+MOS_Table_4!BX14+MOS_Table_4!BY14","v":0},{"$f":"MOS_Table_4!BV14","v":0},{"$f":"MOS_Table_4!CB14","v":0},{"$f":"MOS_Table_4!BZ14","v":0},{"$f":"MOS_Table_4!CE14","v":0},{"$f":"MOS_Table_4!BN14+MOS_Table_4!CH14+MOS_Table_4!CI14","v":0},0,null,null,null,"-","Exports (Balance)4",6,null,null,null,null,null,null,0,null,null,"-","Exports (Balance)3",6,null,null,null,null,null,null,null,null,null,null,null,null,null,null,null,null,null,null,null,null,null,null,null,null,null,{"$f":"SUM(CR17:CU17,CX17:CZ17,DC17,DF17,DI17,DL17:DM17)","v":0},null,null,"Armenia",6,null,null,null,null,null,0,null,null,null,null,null,null,null,null,null,null,null,null,null,null,null,null,null,null,null,null,null,null,0,0,null,null,"Armenia",6,null,null,null,null,null,0,null,null,null,null,null,null,null,null,null,null,null,null,null,null,null,null,null,null,null,null,null,null,0,0,null,null,"foreign destination","Closing",6,null,null,null,null,null,null,0,null,null,null,null,null,null,null,null,null,null,null,null,null,null,null,null,null,null,null,null,null,null,0,0]
[null,"-","Stock Change",{"$f":"MOS_Table_1!D21","v":0},{"$f":"MOS_Table_1!E21","v":0},{"$f":"MOS_Table_1!F21+MOS_Table_1!G21+MOS_Table_1!I21","v":0},{"$f":"SUM(D18:F18)","v":0},null,"-","Stock Change",{"$f":"MOS_Table_2!H17","v":0},{"$f":"MOS_Table_2!I17","v":0},{"$f":"MOS_Table_2!M17+MOS_Table_2!N17+MOS_Table_2!J17","v":0},{"$f":"MOS_Table_2!P17+MOS_Table_2!Q17+MOS_Table_2!R17","v":0},{"$f":"MOS_Table_2!O17","v":0},{"$f":"MOS_Table_2!U17","v":0},{"$f":"MOS_Table_2!S17","v":0},{"$f":"MOS_Table_2!X17","v":0},{"$f":"MOS_Table_2!F17+MOS_Table_2!G17+MOS_Table_2!AA17+MOS_Table_2!AB17","v":0},0,null,null,null,"Industry",null,null,null,{"$f":"SUM(Y18:AA18)","v":0},null,null,null,null,null,null,null,null,null,0,null,null,"Aruba",7,{"$f":"MOS_Table_3!AP15","v":0},{"$f":"MOS_Table_3!AQ15","v":0},{"$f":"SUM(MOS_Table_3!AR15,MOS_Table_3!AS15,MOS_Table_3!AT15)","v":0},0,{"$f":"MOS_Table_3!AW15","v":0},{"$f":"MOS_Table_3!AX15","v":0},{"$f":"SUM(MOS_Table_3!BB15,MOS_Table_3!BC15,MOS_Table_3!AY15)","v":0},{"$f":"SUM(MOS_Table_3!BE15:BG15)","v":0},{"$f":"MOS_Table_3!BD15","v":0},{"$f":"MOS_Table_3!BJ15","v":0},{"$f":"MOS_Table_3!BH15","v":0},{"$f":"MOS_Table_3!BM15","v":0},{"$f":"SUM(MOS_Table_3!AV15,MOS_Table_3!BP15,MOS_Table_3!BQ15)","v":0},0,null,null,"Aruba",7,{"$f":"MOS_Table_4!BH15","v":0},{"$f":"MOS_Table_4!BI15","v":0},{"$f":"MOS_Table_4!BJ15+MOS_Table_4!BK15+MOS_Table_4!BL15","v":0},0,{"$f":"MOS_Table_4!BO15","v":0},{"$f":"MOS_Table_4!BP15","v":0},{"$f":"MOS_Table_4!BT15+MOS_Table_4!BU15+MOS_Table_4!BQ15","v":0},{"$f":"MOS_Table_4!BW15+MOS_Table_4!BX15+MOS_Table_4!BY15","v":0},{"$f":"MOS_Table_4!BV15","v":0},{"$f":"MOS_Table_4!CB15","v":0},{"$f":"MOS_Table_4!BZ15","v":0},{"$f":"MOS_Table_4!CE15","v":0},{"$f":"MOS_Table_4!BN15+MOS_Table_4!CH15+MOS_Table_4!CI15","v":0},0,null,null,null,"-","Direct use5",7,null,null,null,null,null,null,0,null,null,"-","International marine bunkers",7,null,null,null,null,null,null,null,null,null,null,null,null,null,null,null,null,null,null,null,null,null,null,null,null,null,{"$f":"SUM(CQ18:CU18,CX18:CZ18,DC18,DF18,DI18,DL18:DM18)","v":0},null,null,"Aruba",7,null,null,null,null,null,0,null,null,null,null,null,null,null,null,null,null,null,null,null,null,null,null,null,null,null,null,null,null,0,0,null,null,"Aruba",7,null,null,null,null,null,0,null,null,null,null,null,null,null,null,null,null,null,null,null,null,null,null,null,null,null,null,null,null,0,0,null,null,"(d) Stocks held in bonded areas","Opening",7,null,null,null,null,null,null,0,null,null,null,null,null,null,null,null,null,null,null,null,null,null,null,null,null,null,null,null,null,null,0,0]
[null,"-","Statistical Difference",{"$f":"MOS_Table_1!D23","v":0},{"$f":"MOS_Table_1!E23","v":0},{"$f":"MOS_Table_1!F23+MOS_Table_1!G23+MOS_Table_1!I23","v":0},{"$f":"G12+G13+G14-G15+G16-G17-G18-G20","v":0},null,"-","Statistical Difference",{"$f":"MOS_Table_2!H19","v":0},{"$f":"MOS_Table_2!I19","v":0},{"$f":"MOS_Table_2!M19+MOS_Table_2!N19+MOS_Table_2!J19","v":0},{"$f":"MOS_Table_2!P19+MOS_Table_2!Q19+MOS_Table_2!R19","v":0},{"$f":"MOS_Table_2!O19","v":0},{"$f":"MOS_Table_2!U19","v":0},{"$f":"MOS_Table_2!S19","v":0},{"$f":"MOS_Table_2!X19","v":0},{"$f":"MOS_Table_2!D19+MOS_Table_2!E19+MOS_Table_2!F19+MOS_Table_2!G19+MOS_Table_2!AA19+MOS_Table_2!AB19","v":0},0,null,null,null,"Agency",null,null,null,{"$f":"SUM(Y19:AA19)","v":0},null,null,null,null,null,null,null,null,null,0,null,null,"Australia",8,{"$f":"MOS_Table_3!AP16","v":0},{"$f":"MOS_Table_3!AQ16","v":0},{"$f":"SUM(MOS_Table_3!AR16,MOS_Table_3!AS16,MOS_Table_3!AT16)","v":0},0,{"$f":"MOS_Table_3!AW16","v":0},{"$f":"MOS_Table_3!AX16","v":0},{"$f":"SUM(MOS_Table_3!BB16,MOS_Table_3!BC16,MOS_Table_3!AY16)","v":0},{"$f":"SUM(MOS_Table_3!BE16:BG16)","v":0},{"$f":"MOS_Table_3!BD16","v":0},{"$f":"MOS_Table_3!BJ16","v":0},{"$f":"MOS_Table_3!BH16","v":0},{"$f":"MOS_Table_3!BM16","v":0},{"$f":"SUM(MOS_Table_3!AV16,MOS_Table_3!BP16,MOS_Table_3!BQ16)","v":0},0,null,null,"Australia",8,{"$f":"MOS_Table_4!BH16","v":0},{"$f":"MOS_Table_4!BI16","v":0},{"$f":"MOS_Table_4!BJ16+MOS_Table_4!BK16+MOS_Table_4!BL16","v":0},0,{"$f":"MOS_Table_4!BO16","v":0},{"$f":"MOS_Table_4!BP16","v":0},{"$f":"MOS_Table_4!BT16+MOS_Table_4!BU16+MOS_Table_4!BQ16","v":0},{"$f":"MOS_Table_4!BW16+MOS_Table_4!BX16+MOS_Table_4!BY16","v":0},{"$f":"MOS_Table_4!BV16","v":0},{"$f":"MOS_Table_4!CB16","v":0},{"$f":"MOS_Table_4!BZ16","v":0},{"$f":"MOS_Table_4!CE16","v":0},{"$f":"MOS_Table_4!BN16+MOS_Table_4!CH16+MOS_Table_4!CI16","v":0},0,null,null,null,"-","Stock changes6",8,null,null,null,null,null,null,0,null,null,"+","Interproduct transfers4",8,null,null,null,null,null,null,null,null,null,null,null,null,null,null,null,null,null,null,null,null,null,null,null,null,null,{"$f":"SUM(CO19:CU19,CX19:CZ19,DC19,DF19,DI19,DL19:DM19)","v":0},null,null,"Australia",8,null,null,null,null,null,0,null,null,null,null,null,null,null,null,null,null,null,null,null,null,null,null,null,null,null,null,null,null,0,0,null,null,"Australia",8,null,null,null,null,null,0,null,null,null,null,null,null,null,null,null,null,null,null,null,null,null,null,null,null,null,null,null,null,0,0,null,null,"and not included in (b) or (c)","Closing",8,null,null,null,null,null,null,0,null,null,null,null,null,null,null,null,null,null,null,null,null,null,null,null,null,null,null,null,null,null,0,0]
[null,"=","Refinery Intake",{"$f":"MOS_Table_1!D24","v":0},{"$f":"MOS_Table_1!E24","v":0},{"$f":"MOS_Table_1!F24+MOS_Table_1!G24+MOS_Table_1!I24","v":0},{"$f":"SUM(D20:F20)","v":0},null,"="," Demand",{"$f":"MOS_Table_2!H20+MOS_Table_2!H14+MOS_Table_2!H11","v":0},{"$f":"MOS_Table_2!I20+MOS_Table_2!I14+MOS_Table_2!I11","v":0},{"$f":"(MOS_Table_2!M20+MOS_Table_2!N20+MOS_Table_2!J20)+(MOS_Table_2!M14+MOS_Table_2!N14+MOS_Table_2!J14)+(MOS_Table_2!M11+MOS_Table_2!N11+MOS_Table_2!J11)","v":0},{"$f":"(MOS_Table_2!P20+MOS_Table_2!Q20+MOS_Table_2!R20)+(MOS_Table_2!P14+MOS_Table_2!Q14+MOS_Table_2!R14)+(MOS_Table_2!P11+MOS_Table_2!Q11+MOS_Table_2!R11)","v":0},{"$f":"MOS_Table_2!O20+MOS_Table_2!O14+MOS_Table_2!O11","v":0},{"$f":"MOS_Table_2!U20+MOS_Table_2!U14+MOS_Table_2!U11","v":0},{"$f":"MOS_Table_2!S20+MOS_Table_2!S14+MOS_Table_2!S11","v":0},{"$f":"MOS_Table_2!X20+MOS_Table_2!X14+MOS_Table_2!X11","v":0},{"$f":"(MOS_Table_2!D20+MOS_Table_2!E20+MOS_Table_2!F20+MOS_Table_2!G20+MOS_Table_2!AA20+MOS_Table_2!AB20)+(MOS_Table_2!F14+MOS_Table_2!G14+MOS_Table_2!AA14+MOS_Table_2!AB14)+(MOS_Table_2!F11+MOS_Table_2!G11+MOS_Table_2!AA11+MOS_Table_2!AB11)","v":0},0,null,null,null,"Government",null,null,null,{"$f":"SUM(Y20:AA20)","v":0},null,null,null,null,null,null,null,null,null,0,null,null,"Austria",9,{"$f":"MOS_Table_3!AP17","v":0},{"$f":"MOS_Table_3!AQ17","v":0},{"$f":"SUM(MOS_Table_3!AR17,MOS_Table_3!AS17,MOS_Table_3!AT17)","v":0},0,{"$f":"MOS_Table_3!AW17","v":0},{"$f":"MOS_Table_3!AX17","v":0},{"$f":"SUM(MOS_Table_3!BB17,MOS_Table_3!BC17,MOS_Table_3!AY17)","v":0},{"$f":"SUM(MOS_Table_3!BE17:BG17)","v":0},{"$f":"MOS_Table_3!BD17","v":0},{"$f":"MOS_Table_3!BJ17","v":0},{"$f":"MOS_Table_3!BH17","v":0},{"$f":"MOS_Table_3!BM17","v":0},{"$f":"SUM(MOS_Table_3!AV17,MOS_Table_3!BP17,MOS_Table_3!BQ17)","v":0},0,null,null,"Austria",9,{"$f":"MOS_Table_4!BH17","v":0},{"$f":"MOS_Table_4!BI17","v":0},{"$f":"MOS_Table_4!BJ17+MOS_Table_4!BK17+MOS_Table_4!BL17","v":0},0,{"$f":"MOS_Table_4!BO17","v":0},{"$f":"MOS_Table_4!BP17","v":0},{"$f":"MOS_Table_4!BT17+MOS_Table_4!BU17+MOS_Table_4!BQ17","v":0},{"$f":"MOS_Table_4!BW17+MOS_Table_4!BX17+MOS_Table_4!BY17","v":0},{"$f":"MOS_Table_4!BV17","v":0},{"$f":"MOS_Table_4!CB17","v":0},{"$f":"MOS_Table_4!BZ17","v":0},{"$f":"MOS_Table_4!CE17","v":0},{"$f":"MOS_Table_4!BN17+MOS_Table_4!CH17+MOS_Table_4!CI17","v":0},0,null,null,null,"=","Refinery intake (Calculated)",9,{"$f":"CC12+CC13+CC14+CC15+CC16-CC17-CC18-CC19","v":0},0,0,0,0,0,0,null,null,"-","Products transferred5",9,null,null,null,null,null,null,null,null,null,null,null,null,null,null,null,null,null,null,null,null,null,null,null,null,null,{"$f":"SUM(CQ20:CU20,CX20:CZ20,DC20,DF20,DI20,DL20:DM20)","v":0},null,null,"Austria",9,null,null,null,null,null,0,null,null,null,null,null,null,null,null,null,null,null,null,null,null,null,null,null,null,null,null,null,null,0,0,null,null,"Austria",9,null,null,null,null,null,0,null,null,null,null,null,null,null,null,null,null,null,null,null,null,null,null,null,null,null,null,null,null,0,0,null,null,"(e) Stocks held by major consumers,","Opening",9,null,null,null,null,null,null,0,null,null,null,null,null,null,null,null,null,null,null,null,null,null,null,null,null,null,null,null,null,null,0,0]
[null,null,null,null,null,null,null,null,null,null,null,null,null,null,null,null,null,null,null,null,null,null,null,null,null,null,null,null,null,null,null,null,null,null,null,null,null,null,null,null,"Azerbaijan",10,{"$f":"MOS_Table_3!AP18","v":0},{"$f":"MOS_Table_3!AQ18","v":0},{"$f":"SUM(MOS_Table_3!AR18,MOS_Table_3!AS18,MOS_Table_3!AT18)","v":0},0,{"$f":"MOS_Table_3!AW18","v":0},{"$f":"MOS_Table_3!AX18","v":0},{"$f":"SUM(MOS_Table_3!BB18,MOS_Table_3!BC18,MOS_Table_3!AY18)","v":0},{"$f":"SUM(MOS_Table_3!BE18:BG18)","v":0},{"$f":"MOS_Table_3!BD18","v":0},{"$f":"MOS_Table_3!BJ18","v":0},{"$f":"MOS_Table_3!BH18","v":0},{"$f":"MOS_Table_3!BM18","v":0},{"$f":"SUM(MOS_Table_3!AV18,MOS_Table_3!BP18,MOS_Table_3!BQ18)","v":0},0,null,null,"Azerbaijan",10,{"$f":"MOS_Table_4!BH18","v":0},{"$f":"MOS_Table_4!BI18","v":0},{"$f":"MOS_Table_4!BJ18+MOS_Table_4!BK18+MOS_Table_4!BL18","v":0},0,{"$f":"MOS_Table_4!BO18","v":0},{"$f":"MOS_Table_4!BP18","v":0},{"$f":"MOS_Table_4!BT18+MOS_Table_4!BU18+MOS_Table_4!BQ18","v":0},{"$f":"MOS_Table_4!BW18+MOS_Table_4!BX18+MOS_Table_4!BY18","v":0},{"$f":"MOS_Table_4!BV18","v":0},{"$f":"MOS_Table_4!CB18","v":0},{"$f":"MOS_Table_4!BZ18","v":0},{"$f":"MOS_Table_4!CE18","v":0},{"$f":"MOS_Table_4!BN18+MOS_Table_4!CH18+MOS_Table_4!CI18","v":0},0,null,null,null,"-","Statistical difference",10,{"$f":"CC20-CC22","v":0},0,0,0,0,0,0,null,null,"-","Stock changes6",10,null,null,null,null,null,null,null,null,null,null,null,null,null,null,null,null,null,null,null,null,null,null,null,null,null,{"$f":"SUM(CR21:CU21,CX21:CZ21,DC21,DF21,DI21,DL21:DM21)","v":0},null,null,"Azerbaijan",10,null,null,null,null,null,0,null,null,null,null,null,null,null,null,null,null,null,null,null,null,null,null,null,null,null,null,null,null,0,0,null,null,"Azerbaijan",10,null,null,null,null,null,0,null,null,null,null,null,null,null,null,null,null,null,null,null,null,null,null,null,null,null,null,null,null,0,0,null,null,"obligated by law","Closing",10,null,null,null,null,null,null,0,null,null,null,null,null,null,null,null,null,null,null,null,null,null,null,null,null,null,null,null,null,null,0,0]
[null,null,null,null,null,null,null,null,null,null,null,null,null,null,null,null,null,null,null,null,null,null,null,null,null,null,null,null,null,null,null,null,null,null,null,null,null,null,null,null,"Bahamas",11,{"$f":"MOS_Table_3!AP19","v":0},{"$f":"MOS_Table_3!AQ19","v":0},{"$f":"SUM(MOS_Table_3!AR19,MOS_Table_3!AS19,MOS_Table_3!AT19)","v":0},0,{"$f":"MOS_Table_3!AW19","v":0},{"$f":"MOS_Table_3!AX19","v":0},{"$f":"SUM(MOS_Table_3!BB19,MOS_Table_3!BC19,MOS_Table_3!AY19)","v":0},{"$f":"SUM(MOS_Table_3!BE19:BG19)","v":0},{"$f":"MOS_Table_3!BD19","v":0},{"$f":"MOS_Table_3!BJ19","v":0},{"$f":"MOS_Table_3!BH19","v":0},{"$f":"MOS_Table_3!BM19","v":0},{"$f":"SUM(MOS_Table_3!AV19,MOS_Table_3!BP19,MOS_Table_3!BQ19)","v":0},0,null,null,"Bahamas",11,{"$f":"MOS_Table_4!BH19","v":0},{"$f":"MOS_Table_4!BI19","v":0},{"$f":"MOS_Table_4!BJ19+MOS_Table_4!BK19+MOS_Table_4!BL19","v":0},0,{"$f":"MOS_Table_4!BO19","v":0},{"$f":"MOS_Table_4!BP19","v":0},{"$f":"MOS_Table_4!BT19+MOS_Table_4!BU19+MOS_Table_4!BQ19","v":0},{"$f":"MOS_Table_4!BW19+MOS_Table_4!BX19+MOS_Table_4!BY19","v":0},{"$f":"MOS_Table_4!BV19","v":0},{"$f":"MOS_Table_4!CB19","v":0},{"$f":"MOS_Table_4!BZ19","v":0},{"$f":"MOS_Table_4!CE19","v":0},{"$f":"MOS_Table_4!BN19+MOS_Table_4!CH19+MOS_Table_4!CI19","v":0},0,null,null,null,"=","Refinery intake (Observed)",11,null,null,null,null,null,null,0,null,null,"=","Gross inland deliveries (Calculated)",11,{"$f":"CO12+CO19","v":0},{"$f":"CP12+CP19","v":0},{"$f":"CQ12+CQ13+CQ14-CQ15-CQ18+CQ19-CQ20","v":0},{"$f":"CR12+CR13+CR14-CR15+CR16-CR17-CR18+CR19-CR20-CR21","v":0},0,0,0,0,0,0,0,0,{"$f":"DA12+DA13+DA14-DA15+DA16-DA17-DA18+DA19-DA20-DA21","v":0},{"$f":"DB12+DB13+DB14-DB15+DB16-DB17-DB18+DB19-DB20-DB21","v":0},0,{"$f":"DD12+DD13+DD14-DD15+DD16-DD17-DD18+DD19-DD20-DD21","v":0},{"$f":"DE12+DE13+DE14-DE15+DE16-DE17-DE18+DE19-DE20-DE21","v":0},{"$f":"DF12+DF13+DF14-DF15+DF16-DF17-DF18+DF19-DF20-DF21","v":0},{"$f":"DG12+DG13+DG14-DG15+DG16-DG17-DG18+DG19-DG20-DG21","v":0},0,0,0,0,{"$f":"DL12+DL13+DL14-DL15+DL16-DL17-DL18+DL19-DL20-DL21","v":0},{"$f":"DM12+DM13+DM14-DM15+DM16-DM17-DM18+DM19-DM20-DM21","v":0},{"$f":"SUM(CO22:CU22,CX22:CZ22,DC22,DF22,DI22,DL22:DM22)","v":0},null,null,"Bahamas",11,null,null,null,null,null,0,null,null,null,null,null,null,null,null,null,null,null,null,null,null,null,null,null,null,null,null,null,null,0,0,null,null,"Bahamas",11,null,null,null,null,null,0,null,null,null,null,null,null,null,null,null,null,null,null,null,null,null,null,null,null,null,null,null,null,0,0,null,null,"(f) Stocks held on board incoming","Opening",11,null,null,null,null,null,null,0,null,null,null,null,null,null,null,null,null,null,null,null,null,null,null,null,null,null,null,null,null,null,0,0]
[null,null,null,null,null,null,null,null,null,null,null,null,null,null,null,null,null,null,null,null,null,null,"Stocks held abroad",null,{"$f":"Y24+Y26+Y27","v":0},0,0,0,0,0,0,0,0,0,0,0,0,0,null,null,"Bahrain",12,{"$f":"MOS_Table_3!AP20","v":0},{"$f":"MOS_Table_3!AQ20","v":0},{"$f":"SUM(MOS_Table_3!AR20,MOS_Table_3!AS20,MOS_Table_3!AT20)","v":0},0,{"$f":"MOS_Table_3!AW20","v":0},{"$f":"MOS_Table_3!AX20","v":0},{"$f":"SUM(MOS_Table_3!BB20,MOS_Table_3!BC20,MOS_Table_3!AY20)","v":0},{"$f":"SUM(MOS_Table_3!BE20:BG20)","v":0},{"$f":"MOS_Table_3!BD20","v":0},{"$f":"MOS_Table_3!BJ20","v":0},{"$f":"MOS_Table_3!BH20","v":0},{"$f":"MOS_Table_3!BM20","v":0},{"$f":"SUM(MOS_Table_3!AV20,MOS_Table_3!BP20,MOS_Table_3!BQ20)","v":0},0,null,null,"Bahrain",12,{"$f":"MOS_Table_4!BH20","v":0},{"$f":"MOS_Table_4!BI20","v":0},{"$f":"MOS_Table_4!BJ20+MOS_Table_4!BK20+MOS_Table_4!BL20","v":0},0,{"$f":"MOS_Table_4!BO20","v":0},{"$f":"MOS_Table_4!BP20","v":0},{"$f":"MOS_Table_4!BT20+MOS_Table_4!BU20+MOS_Table_4!BQ20","v":0},{"$f":"MOS_Table_4!BW20+MOS_Table_4!BX20+MOS_Table_4!BY20","v":0},{"$f":"MOS_Table_4!BV20","v":0},{"$f":"MOS_Table_4!CB20","v":0},{"$f":"MOS_Table_4!BZ20","v":0},{"$f":"MOS_Table_4!CE20","v":0},{"$f":"MOS_Table_4!BN20+MOS_Table_4!CH20+MOS_Table_4!CI20","v":0},0,null,null,null,null,"Memo Item:       Refinery losses",12,null,null,null,null,null,null,0,null,null,"-","Statistical difference",12,{"$f":"CO22-CO24","v":0},{"$f":"CP22-CP24","v":0},0,0,0,0,0,0,0,0,0,0,{"$f":"DA22-DA24","v":0},{"$f":"DB22-DB24","v":0},0,{"$f":"DD22-DD24","v":0},{"$f":"DE22-DE24","v":0},{"$f":"DF22-DF24","v":0},{"$f":"DG22-DG24","v":0},0,0,0,0,{"$f":"DL22-DL24","v":0},{"$f":"DM22-DM24","v":0},{"$f":"SUM(CO23:CU23,CX23:CZ23,DC23,DF23,DI23,DL23:DM23)","v":0},null,null,"Bahrain",12,null,null,null,null,null,0,null,null,null,null,null,null,null,null,null,null,null,null,null,null,null,null,null,null,null,null,null,null,0,0,null,null,"Bahrain",12,null,null,null,null,null,0,null,null,null,null,null,null,null,null,null,null,null,null,null,null,null,null,null,null,null,null,null,null,0,0,null,null,"ocean vessels in port or at mooring","Closing",12,null,null,null,null,null,null,0,null,null,null,null,null,null,null,null,null,null,null,null,null,null,null,null,null,null,null,null,null,null,0,0]
[null,null,null,null,null,null,null,null,null,null,null,null,null,null,null,null,null,null,null,null,null,null,null,"Industry",{"$f":"MOS_Table_5!Y29+MOS_Table_5!Y41","v":0},{"$f":"MOS_Table_5!Z29+MOS_Table_5!Z41","v":0},{"$f":"(MOS_Table_5!AA29+MOS_Table_5!AA41) + (MOS_Table_5!AB29+MOS_Table_5!AB41) + (MOS_Table_5!AD29+MOS_Table_5!AD41)","v":0},{"$f":"SUM(Y24:AA24)","v":0},{"$f":"MOS_Table_5!AG29+MOS_Table_5!AG41","v":0},{"$f":"MOS_Table_5!AH29+MOS_Table_5!AH41","v":0},{"$f":"(MOS_Table_5!AI29+MOS_Table_5!AI41) + (MOS_Table_5!AL29+MOS_Table_5!AL41) + (MOS_Table_5!AM29+MOS_Table_5!AM41)","v":0},{"$f":"(MOS_Table_5!AO29+MOS_Table_5!AO41) + (MOS_Table_5!AP29+MOS_Table_5!AP41) + (MOS_Table_5!AQ29+MOS_Table_5!AQ41)","v":0},{"$f":"MOS_Table_5!AN29+MOS_Table_5!AN41","v":0},{"$f":"MOS_Table_5!AT29+MOS_Table_5!AT41","v":0},{"$f":"MOS_Table_5!AR29+MOS_Table_5!AR41","v":0},{"$f":"MOS_Table_5!AW29+MOS_Table_5!AW41","v":0},{"$f":"(MOS_Table_5!AF29+MOS_Table_5!AF41) + (MOS_Table_5!AZ29+MOS_Table_5!AZ41) + (MOS_Table_5!BA29+MOS_Table_5!BA41)","v":0},{"$f":"AC24+AD24+AE24+AF24+AH24+AJ24+AK24","v":0},null,null,"Bangladesh",13,{"$f":"MOS_Table_3!AP21","v":0},{"$f":"MOS_Table_3!AQ21","v":0},{"$f":"SUM(MOS_Table_3!AR21,MOS_Table_3!AS21,MOS_Table_3!AT21)","v":0},0,{"$f":"MOS_Table_3!AW21","v":0},{"$f":"MOS_Table_3!AX21","v":0},{"$f":"SUM(MOS_Table_3!BB21,MOS_Table_3!BC21,MOS_Table_3!AY21)","v":0},{"$f":"SUM(MOS_Table_3!BE21:BG21)","v":0},{"$f":"MOS_Table_3!BD21","v":0},{"$f":"MOS_Table_3!BJ21","v":0},{"$f":"MOS_Table_3!BH21","v":0},{"$f":"MOS_Table_3!BM21","v":0},{"$f":"SUM(MOS_Table_3!AV21,MOS_Table_3!BP21,MOS_Table_3!BQ21)","v":0},0,null,null,"Bangladesh",13,{"$f":"MOS_Table_4!BH21","v":0},{"$f":"MOS_Table_4!BI21","v":0},{"$f":"MOS_Table_4!BJ21+MOS_Table_4!BK21+MOS_Table_4!BL21","v":0},0,{"$f":"MOS_Table_4!BO21","v":0},{"$f":"MOS_Table_4!BP21","v":0},{"$f":"MOS_Table_4!BT21+MOS_Table_4!BU21+MOS_Table_4!BQ21","v":0},{"$f":"MOS_Table_4!BW21+MOS_Table_4!BX21+MOS_Table_4!BY21","v":0},{"$f":"MOS_Table_4!BV21","v":0},{"$f":"MOS_Table_4!CB21","v":0},{"$f":"MOS_Table_4!BZ21","v":0},{"$f":"MOS_Table_4!CE21","v":0},{"$f":"MOS_Table_4!BN21+MOS_Table_4!CH21+MOS_Table_4!CI21","v":0},0,null,null,null,null,null,null,null,null,null,null,null,null,null,null,null,"=","Gross inland deliveries (Observed)",13,null,null,null,null,null,null,null,null,null,null,null,null,null,null,null,null,null,null,null,null,null,null,null,null,null,{"$f":"SUM(CO24:CU24,CX24:CZ24,DC24,DF24,DI24,DL24:DM24)","v":0},null,null,"Bangladesh",13,null,null,null,null,null,0,null,null,null,null,null,null,null,null,null,null,null,null,null,null,null,null,null,null,null,null,null,null,0,0,null,null,"Bangladesh",13,null,null,null,null,null,0,null,null,null,null,null,null,null,null,null,null,null,null,null,null,null,null,null,null,null,null,null,null,0,0,null,null,"(g) Stocks held by government","Opening",13,null,null,null,null,null,null,0,null,null,null,null,null,null,null,null,null,null,null,null,null,null,null,null,null,null,null,null,null,null,0,0]
[null,"Formulas backup for QuE forms WITHOUT MOS are below",null,null,null,null,null,null,null,null,"ê",null,null,null,null,null,null,null,null,null,null,null,null,"Of which: obligated industry stocks",null,null,null,{"$f":"SUM(Y25:AA25)","v":0},null,null,null,null,null,null,null,null,null,{"$f":"AC25+AD25+AE25+AF25+AH25+AJ25+AK25","v":0},null,null,"Barbados",14,{"$f":"MOS_Table_3!AP22","v":0},{"$f":"MOS_Table_3!AQ22","v":0},{"$f":"SUM(MOS_Table_3!AR22,MOS_Table_3!AS22,MOS_Table_3!AT22)","v":0},0,{"$f":"MOS_Table_3!AW22","v":0},{"$f":"MOS_Table_3!AX22","v":0},{"$f":"SUM(MOS_Table_3!BB22,MOS_Table_3!BC22,MOS_Table_3!AY22)","v":0},{"$f":"SUM(MOS_Table_3!BE22:BG22)","v":0},{"$f":"MOS_Table_3!BD22","v":0},{"$f":"MOS_Table_3!BJ22","v":0},{"$f":"MOS_Table_3!BH22","v":0},{"$f":"MOS_Table_3!BM22","v":0},{"$f":"SUM(MOS_Table_3!AV22,MOS_Table_3!BP22,MOS_Table_3!BQ22)","v":0},0,null,null,"Barbados",14,{"$f":"MOS_Table_4!BH22","v":0},{"$f":"MOS_Table_4!BI22","v":0},{"$f":"MOS_Table_4!BJ22+MOS_Table_4!BK22+MOS_Table_4!BL22","v":0},0,{"$f":"MOS_Table_4!BO22","v":0},{"$f":"MOS_Table_4!BP22","v":0},{"$f":"MOS_Table_4!BT22+MOS_Table_4!BU22+MOS_Table_4!BQ22","v":0},{"$f":"MOS_Table_4!BW22+MOS_Table_4!BX22+MOS_Table_4!BY22","v":0},{"$f":"MOS_Table_4!BV22","v":0},{"$f":"MOS_Table_4!CB22","v":0},{"$f":"MOS_Table_4!BZ22","v":0},{"$f":"MOS_Table_4!CE22","v":0},{"$f":"MOS_Table_4!BN22+MOS_Table_4!CH22+MOS_Table_4!CI22","v":0},0,null,null,null,null,null,null,null,null,null,null,null,null,null,null,null,null,"Memo Items:7                    Deliveries to international aviation",14,null,null,null,null,null,null,null,null,null,null,null,null,null,null,null,null,null,null,null,null,null,null,null,null,null,{"$f":"SUM(CX25:CZ25)","v":0},null,null,"Barbados",14,null,null,null,null,null,0,null,null,null,null,null,null,null,null,null,null,null,null,null,null,null,null,null,null,null,null,null,null,0,0,null,null,"Barbados",14,null,null,null,null,null,0,null,null,null,null,null,null,null,null,null,null,null,null,null,null,null,null,null,null,null,null,null,null,0,0,null,null," on national territory","Closing",14,null,null,null,null,null,null,0,null,null,null,null,null,null,null,null,null,null,null,null,null,null,null,null,null,null,null,null,null,null,0,0]
[null,null,null,null,null,null,null,null,null,null," ",null,null,null,null,null,null,null,null,null,null,null,null,"Agency",{"$f":"MOS_Table_5!Y39","v":0},{"$f":"MOS_Table_5!Z39","v":0},{"$f":"MOS_Table_5!AA39+MOS_Table_5!AB39+MOS_Table_5!AD39","v":0},{"$f":"SUM(Y26:AA26)","v":0},{"$f":"MOS_Table_5!AG39","v":0},{"$f":"MOS_Table_5!AH39","v":0},{"$f":"MOS_Table_5!AI39+MOS_Table_5!AL39+MOS_Table_5!AM39","v":0},{"$f":"MOS_Table_5!AO39+MOS_Table_5!AP39+MOS_Table_5!AQ39","v":0},{"$f":"MOS_Table_5!AN39","v":0},{"$f":"MOS_Table_5!AT39","v":0},{"$f":"MOS_Table_5!AR39","v":0},{"$f":"MOS_Table_5!AW39","v":0},{"$f":"MOS_Table_5!AF39+MOS_Table_5!AZ39+MOS_Table_5!BA39","v":0},{"$f":"AC26+AD26+AE26+AF26+AH26+AJ26+AK26","v":0},null,null,"Belarus",15,{"$f":"MOS_Table_3!AP23","v":0},{"$f":"MOS_Table_3!AQ23","v":0},{"$f":"SUM(MOS_Table_3!AR23,MOS_Table_3!AS23,MOS_Table_3!AT23)","v":0},0,{"$f":"MOS_Table_3!AW23","v":0},{"$f":"MOS_Table_3!AX23","v":0},{"$f":"SUM(MOS_Table_3!BB23,MOS_Table_3!BC23,MOS_Table_3!AY23)","v":0},{"$f":"SUM(MOS_Table_3!BE23:BG23)","v":0},{"$f":"MOS_Table_3!BD23","v":0},{"$f":"MOS_Table_3!BJ23","v":0},{"$f":"MOS_Table_3!BH23","v":0},{"$f":"MOS_Table_3!BM23","v":0},{"$f":"SUM(MOS_Table_3!AV23,MOS_Table_3!BP23,MOS_Table_3!BQ23)","v":0},0,null,null,"Belarus",15,{"$f":"MOS_Table_4!BH23","v":0},{"$f":"MOS_Table_4!BI23","v":0},{"$f":"MOS_Table_4!BJ23+MOS_Table_4!BK23+MOS_Table_4!BL23","v":0},0,{"$f":"MOS_Table_4!BO23","v":0},{"$f":"MOS_Table_4!BP23","v":0},{"$f":"MOS_Table_4!BT23+MOS_Table_4!BU23+MOS_Table_4!BQ23","v":0},{"$f":"MOS_Table_4!BW23+MOS_Table_4!BX23+MOS_Table_4!BY23","v":0},{"$f":"MOS_Table_4!BV23","v":0},{"$f":"MOS_Table_4!CB23","v":0},{"$f":"MOS_Table_4!BZ23","v":0},{"$f":"MOS_Table_4!CE23","v":0},{"$f":"MOS_Table_4!BN23+MOS_Table_4!CH23+MOS_Table_4!CI23","v":0},0,null,null,null,null,null,null,null,null,null,null,null,null,null,null,null,null,"Deliveries to main activity producer power plants",15,null,null,null,null,null,null,null,null,null,null,null,null,null,null,null,null,null,null,null,null,null,null,null,null,null,{"$f":"SUM(CO26:CU26,CX26:CZ26,DC26,DF26,DI26,DL26:DM26)","v":0},null,null,"Belarus",15,null,null,null,null,null,0,null,null,null,null,null,null,null,null,null,null,null,null,null,null,null,null,null,null,null,null,null,null,0,0,null,null,"Belarus",15,null,null,null,null,null,0,null,null,null,null,null,null,null,null,null,null,null,null,null,null,null,null,null,null,null,null,null,null,0,0,null,null,"(h) Stocks held by stock holding ","Opening",15,null,null,null,null,null,null,0,null,null,null,null,null,null,null,null,null,null,null,null,null,null,null,null,null,null,null,null,null,null,{"$f":"SUM(GQ26:GT26,GW26:GY26,HB26,HE26,HH26,HK26:HL26)","v":0},0]
[null,null,null,null,null,null,null,null,null,null,"ê",null,null,null,null,null,null,null,null,null,null,null,null,"Government",{"$f":"MOS_Table_5!Y37","v":0},{"$f":"MOS_Table_5!Z37","v":0},{"$f":"MOS_Table_5!AA37+MOS_Table_5!AB37+MOS_Table_5!AD37","v":0},{"$f":"SUM(Y27:AA27)","v":0},{"$f":"MOS_Table_5!AG37","v":0},{"$f":"MOS_Table_5!AH37","v":0},{"$f":"MOS_Table_5!AI37+MOS_Table_5!AL37+MOS_Table_5!AM37","v":0},{"$f":"MOS_Table_5!AO37+MOS_Table_5!AP37+MOS_Table_5!AQ37","v":0},{"$f":"MOS_Table_5!AN37","v":0},{"$f":"MOS_Table_5!AT37","v":0},{"$f":"MOS_Table_5!AR37","v":0},{"$f":"MOS_Table_5!AW37","v":0},{"$f":"MOS_Table_5!AF37+MOS_Table_5!AZ37+MOS_Table_5!BA37","v":0},{"$f":"AC27+AD27+AE27+AF27+AH27+AJ27+AK27","v":0},null,null,"Belgium",16,{"$f":"MOS_Table_3!AP24","v":0},{"$f":"MOS_Table_3!AQ24","v":0},{"$f":"SUM(MOS_Table_3!AR24,MOS_Table_3!AS24,MOS_Table_3!AT24)","v":0},0,{"$f":"MOS_Table_3!AW24","v":0},{"$f":"MOS_Table_3!AX24","v":0},{"$f":"SUM(MOS_Table_3!BB24,MOS_Table_3!BC24,MOS_Table_3!AY24)","v":0},{"$f":"SUM(MOS_Table_3!BE24:BG24)","v":0},{"$f":"MOS_Table_3!BD24","v":0},{"$f":"MOS_Table_3!BJ24","v":0},{"$f":"MOS_Table_3!BH24","v":0},{"$f":"MOS_Table_3!BM24","v":0},{"$f":"SUM(MOS_Table_3!AV24,MOS_Table_3!BP24,MOS_Table_3!BQ24)","v":0},0,null,null,"Belgium",16,{"$f":"MOS_Table_4!BH24","v":0},{"$f":"MOS_Table_4!BI24","v":0},{"$f":"MOS_Table_4!BJ24+MOS_Table_4!BK24+MOS_Table_4!BL24","v":0},0,{"$f":"MOS_Table_4!BO24","v":0},{"$f":"MOS_Table_4!BP24","v":0},{"$f":"MOS_Table_4!BT24+MOS_Table_4!BU24+MOS_Table_4!BQ24","v":0},{"$f":"MOS_Table_4!BW24+MOS_Table_4!BX24+MOS_Table_4!BY24","v":0},{"$f":"MOS_Table_4!BV24","v":0},{"$f":"MOS_Table_4!CB24","v":0},{"$f":"MOS_Table_4!BZ24","v":0},{"$f":"MOS_Table_4!CE24","v":0},{"$f":"MOS_Table_4!BN24+MOS_Table_4!CH24+MOS_Table_4!CI24","v":0},0,null,null,null,null,null,null,null,null,null,null,null,null,null,null,null,null,"Deliveries of automotive LPG",16,null,null,null,null,null,null,null,null,null,null,null,null,null,null,null,null,null,null,null,null,null,null,null,null,null,{"$f":"CS27","v":0},null,null,"Belgium",16,null,null,null,null,null,0,null,null,null,null,null,null,null,null,null,null,null,null,null,null,null,null,null,null,null,null,null,null,0,0,null,null,"Belgium",16,null,null,null,null,null,0,null,null,null,null,null,null,null,null,null,null,null,null,null,null,null,null,null,null,null,null,null,null,0,0,null,null,"organisation on national territory","Closing",16,null,null,null,null,null,null,0,null,null,null,null,null,null,null,null,null,null,null,null,null,null,null,null,null,null,null,null,null,null,0,0]
[null,null,null,null,null,null,null,null,null,null," ",null,null,null,null,null,null,null,null,null,null,null,null,null,null,null,null,null,null,null,null,null,null,null,null,null,null,null,null,null,"Belize",17,{"$f":"MOS_Table_3!AP25","v":0},{"$f":"MOS_Table_3!AQ25","v":0},{"$f":"SUM(MOS_Table_3!AR25,MOS_Table_3!AS25,MOS_Table_3!AT25)","v":0},0,{"$f":"MOS_Table_3!AW25","v":0},{"$f":"MOS_Table_3!AX25","v":0},{"$f":"SUM(MOS_Table_3!BB25,MOS_Table_3!BC25,MOS_Table_3!AY25)","v":0},{"$f":"SUM(MOS_Table_3!BE25:BG25)","v":0},{"$f":"MOS_Table_3!BD25","v":0},{"$f":"MOS_Table_3!BJ25","v":0},{"$f":"MOS_Table_3!BH25","v":0},{"$f":"MOS_Table_3!BM25","v":0},{"$f":"SUM(MOS_Table_3!AV25,MOS_Table_3!BP25,MOS_Table_3!BQ25)","v":0},0,null,null,"Belize",17,{"$f":"MOS_Table_4!BH25","v":0},{"$f":"MOS_Table_4!BI25","v":0},{"$f":"MOS_Table_4!BJ25+MOS_Table_4!BK25+MOS_Table_4!BL25","v":0},0,{"$f":"MOS_Table_4!BO25","v":0},{"$f":"MOS_Table_4!BP25","v":0},{"$f":"MOS_Table_4!BT25+MOS_Table_4!BU25+MOS_Table_4!BQ25","v":0},{"$f":"MOS_Table_4!BW25+MOS_Table_4!BX25+MOS_Table_4!BY25","v":0},{"$f":"MOS_Table_4!BV25","v":0},{"$f":"MOS_Table_4!CB25","v":0},{"$f":"MOS_Table_4!BZ25","v":0},{"$f":"MOS_Table_4!CE25","v":0},{"$f":"MOS_Table_4!BN25+MOS_Table_4!CH25+MOS_Table_4!CI25","v":0},0,null,null,null,null,null,null,null,null,null,null,null,null,null,null,null,null,"Deliveries of rail and marine diesel",17,null,null,null,null,null,null,null,null,null,null,null,null,null,null,null,null,null,null,null,null,null,null,null,null,null,{"$f":"DF28","v":0},null,null,"Belize",17,null,null,null,null,null,0,null,null,null,null,null,null,null,null,null,null,null,null,null,null,null,null,null,null,null,null,null,null,0,0,null,null,"Belize",17,null,null,null,null,null,0,null,null,null,null,null,null,null,null,null,null,null,null,null,null,null,null,null,null,null,null,null,null,0,0,null,null,"(i) All other stocks held on ","Opening",17,null,null,null,null,null,null,0,null,null,null,null,null,null,null,null,null,null,null,null,null,null,null,null,null,null,null,null,null,null,0,0]
[null,null,null,null,null,null,null,null,null,null,"ê",null,null,null,null,null,null,null,null,null,null,null,null,null,null,null,null,null,null,null,null,null,null,null,null,null,null,null,null,null,"Benin",18,{"$f":"MOS_Table_3!AP26","v":0},{"$f":"MOS_Table_3!AQ26","v":0},{"$f":"SUM(MOS_Table_3!AR26,MOS_Table_3!AS26,MOS_Table_3!AT26)","v":0},0,{"$f":"MOS_Table_3!AW26","v":0},{"$f":"MOS_Table_3!AX26","v":0},{"$f":"SUM(MOS_Table_3!BB26,MOS_Table_3!BC26,MOS_Table_3!AY26)","v":0},{"$f":"SUM(MOS_Table_3!BE26:BG26)","v":0},{"$f":"MOS_Table_3!BD26","v":0},{"$f":"MOS_Table_3!BJ26","v":0},{"$f":"MOS_Table_3!BH26","v":0},{"$f":"MOS_Table_3!BM26","v":0},{"$f":"SUM(MOS_Table_3!AV26,MOS_Table_3!BP26,MOS_Table_3!BQ26)","v":0},0,null,null,"Benin",18,{"$f":"MOS_Table_4!BH26","v":0},{"$f":"MOS_Table_4!BI26","v":0},{"$f":"MOS_Table_4!BJ26+MOS_Table_4!BK26+MOS_Table_4!BL26","v":0},0,{"$f":"MOS_Table_4!BO26","v":0},{"$f":"MOS_Table_4!BP26","v":0},{"$f":"MOS_Table_4!BT26+MOS_Table_4!BU26+MOS_Table_4!BQ26","v":0},{"$f":"MOS_Table_4!BW26+MOS_Table_4!BX26+MOS_Table_4!BY26","v":0},{"$f":"MOS_Table_4!BV26","v":0},{"$f":"MOS_Table_4!CB26","v":0},{"$f":"MOS_Table_4!BZ26","v":0},{"$f":"MOS_Table_4!CE26","v":0},{"$f":"MOS_Table_4!BN26+MOS_Table_4!CH26+MOS_Table_4!CI26","v":0},0,null,null,null,null,null,null,null,null,null,null,null,null,null,null,null,null,"Gross deliveries to the petrochemical industry8",18,null,null,null,null,null,null,null,null,null,null,null,null,null,null,null,null,null,null,null,null,null,null,null,null,null,{"$f":"SUM(CO29:CU29,CX29:CZ29,DC29,DF29,DI29,DL29:DM29)","v":0},null,null,"Benin",18,null,null,null,null,null,{"$f":"SUM(DS29:DW29)","v":0},null,null,null,null,null,null,null,null,null,null,null,null,null,null,null,null,null,null,null,null,null,null,0,0,null,null,"Benin",18,null,null,null,null,null,0,null,null,null,null,null,null,null,null,null,null,null,null,null,null,null,null,null,null,null,null,null,null,0,0,null,null,"national territory","Closing",18,null,null,null,null,null,null,0,null,null,null,null,null,null,null,null,null,null,null,null,null,null,null,null,null,null,null,null,null,null,0,0]
[null,null,null,null,null,null,null,null,null,null," ",null,null,null,null,null,null,null,null,null,null,null,null,null,null,null,null,null,null,null,null,null,null,null,null,null,null,null,null,null,"Bolivia",19,{"$f":"MOS_Table_3!AP27","v":0},{"$f":"MOS_Table_3!AQ27","v":0},{"$f":"SUM(MOS_Table_3!AR27,MOS_Table_3!AS27,MOS_Table_3!AT27)","v":0},0,{"$f":"MOS_Table_3!AW27","v":0},{"$f":"MOS_Table_3!AX27","v":0},{"$f":"SUM(MOS_Table_3!BB27,MOS_Table_3!BC27,MOS_Table_3!AY27)","v":0},{"$f":"SUM(MOS_Table_3!BE27:BG27)","v":0},{"$f":"MOS_Table_3!BD27","v":0},{"$f":"MOS_Table_3!BJ27","v":0},{"$f":"MOS_Table_3!BH27","v":0},{"$f":"MOS_Table_3!BM27","v":0},{"$f":"SUM(MOS_Table_3!AV27,MOS_Table_3!BP27,MOS_Table_3!BQ27)","v":0},0,null,null,"Bolivia",19,{"$f":"MOS_Table_4!BH27","v":0},{"$f":"MOS_Table_4!BI27","v":0},{"$f":"MOS_Table_4!BJ27+MOS_Table_4!BK27+MOS_Table_4!BL27","v":0},0,{"$f":"MOS_Table_4!BO27","v":0},{"$f":"MOS_Table_4!BP27","v":0},{"$f":"MOS_Table_4!BT27+MOS_Table_4!BU27+MOS_Table_4!BQ27","v":0},{"$f":"MOS_Table_4!BW27+MOS_Table_4!BX27+MOS_Table_4!BY27","v":0},{"$f":"MOS_Table_4!BV27","v":0},{"$f":"MOS_Table_4!CB27","v":0},{"$f":"MOS_Table_4!BZ27","v":0},{"$f":"MOS_Table_4!CE27","v":0},{"$f":"MOS_Table_4!BN27+MOS_Table_4!CH27+MOS_Table_4!CI27","v":0},0,null,null,null,null,null,null,null,null,null,null,null,null,null,null,null,null,"Backflows to refineries9",19,null,null,null,null,null,null,null,null,null,null,null,null,null,null,null,null,null,null,null,null,null,null,null,null,null,{"$f":"SUM(CQ30:CU30,CX30:CZ30,DC30,DF30,DI30,DL30:DM30)","v":0},null,null,"Bolivia",19,null,null,null,null,null,{"$f":"SUM(DS30:DW30)","v":0},null,null,null,null,null,null,null,null,null,null,null,null,null,null,null,null,null,null,null,null,null,null,0,0,null,null,"Bolivia",19,null,null,null,null,null,0,null,null,null,null,null,null,null,null,null,null,null,null,null,null,null,null,null,null,null,null,null,null,0,0,null,null,"(j) Stocks held abroad under ","Opening",19,null,null,null,null,null,null,0,null,null,null,null,null,null,null,null,null,null,null,null,null,null,null,null,null,null,null,null,null,null,0,0]
[null,null,null,null,null,null,null,null,null,null,"ê",null,null,null,null,null,null,null,null,null,null,null,null,null,null,null,null,null,null,null,null,null,null,null,null,null,null,null,null,null,"Bosnia and Herzegovina",20,{"$f":"MOS_Table_3!AP28","v":0},{"$f":"MOS_Table_3!AQ28","v":0},{"$f":"SUM(MOS_Table_3!AR28,MOS_Table_3!AS28,MOS_Table_3!AT28)","v":0},0,{"$f":"MOS_Table_3!AW28","v":0},{"$f":"MOS_Table_3!AX28","v":0},{"$f":"SUM(MOS_Table_3!BB28,MOS_Table_3!BC28,MOS_Table_3!AY28)","v":0},{"$f":"SUM(MOS_Table_3!BE28:BG28)","v":0},{"$f":"MOS_Table_3!BD28","v":0},{"$f":"MOS_Table_3!BJ28","v":0},{"$f":"MOS_Table_3!BH28","v":0},{"$f":"MOS_Table_3!BM28","v":0},{"$f":"SUM(MOS_Table_3!AV28,MOS_Table_3!BP28,MOS_Table_3!BQ28)","v":0},0,null,null,"Bosnia and Herzegovina",20,{"$f":"MOS_Table_4!BH28","v":0},{"$f":"MOS_Table_4!BI28","v":0},{"$f":"MOS_Table_4!BJ28+MOS_Table_4!BK28+MOS_Table_4!BL28","v":0},0,{"$f":"MOS_Table_4!BO28","v":0},{"$f":"MOS_Table_4!BP28","v":0},{"$f":"MOS_Table_4!BT28+MOS_Table_4!BU28+MOS_Table_4!BQ28","v":0},{"$f":"MOS_Table_4!BW28+MOS_Table_4!BX28+MOS_Table_4!BY28","v":0},{"$f":"MOS_Table_4!BV28","v":0},{"$f":"MOS_Table_4!CB28","v":0},{"$f":"MOS_Table_4!BZ28","v":0},{"$f":"MOS_Table_4!CE28","v":0},{"$f":"MOS_Table_4!BN28+MOS_Table_4!CH28+MOS_Table_4!CI28","v":0},0,null,null,null,null,null,null,null,null,null,null,null,null,null,null,null,null,"Net deliveries of Total products",20,null,null,null,null,null,null,null,null,null,null,null,null,null,null,null,null,null,null,null,null,null,null,null,null,null,{"$f":"DN24-DN30","v":0},null,null,"Bosnia and Herzegovina",20,null,null,null,null,null,0,null,null,null,null,null,null,null,null,null,null,null,null,null,null,null,null,null,null,null,null,null,null,0,0,null,null,"Bosnia and Herzegovina",20,null,null,null,null,null,0,null,null,null,null,null,null,null,null,null,null,null,null,null,null,null,null,null,null,null,null,null,null,0,0,null,null,"official agreement (o+p+q)*","Closing",20,null,null,null,null,null,null,0,null,null,null,null,null,null,null,null,null,null,null,null,null,null,null,null,null,null,null,null,null,null,{"$f":"SUM(GQ31:GT31,GW31:GY31,HB31,HE31,HH31,HK31:HL31)","v":0},0]
[null,null,null,null,null,null,null,null,null,null," ",null,null,null,null,null,null,null,null,null,null,null,null,null,null,null,null,null,null,null,null,null,null,null,null,null,null,null,null,null,"Brazil",21,{"$f":"MOS_Table_3!AP29","v":0},{"$f":"MOS_Table_3!AQ29","v":0},{"$f":"SUM(MOS_Table_3!AR29,MOS_Table_3!AS29,MOS_Table_3!AT29)","v":0},0,{"$f":"MOS_Table_3!AW29","v":0},{"$f":"MOS_Table_3!AX29","v":0},{"$f":"SUM(MOS_Table_3!BB29,MOS_Table_3!BC29,MOS_Table_3!AY29)","v":0},{"$f":"SUM(MOS_Table_3!BE29:BG29)","v":0},{"$f":"MOS_Table_3!BD29","v":0},{"$f":"MOS_Table_3!BJ29","v":0},{"$f":"MOS_Table_3!BH29","v":0},{"$f":"MOS_Table_3!BM29","v":0},{"$f":"SUM(MOS_Table_3!AV29,MOS_Table_3!BP29,MOS_Table_3!BQ29)","v":0},0,null,null,"Brazil",21,{"$f":"MOS_Table_4!BH29","v":0},{"$f":"MOS_Table_4!BI29","v":0},{"$f":"MOS_Table_4!BJ29+MOS_Table_4!BK29+MOS_Table_4!BL29","v":0},0,{"$f":"MOS_Table_4!BO29","v":0},{"$f":"MOS_Table_4!BP29","v":0},{"$f":"MOS_Table_4!BT29+MOS_Table_4!BU29+MOS_Table_4!BQ29","v":0},{"$f":"MOS_Table_4!BW29+MOS_Table_4!BX29+MOS_Table_4!BY29","v":0},{"$f":"MOS_Table_4!BV29","v":0},{"$f":"MOS_Table_4!CB29","v":0},{"$f":"MOS_Table_4!BZ29","v":0},{"$f":"MOS_Table_4!CE29","v":0},{"$f":"MOS_Table_4!BN29+MOS_Table_4!CH29+MOS_Table_4!CI29","v":0},0,null,null,null,null,null,null,null,null,null,null,null,null,null,null,null,null,null,null,null,null,null,null,null,null,null,null,null,null,null,null,null,null,null,null,null,null,null,null,null,null,null,null,null,null,null,null,"Brazil",21,null,null,null,null,null,0,null,null,null,null,null,null,null,null,null,null,null,null,null,null,null,null,null,null,null,null,null,null,0,0,null,null,"Brazil",21,null,null,null,null,null,0,null,null,null,null,null,null,null,null,null,null,null,null,null,null,null,null,null,null,null,null,null,null,0,0,null,null,"(k) Stocks held abroad designated definitely","Opening",21,null,null,null,null,null,null,0,null,null,null,null,null,null,null,null,null,null,null,null,null,null,null,null,null,null,null,null,null,null,{"$f":"SUM(GQ32:GT32,GW32:GY32,HB32,HE32,HH32,HK32:HL32)","v":0},0]
[null,null,null,null,null,null,null,null,null,null,"ê",null,null,null,null,null,null,null,null,null,null,null,null,null,null,null,null,null,null,null,null,null,null,null,null,null,null,null,null,null,"British Virgin Islands",22,{"$f":"MOS_Table_3!AP30","v":0},{"$f":"MOS_Table_3!AQ30","v":0},{"$f":"SUM(MOS_Table_3!AR30,MOS_Table_3!AS30,MOS_Table_3!AT30)","v":0},0,{"$f":"MOS_Table_3!AW30","v":0},{"$f":"MOS_Table_3!AX30","v":0},{"$f":"SUM(MOS_Table_3!BB30,MOS_Table_3!BC30,MOS_Table_3!AY30)","v":0},{"$f":"SUM(MOS_Table_3!BE30:BG30)","v":0},{"$f":"MOS_Table_3!BD30","v":0},{"$f":"MOS_Table_3!BJ30","v":0},{"$f":"MOS_Table_3!BH30","v":0},{"$f":"MOS_Table_3!BM30","v":0},{"$f":"SUM(MOS_Table_3!AV30,MOS_Table_3!BP30,MOS_Table_3!BQ30)","v":0},0,null,null,"British Virgin Islands",22,{"$f":"MOS_Table_4!BH30","v":0},{"$f":"MOS_Table_4!BI30","v":0},{"$f":"MOS_Table_4!BJ30+MOS_Table_4!BK30+MOS_Table_4!BL30","v":0},0,{"$f":"MOS_Table_4!BO30","v":0},{"$f":"MOS_Table_4!BP30","v":0},{"$f":"MOS_Table_4!BT30+MOS_Table_4!BU30+MOS_Table_4!BQ30","v":0},{"$f":"MOS_Table_4!BW30+MOS_Table_4!BX30+MOS_Table_4!BY30","v":0},{"$f":"MOS_Table_4!BV30","v":0},{"$f":"MOS_Table_4!CB30","v":0},{"$f":"MOS_Table_4!BZ30","v":0},{"$f":"MOS_Table_4!CE30","v":0},{"$f":"MOS_Table_4!BN30+MOS_Table_4!CH30+MOS_Table_4!CI30","v":0},0,null,null,null,null,null,null,null,null,null,null,null,null,null,null,null,null,null,null,null,null,null,null,null,null,null,null,null,null,null,null,null,null,null,null,null,null,null,null,null,null,null,null,null,null,null,null,"British Virgin Islands",22,null,null,null,null,null,0,null,null,null,null,null,null,null,null,null,null,null,null,null,null,null,null,null,null,null,null,null,null,0,0,null,null,"British Virgin Islands",22,null,null,null,null,null,0,null,null,null,null,null,null,null,null,null,null,null,null,null,null,null,null,null,null,null,null,null,null,0,0,null,null,"for import into your country","Closing",22,null,null,null,null,null,null,0,null,null,null,null,null,null,null,null,null,null,null,null,null,null,null,null,null,null,null,null,null,null,0,0]
[null,null,null,null,null,null,null,null,null,null," ",null,null,null,null,null,null,null,null,null,null,null,null,null,null,null,null,null,null,null,null,null,null,null,null,null,null,null,null,null,"Brunei Darussalam",23,{"$f":"MOS_Table_3!AP31","v":0},{"$f":"MOS_Table_3!AQ31","v":0},{"$f":"SUM(MOS_Table_3!AR31,MOS_Table_3!AS31,MOS_Table_3!AT31)","v":0},0,{"$f":"MOS_Table_3!AW31","v":0},{"$f":"MOS_Table_3!AX31","v":0},{"$f":"SUM(MOS_Table_3!BB31,MOS_Table_3!BC31,MOS_Table_3!AY31)","v":0},{"$f":"SUM(MOS_Table_3!BE31:BG31)","v":0},{"$f":"MOS_Table_3!BD31","v":0},{"$f":"MOS_Table_3!BJ31","v":0},{"$f":"MOS_Table_3!BH31","v":0},{"$f":"MOS_Table_3!BM31","v":0},{"$f":"SUM(MOS_Table_3!AV31,MOS_Table_3!BP31,MOS_Table_3!BQ31)","v":0},0,null,null,"Brunei Darussalam",23,{"$f":"MOS_Table_4!BH31","v":0},{"$f":"MOS_Table_4!BI31","v":0},{"$f":"MOS_Table_4!BJ31+MOS_Table_4!BK31+MOS_Table_4!BL31","v":0},0,{"$f":"MOS_Table_4!BO31","v":0},{"$f":"MOS_Table_4!BP31","v":0},{"$f":"MOS_Table_4!BT31+MOS_Table_4!BU31+MOS_Table_4!BQ31","v":0},{"$f":"MOS_Table_4!BW31+MOS_Table_4!BX31+MOS_Table_4!BY31","v":0},{"$f":"MOS_Table_4!BV31","v":0},{"$f":"MOS_Table_4!CB31","v":0},{"$f":"MOS_Table_4!BZ31","v":0},{"$f":"MOS_Table_4!CE31","v":0},{"$f":"MOS_Table_4!BN31+MOS_Table_4!CH31+MOS_Table_4!CI31","v":0},0,null,null,null,null,null,null,null,null,null,null,null,null,null,null,null,null,null,null,null,null,null,null,null,null,null,null,null,null,null,null,null,null,null,null,null,null,null,null,null,null,null,null,null,null,null,null,"Brunei Darussalam",23,null,null,null,null,null,0,null,null,null,null,null,null,null,null,null,null,null,null,null,null,null,null,null,null,null,null,null,null,0,0,null,null,"Brunei Darussalam",23,null,null,null,null,null,0,null,null,null,null,null,null,null,null,null,null,null,null,null,null,null,null,null,null,null,null,null,null,0,0,null,null,"(l) Total","Opening",23,{"$f":"GJ12-GJ14-GJ16+GJ30+GJ32","v":0},0,0,{"$f":"GM12-GM14-GM16+GM30+GM32","v":0},{"$f":"GN12-GN14-GN16+GN30+GN32","v":0},0,0,0,{"$f":"GR12-GR14-GR16+GR30+GR32","v":0},{"$f":"GS12-GS14-GS16+GS30+GS32","v":0},0,0,0,0,0,0,0,0,0,0,0,0,0,0,0,0,0,0,0,0,0]
[null,null,null,null,null,null,null,null,null,null,"ê",null,null,null,null,null,null,null,null,null,null,null,null,null,null,null,null,null,null,null,null,null,null,null,null,null,null,null,null,null,"Bulgaria",24,{"$f":"MOS_Table_3!AP32","v":0},{"$f":"MOS_Table_3!AQ32","v":0},{"$f":"SUM(MOS_Table_3!AR32,MOS_Table_3!AS32,MOS_Table_3!AT32)","v":0},0,{"$f":"MOS_Table_3!AW32","v":0},{"$f":"MOS_Table_3!AX32","v":0},{"$f":"SUM(MOS_Table_3!BB32,MOS_Table_3!BC32,MOS_Table_3!AY32)","v":0},{"$f":"SUM(MOS_Table_3!BE32:BG32)","v":0},{"$f":"MOS_Table_3!BD32","v":0},{"$f":"MOS_Table_3!BJ32","v":0},{"$f":"MOS_Table_3!BH32","v":0},{"$f":"MOS_Table_3!BM32","v":0},{"$f":"SUM(MOS_Table_3!AV32,MOS_Table_3!BP32,MOS_Table_3!BQ32)","v":0},0,null,null,"Bulgaria",24,{"$f":"MOS_Table_4!BH32","v":0},{"$f":"MOS_Table_4!BI32","v":0},{"$f":"MOS_Table_4!BJ32+MOS_Table_4!BK32+MOS_Table_4!BL32","v":0},0,{"$f":"MOS_Table_4!BO32","v":0},{"$f":"MOS_Table_4!BP32","v":0},{"$f":"MOS_Table_4!BT32+MOS_Table_4!BU32+MOS_Table_4!BQ32","v":0},{"$f":"MOS_Table_4!BW32+MOS_Table_4!BX32+MOS_Table_4!BY32","v":0},{"$f":"MOS_Table_4!BV32","v":0},{"$f":"MOS_Table_4!CB32","v":0},{"$f":"MOS_Table_4!BZ32","v":0},{"$f":"MOS_Table_4!CE32","v":0},{"$f":"MOS_Table_4!BN32+MOS_Table_4!CH32+MOS_Table_4!CI32","v":0},0,null,null,null,null,null,null,null,null,null,null,null,null,null,null,null,null,null,null,null,null,null,null,null,null,null,null,null,null,null,null,null,null,null,null,null,null,null,null,null,null,null,null,null,null,null,null,"Bulgaria",24,null,null,null,null,null,0,null,null,null,null,null,null,null,null,null,null,null,null,null,null,null,null,null,null,null,null,null,null,0,0,null,null,"Bulgaria",24,null,null,null,null,null,0,null,null,null,null,null,null,null,null,null,null,null,null,null,null,null,null,null,null,null,null,null,null,0,0,null,null,"stocks (a-b-c+j+k)","Closing",24,{"$f":"GJ13-GJ15-GJ17+GJ31+GJ33","v":0},0,0,{"$f":"GM13-GM15-GM17+GM31+GM33","v":0},{"$f":"GN13-GN15-GN17+GN31+GN33","v":0},0,0,0,{"$f":"GR13-GR15-GR17+GR31+GR33","v":0},0,0,0,0,0,0,0,0,0,0,0,0,0,0,0,0,0,0,0,0,0,0]
[null,null,null,null,null,null,null,null,null,null," ",null,null,null,null,null,null,null,null,null,null,null,null,null,null,null,null,null,null,null,null,null,null,null,null,null,null,null,null,null,"Cambodia",25,{"$f":"MOS_Table_3!AP33","v":0},{"$f":"MOS_Table_3!AQ33","v":0},{"$f":"SUM(MOS_Table_3!AR33,MOS_Table_3!AS33,MOS_Table_3!AT33)","v":0},0,{"$f":"MOS_Table_3!AW33","v":0},{"$f":"MOS_Table_3!AX33","v":0},{"$f":"SUM(MOS_Table_3!BB33,MOS_Table_3!BC33,MOS_Table_3!AY33)","v":0},{"$f":"SUM(MOS_Table_3!BE33:BG33)","v":0},{"$f":"MOS_Table_3!BD33","v":0},{"$f":"MOS_Table_3!BJ33","v":0},{"$f":"MOS_Table_3!BH33","v":0},{"$f":"MOS_Table_3!BM33","v":0},{"$f":"SUM(MOS_Table_3!AV33,MOS_Table_3!BP33,MOS_Table_3!BQ33)","v":0},0,null,null,"Cambodia",25,{"$f":"MOS_Table_4!BH33","v":0},{"$f":"MOS_Table_4!BI33","v":0},{"$f":"MOS_Table_4!BJ33+MOS_Table_4!BK33+MOS_Table_4!BL33","v":0},0,{"$f":"MOS_Table_4!BO33","v":0},{"$f":"MOS_Table_4!BP33","v":0},{"$f":"MOS_Table_4!BT33+MOS_Table_4!BU33+MOS_Table_4!BQ33","v":0},{"$f":"MOS_Table_4!BW33+MOS_Table_4!BX33+MOS_Table_4!BY33","v":0},{"$f":"MOS_Table_4!BV33","v":0},{"$f":"MOS_Table_4!CB33","v":0},{"$f":"MOS_Table_4!BZ33","v":0},{"$f":"MOS_Table_4!CE33","v":0},{"$f":"MOS_Table_4!BN33+MOS_Table_4!CH33+MOS_Table_4!CI33","v":0},0,null,null,null,null,null,null,null,null,null,null,null,null,null,null,null,null,null,null,null,null,null,null,null,null,null,null,null,null,null,null,null,null,null,null,null,null,null,null,null,null,null,null,null,null,null,null,"Cambodia",25,null,null,null,null,null,0,null,null,null,null,null,null,null,null,null,null,null,null,null,null,null,null,null,null,null,null,null,null,0,0,null,null,"Cambodia",25,null,null,null,null,null,0,null,null,null,null,null,null,null,null,null,null,null,null,null,null,null,null,null,null,null,null,null,null,0,0,null,null,"(m) Other stocks in","Opening",25,null,null,null,null,null,null,{"$f":"SUM(GJ36:GM36,GO36)","v":0},null,null,null,null,null,null,null,null,null,null,null,null,null,null,null,null,null,null,null,null,null,null,0,0]
[null,null,null,null,null,null,null,null,null,null,"ê",null,null,null,null,null,null,null,null,null,null,null,null,null,null,null,null,null,null,null,null,null,null,null,null,null,null,null,null,null,"Cameroon",26,{"$f":"MOS_Table_3!AP34","v":0},{"$f":"MOS_Table_3!AQ34","v":0},{"$f":"SUM(MOS_Table_3!AR34,MOS_Table_3!AS34,MOS_Table_3!AT34)","v":0},0,{"$f":"MOS_Table_3!AW34","v":0},{"$f":"MOS_Table_3!AX34","v":0},{"$f":"SUM(MOS_Table_3!BB34,MOS_Table_3!BC34,MOS_Table_3!AY34)","v":0},{"$f":"SUM(MOS_Table_3!BE34:BG34)","v":0},{"$f":"MOS_Table_3!BD34","v":0},{"$f":"MOS_Table_3!BJ34","v":0},{"$f":"MOS_Table_3!BH34","v":0},{"$f":"MOS_Table_3!BM34","v":0},{"$f":"SUM(MOS_Table_3!AV34,MOS_Table_3!BP34,MOS_Table_3!BQ34)","v":0},0,null,null,"Cameroon",26,{"$f":"MOS_Table_4!BH34","v":0},{"$f":"MOS_Table_4!BI34","v":0},{"$f":"MOS_Table_4!BJ34+MOS_Table_4!BK34+MOS_Table_4!BL34","v":0},0,{"$f":"MOS_Table_4!BO34","v":0},{"$f":"MOS_Table_4!BP34","v":0},{"$f":"MOS_Table_4!BT34+MOS_Table_4!BU34+MOS_Table_4!BQ34","v":0},{"$f":"MOS_Table_4!BW34+MOS_Table_4!BX34+MOS_Table_4!BY34","v":0},{"$f":"MOS_Table_4!BV34","v":0},{"$f":"MOS_Table_4!CB34","v":0},{"$f":"MOS_Table_4!BZ34","v":0},{"$f":"MOS_Table_4!CE34","v":0},{"$f":"MOS_Table_4!BN34+MOS_Table_4!CH34+MOS_Table_4!CI34","v":0},0,null,null,null,null,null,null,null,null,null,null,null,null,null,null,null,null,null,null,null,null,null,null,null,null,null,null,null,null,null,null,null,null,null,null,null,null,null,null,null,null,null,null,null,null,null,null,"Cameroon",26,null,null,null,null,null,0,null,null,null,null,null,null,null,null,null,null,null,null,null,null,null,null,null,null,null,null,null,null,0,0,null,null,"Cameroon",26,null,null,null,null,null,0,null,null,null,null,null,null,null,null,null,null,null,null,null,null,null,null,null,null,null,null,null,null,0,0,null,null,"bonded areas","Closing",26,null,null,null,null,null,null,{"$f":"SUM(GJ37:GM37,GO37)","v":0},null,null,null,null,null,null,null,null,null,null,null,null,null,null,null,null,null,null,null,null,null,null,0,0]
[null,null,null,null,null,null,null,null,null,null," ",null,null,null,null,null,null,null,null,null,null,null,null,null,null,null,null,null,null,null,null,null,null,null,null,null,null,null,null,null,"Canada",27,{"$f":"MOS_Table_3!AP35","v":0},{"$f":"MOS_Table_3!AQ35","v":0},{"$f":"SUM(MOS_Table_3!AR35,MOS_Table_3!AS35,MOS_Table_3!AT35)","v":0},0,{"$f":"MOS_Table_3!AW35","v":0},{"$f":"MOS_Table_3!AX35","v":0},{"$f":"SUM(MOS_Table_3!BB35,MOS_Table_3!BC35,MOS_Table_3!AY35)","v":0},{"$f":"SUM(MOS_Table_3!BE35:BG35)","v":0},{"$f":"MOS_Table_3!BD35","v":0},{"$f":"MOS_Table_3!BJ35","v":0},{"$f":"MOS_Table_3!BH35","v":0},{"$f":"MOS_Table_3!BM35","v":0},{"$f":"SUM(MOS_Table_3!AV35,MOS_Table_3!BP35,MOS_Table_3!BQ35)","v":0},0,null,null,"Canada",27,{"$f":"MOS_Table_4!BH35","v":0},{"$f":"MOS_Table_4!BI35","v":0},{"$f":"MOS_Table_4!BJ35+MOS_Table_4!BK35+MOS_Table_4!BL35","v":0},0,{"$f":"MOS_Table_4!BO35","v":0},{"$f":"MOS_Table_4!BP35","v":0},{"$f":"MOS_Table_4!BT35+MOS_Table_4!BU35+MOS_Table_4!BQ35","v":0},{"$f":"MOS_Table_4!BW35+MOS_Table_4!BX35+MOS_Table_4!BY35","v":0},{"$f":"MOS_Table_4!BV35","v":0},{"$f":"MOS_Table_4!CB35","v":0},{"$f":"MOS_Table_4!BZ35","v":0},{"$f":"MOS_Table_4!CE35","v":0},{"$f":"MOS_Table_4!BN35+MOS_Table_4!CH35+MOS_Table_4!CI35","v":0},0,null,null,null,null,null,null,null,null,null,null,null,null,null,null,null,null,null,null,null,null,null,null,null,null,null,null,null,null,null,null,null,null,null,null,null,null,null,null,null,null,null,null,null,null,null,null,"Canada",27,null,null,null,null,null,0,null,null,null,null,null,null,null,null,null,null,null,null,null,null,null,null,null,null,null,null,null,null,0,0,null,null,"Canada",27,null,null,null,null,null,0,null,null,null,null,null,null,null,null,null,null,null,null,null,null,null,null,null,null,null,null,null,null,0,0,null,null,"(n) Pipeline","Opening",27,null,null,null,null,null,null,0,null,null,null,null,null,null,null,null,null,null,null,null,null,null,null,null,null,null,null,null,null,null,0,0]
[null,null,null,null,null,null,null,null,null,null,"ê",null,null,null,null,null,null,null,null,null,null,null,null,null,null,null,null,null,null,null,null,null,null,null,null,null,null,null,null,null,"Cape Verde / Cabo Verde",28,{"$f":"MOS_Table_3!AP36","v":0},{"$f":"MOS_Table_3!AQ36","v":0},{"$f":"SUM(MOS_Table_3!AR36,MOS_Table_3!AS36,MOS_Table_3!AT36)","v":0},0,{"$f":"MOS_Table_3!AW36","v":0},{"$f":"MOS_Table_3!AX36","v":0},{"$f":"SUM(MOS_Table_3!BB36,MOS_Table_3!BC36,MOS_Table_3!AY36)","v":0},{"$f":"SUM(MOS_Table_3!BE36:BG36)","v":0},{"$f":"MOS_Table_3!BD36","v":0},{"$f":"MOS_Table_3!BJ36","v":0},{"$f":"MOS_Table_3!BH36","v":0},{"$f":"MOS_Table_3!BM36","v":0},{"$f":"SUM(MOS_Table_3!AV36,MOS_Table_3!BP36,MOS_Table_3!BQ36)","v":0},0,null,null,"Cape Verde / Cabo Verde",28,{"$f":"MOS_Table_4!BH36","v":0},{"$f":"MOS_Table_4!BI36","v":0},{"$f":"MOS_Table_4!BJ36+MOS_Table_4!BK36+MOS_Table_4!BL36","v":0},0,{"$f":"MOS_Table_4!BO36","v":0},{"$f":"MOS_Table_4!BP36","v":0},{"$f":"MOS_Table_4!BT36+MOS_Table_4!BU36+MOS_Table_4!BQ36","v":0},{"$f":"MOS_Table_4!BW36+MOS_Table_4!BX36+MOS_Table_4!BY36","v":0},{"$f":"MOS_Table_4!BV36","v":0},{"$f":"MOS_Table_4!CB36","v":0},{"$f":"MOS_Table_4!BZ36","v":0},{"$f":"MOS_Table_4!CE36","v":0},{"$f":"MOS_Table_4!BN36+MOS_Table_4!CH36+MOS_Table_4!CI36","v":0},0,null,null,null,null,null,null,null,null,null,null,null,null,null,null,null,null,null,null,null,null,null,null,null,null,null,null,null,null,null,null,null,null,null,null,null,null,null,null,null,null,null,null,null,null,null,null,"Cape Verde / Cabo Verde",28,null,null,null,null,null,0,null,null,null,null,null,null,null,null,null,null,null,null,null,null,null,null,null,null,null,null,null,null,0,0,null,null,"Cape Verde / Cabo Verde",28,null,null,null,null,null,0,null,null,null,null,null,null,null,null,null,null,null,null,null,null,null,null,null,null,null,null,null,null,0,0,null,null,"fill","Closing",28,null,null,null,null,null,null,0,null,null,null,null,null,null,null,null,null,null,null,null,null,null,null,null,null,null,null,null,null,null,0,0]
[null,null,null,null,null,null,null,null,null,null," ",null,null,null,null,null,null,null,null,null,null,null,null,null,null,null,null,null,null,null,null,null,null,null,null,null,null,null,null,null,"Chile",29,{"$f":"MOS_Table_3!AP37","v":0},{"$f":"MOS_Table_3!AQ37","v":0},{"$f":"SUM(MOS_Table_3!AR37,MOS_Table_3!AS37,MOS_Table_3!AT37)","v":0},0,{"$f":"MOS_Table_3!AW37","v":0},{"$f":"MOS_Table_3!AX37","v":0},{"$f":"SUM(MOS_Table_3!BB37,MOS_Table_3!BC37,MOS_Table_3!AY37)","v":0},{"$f":"SUM(MOS_Table_3!BE37:BG37)","v":0},{"$f":"MOS_Table_3!BD37","v":0},{"$f":"MOS_Table_3!BJ37","v":0},{"$f":"MOS_Table_3!BH37","v":0},{"$f":"MOS_Table_3!BM37","v":0},{"$f":"SUM(MOS_Table_3!AV37,MOS_Table_3!BP37,MOS_Table_3!BQ37)","v":0},0,null,null,"Chile",29,{"$f":"MOS_Table_4!BH37","v":0},{"$f":"MOS_Table_4!BI37","v":0},{"$f":"MOS_Table_4!BJ37+MOS_Table_4!BK37+MOS_Table_4!BL37","v":0},0,{"$f":"MOS_Table_4!BO37","v":0},{"$f":"MOS_Table_4!BP37","v":0},{"$f":"MOS_Table_4!BT37+MOS_Table_4!BU37+MOS_Table_4!BQ37","v":0},{"$f":"MOS_Table_4!BW37+MOS_Table_4!BX37+MOS_Table_4!BY37","v":0},{"$f":"MOS_Table_4!BV37","v":0},{"$f":"MOS_Table_4!CB37","v":0},{"$f":"MOS_Table_4!BZ37","v":0},{"$f":"MOS_Table_4!CE37","v":0},{"$f":"MOS_Table_4!BN37+MOS_Table_4!CH37+MOS_Table_4!CI37","v":0},0,null,null,null,null,null,null,null,null,null,null,null,null,null,null,null,null,null,null,null,null,null,null,null,null,null,null,null,null,null,null,null,null,null,null,null,null,null,null,null,null,null,null,null,null,null,null,"Chile",29,null,null,null,null,null,0,null,null,null,null,null,null,null,null,null,null,null,null,null,null,null,null,null,null,null,null,null,null,0,0,null,null,"Chile",29,null,null,null,null,null,0,null,null,null,null,null,null,null,null,null,null,null,null,null,null,null,null,null,null,null,null,null,null,0,0,null,null,"(o) Government stocks held abroad","Opening",29,null,null,null,null,null,null,0,null,null,null,null,null,null,null,null,null,null,null,null,null,null,null,null,null,null,null,null,null,null,0,0]
[null,null,null,null,null,null,null,null,null,null,"ê",null,null,null,null,null,null,null,null,null,null,null,null,null,null,null,null,null,null,null,null,null,null,null,null,null,null,null,null,null,"China, People's Republic of",30,{"$f":"MOS_Table_3!AP38","v":0},{"$f":"MOS_Table_3!AQ38","v":0},{"$f":"SUM(MOS_Table_3!AR38,MOS_Table_3!AS38,MOS_Table_3!AT38)","v":0},0,{"$f":"MOS_Table_3!AW38","v":0},{"$f":"MOS_Table_3!AX38","v":0},{"$f":"SUM(MOS_Table_3!BB38,MOS_Table_3!BC38,MOS_Table_3!AY38)","v":0},{"$f":"SUM(MOS_Table_3!BE38:BG38)","v":0},{"$f":"MOS_Table_3!BD38","v":0},{"$f":"MOS_Table_3!BJ38","v":0},{"$f":"MOS_Table_3!BH38","v":0},{"$f":"MOS_Table_3!BM38","v":0},{"$f":"SUM(MOS_Table_3!AV38,MOS_Table_3!BP38,MOS_Table_3!BQ38)","v":0},0,null,null,"China, People's Republic of",30,{"$f":"MOS_Table_4!BH38","v":0},{"$f":"MOS_Table_4!BI38","v":0},{"$f":"MOS_Table_4!BJ38+MOS_Table_4!BK38+MOS_Table_4!BL38","v":0},0,{"$f":"MOS_Table_4!BO38","v":0},{"$f":"MOS_Table_4!BP38","v":0},{"$f":"MOS_Table_4!BT38+MOS_Table_4!BU38+MOS_Table_4!BQ38","v":0},{"$f":"MOS_Table_4!BW38+MOS_Table_4!BX38+MOS_Table_4!BY38","v":0},{"$f":"MOS_Table_4!BV38","v":0},{"$f":"MOS_Table_4!CB38","v":0},{"$f":"MOS_Table_4!BZ38","v":0},{"$f":"MOS_Table_4!CE38","v":0},{"$f":"MOS_Table_4!BN38+MOS_Table_4!CH38+MOS_Table_4!CI38","v":0},0,null,null,null,null,null,null,null,null,null,null,null,null,null,null,null,null,null,null,null,null,null,null,null,null,null,null,null,null,null,null,null,null,null,null,null,null,null,null,null,null,null,null,null,null,null,null,"China, People's Republic of",30,null,null,null,null,null,{"$f":"SUM(DS41:DW41)","v":0},null,null,null,null,null,null,null,null,null,null,null,null,null,null,null,null,null,null,null,null,null,null,0,0,null,null,"China, People's Republic of",30,null,null,null,null,null,0,null,null,null,null,null,null,null,null,null,null,null,null,null,null,null,null,null,null,null,null,null,null,0,0,null,null,"under official agreement*","Closing",30,null,null,null,null,null,null,0,null,null,null,null,null,null,null,null,null,null,null,null,null,null,null,null,null,null,null,null,null,null,0,0]
[null,null,null,null,null,null,null,null,null,null," ",null,null,null,null,null,null,null,null,null,null,null,null,null,null,null,null,null,null,null,null,null,null,null,null,null,null,null,null,null,"Colombia",31,{"$f":"MOS_Table_3!AP39","v":0},{"$f":"MOS_Table_3!AQ39","v":0},{"$f":"SUM(MOS_Table_3!AR39,MOS_Table_3!AS39,MOS_Table_3!AT39)","v":0},0,{"$f":"MOS_Table_3!AW39","v":0},{"$f":"MOS_Table_3!AX39","v":0},{"$f":"SUM(MOS_Table_3!BB39,MOS_Table_3!BC39,MOS_Table_3!AY39)","v":0},{"$f":"SUM(MOS_Table_3!BE39:BG39)","v":0},{"$f":"MOS_Table_3!BD39","v":0},{"$f":"MOS_Table_3!BJ39","v":0},{"$f":"MOS_Table_3!BH39","v":0},{"$f":"MOS_Table_3!BM39","v":0},{"$f":"SUM(MOS_Table_3!AV39,MOS_Table_3!BP39,MOS_Table_3!BQ39)","v":0},0,null,null,"Colombia",31,{"$f":"MOS_Table_4!BH39","v":0},{"$f":"MOS_Table_4!BI39","v":0},{"$f":"MOS_Table_4!BJ39+MOS_Table_4!BK39+MOS_Table_4!BL39","v":0},0,{"$f":"MOS_Table_4!BO39","v":0},{"$f":"MOS_Table_4!BP39","v":0},{"$f":"MOS_Table_4!BT39+MOS_Table_4!BU39+MOS_Table_4!BQ39","v":0},{"$f":"MOS_Table_4!BW39+MOS_Table_4!BX39+MOS_Table_4!BY39","v":0},{"$f":"MOS_Table_4!BV39","v":0},{"$f":"MOS_Table_4!CB39","v":0},{"$f":"MOS_Table_4!BZ39","v":0},{"$f":"MOS_Table_4!CE39","v":0},{"$f":"MOS_Table_4!BN39+MOS_Table_4!CH39+MOS_Table_4!CI39","v":0},0,null,null,null,null,null,null,null,null,null,null,null,null,null,null,null,null,null,null,null,null,null,null,null,null,null,null,null,null,null,null,null,null,null,null,null,null,null,null,null,null,null,null,null,null,null,null,"Colombia",31,null,null,null,null,null,0,null,null,null,null,null,null,null,null,null,null,null,null,null,null,null,null,null,null,null,null,null,null,0,0,null,null,"Colombia",31,null,null,null,null,null,0,null,null,null,null,null,null,null,null,null,null,null,null,null,null,null,null,null,null,null,null,null,null,0,0,null,null,"(p) Holding organisation's stocks held abroad","Opening",31,null,null,null,null,null,null,0,null,null,null,null,null,null,null,null,null,null,null,null,null,null,null,null,null,null,null,null,null,null,0,0]
[null,null,null,null,null,null,null,null,null,null,"ê",null,null,null,null,null,null,null,null,null,null,null,null,null,null,null,null,null,null,null,null,null,null,null,null,null,null,null,null,null,"Congo",32,{"$f":"MOS_Table_3!AP40","v":0},{"$f":"MOS_Table_3!AQ40","v":0},{"$f":"SUM(MOS_Table_3!AR40,MOS_Table_3!AS40,MOS_Table_3!AT40)","v":0},0,{"$f":"MOS_Table_3!AW40","v":0},{"$f":"MOS_Table_3!AX40","v":0},{"$f":"SUM(MOS_Table_3!BB40,MOS_Table_3!BC40,MOS_Table_3!AY40)","v":0},{"$f":"SUM(MOS_Table_3!BE40:BG40)","v":0},{"$f":"MOS_Table_3!BD40","v":0},{"$f":"MOS_Table_3!BJ40","v":0},{"$f":"MOS_Table_3!BH40","v":0},{"$f":"MOS_Table_3!BM40","v":0},{"$f":"SUM(MOS_Table_3!AV40,MOS_Table_3!BP40,MOS_Table_3!BQ40)","v":0},0,null,null,"Congo",32,{"$f":"MOS_Table_4!BH40","v":0},{"$f":"MOS_Table_4!BI40","v":0},{"$f":"MOS_Table_4!BJ40+MOS_Table_4!BK40+MOS_Table_4!BL40","v":0},0,{"$f":"MOS_Table_4!BO40","v":0},{"$f":"MOS_Table_4!BP40","v":0},{"$f":"MOS_Table_4!BT40+MOS_Table_4!BU40+MOS_Table_4!BQ40","v":0},{"$f":"MOS_Table_4!BW40+MOS_Table_4!BX40+MOS_Table_4!BY40","v":0},{"$f":"MOS_Table_4!BV40","v":0},{"$f":"MOS_Table_4!CB40","v":0},{"$f":"MOS_Table_4!BZ40","v":0},{"$f":"MOS_Table_4!CE40","v":0},{"$f":"MOS_Table_4!BN40+MOS_Table_4!CH40+MOS_Table_4!CI40","v":0},0,null,null,null,null,null,null,null,null,null,null,null,null,null,null,null,null,null,null,null,null,null,null,null,null,null,null,null,null,null,null,null,null,null,null,null,null,null,null,null,null,null,null,null,null,null,null,"Congo",32,null,null,null,null,null,0,null,null,null,null,null,null,null,null,null,null,null,null,null,null,null,null,null,null,null,null,null,null,0,0,null,null,"Congo",32,null,null,null,null,null,0,null,null,null,null,null,null,null,null,null,null,null,null,null,null,null,null,null,null,null,null,null,null,0,0,null,null,"under official agreement*","Closing",32,null,null,null,null,null,null,0,null,null,null,null,null,null,null,null,null,null,null,null,null,null,null,null,null,null,null,null,null,null,0,0]
[null,null,null,null,null,null,null,null,null,null," ",null,null,null,null,null,null,null,null,null,null,null,null,null,null,null,null,null,null,null,null,null,null,null,null,null,null,null,null,null,"Costa Rica",33,{"$f":"MOS_Table_3!AP41","v":0},{"$f":"MOS_Table_3!AQ41","v":0},{"$f":"SUM(MOS_Table_3!AR41,MOS_Table_3!AS41,MOS_Table_3!AT41)","v":0},0,{"$f":"MOS_Table_3!AW41","v":0},{"$f":"MOS_Table_3!AX41","v":0},{"$f":"SUM(MOS_Table_3!BB41,MOS_Table_3!BC41,MOS_Table_3!AY41)","v":0},{"$f":"SUM(MOS_Table_3!BE41:BG41)","v":0},{"$f":"MOS_Table_3!BD41","v":0},{"$f":"MOS_Table_3!BJ41","v":0},{"$f":"MOS_Table_3!BH41","v":0},{"$f":"MOS_Table_3!BM41","v":0},{"$f":"SUM(MOS_Table_3!AV41,MOS_Table_3!BP41,MOS_Table_3!BQ41)","v":0},0,null,null,"Costa Rica",33,{"$f":"MOS_Table_4!BH41","v":0},{"$f":"MOS_Table_4!BI41","v":0},{"$f":"MOS_Table_4!BJ41+MOS_Table_4!BK41+MOS_Table_4!BL41","v":0},0,{"$f":"MOS_Table_4!BO41","v":0},{"$f":"MOS_Table_4!BP41","v":0},{"$f":"MOS_Table_4!BT41+MOS_Table_4!BU41+MOS_Table_4!BQ41","v":0},{"$f":"MOS_Table_4!BW41+MOS_Table_4!BX41+MOS_Table_4!BY41","v":0},{"$f":"MOS_Table_4!BV41","v":0},{"$f":"MOS_Table_4!CB41","v":0},{"$f":"MOS_Table_4!BZ41","v":0},{"$f":"MOS_Table_4!CE41","v":0},{"$f":"MOS_Table_4!BN41+MOS_Table_4!CH41+MOS_Table_4!CI41","v":0},0,null,null,null,null,null,null,null,null,null,null,null,null,null,null,null,null,null,null,null,null,null,null,null,null,null,null,null,null,null,null,null,null,null,null,null,null,null,null,null,null,null,null,null,null,null,null,"Costa Rica",33,null,null,null,null,null,0,null,null,null,null,null,null,null,null,null,null,null,null,null,null,null,null,null,null,null,null,null,null,0,0,null,null,"Costa Rica",33,null,null,null,null,null,0,null,null,null,null,null,null,null,null,null,null,null,null,null,null,null,null,null,null,null,null,null,null,0,0,null,null,"(q) Other stocks held abroad","Opening",33,null,null,null,null,null,null,0,null,null,null,null,null,null,null,null,null,null,null,null,null,null,null,null,null,null,null,null,null,null,0,0]
[null,null,null,null,null,null,null,null,null,null,"ê",null,null,null,null,null,null,null,null,null,null,null,null,null,null,null,null,null,null,null,null,null,null,null,null,null,null,null,null,null,"Côte d’Ivoire",34,{"$f":"MOS_Table_3!AP42","v":0},{"$f":"MOS_Table_3!AQ42","v":0},{"$f":"SUM(MOS_Table_3!AR42,MOS_Table_3!AS42,MOS_Table_3!AT42)","v":0},0,{"$f":"MOS_Table_3!AW42","v":0},{"$f":"MOS_Table_3!AX42","v":0},{"$f":"SUM(MOS_Table_3!BB42,MOS_Table_3!BC42,MOS_Table_3!AY42)","v":0},{"$f":"SUM(MOS_Table_3!BE42:BG42)","v":0},{"$f":"MOS_Table_3!BD42","v":0},{"$f":"MOS_Table_3!BJ42","v":0},{"$f":"MOS_Table_3!BH42","v":0},{"$f":"MOS_Table_3!BM42","v":0},{"$f":"SUM(MOS_Table_3!AV42,MOS_Table_3!BP42,MOS_Table_3!BQ42)","v":0},0,null,null,"Côte d’Ivoire",34,{"$f":"MOS_Table_4!BH42","v":0},{"$f":"MOS_Table_4!BI42","v":0},{"$f":"MOS_Table_4!BJ42+MOS_Table_4!BK42+MOS_Table_4!BL42","v":0},0,{"$f":"MOS_Table_4!BO42","v":0},{"$f":"MOS_Table_4!BP42","v":0},{"$f":"MOS_Table_4!BT42+MOS_Table_4!BU42+MOS_Table_4!BQ42","v":0},{"$f":"MOS_Table_4!BW42+MOS_Table_4!BX42+MOS_Table_4!BY42","v":0},{"$f":"MOS_Table_4!BV42","v":0},{"$f":"MOS_Table_4!CB42","v":0},{"$f":"MOS_Table_4!BZ42","v":0},{"$f":"MOS_Table_4!CE42","v":0},{"$f":"MOS_Table_4!BN42+MOS_Table_4!CH42+MOS_Table_4!CI42","v":0},0,null,null,null,null,null,null,null,null,null,null,null,null,null,null,null,null,null,null,null,null,null,null,null,null,null,null,null,null,null,null,null,null,null,null,null,null,null,null,null,null,null,null,null,null,null,null,"Côte d’Ivoire",34,null,null,null,null,null,0,null,null,null,null,null,null,null,null,null,null,null,null,null,null,null,null,null,null,null,null,null,null,0,0,null,null,"Côte d’Ivoire",34,null,null,null,null,null,0,null,null,null,null,null,null,null,null,null,null,null,null,null,null,null,null,null,null,null,null,null,null,0,0,null,null,"under official agreement*","Closing",34,null,null,null,null,null,null,0,null,null,null,null,null,null,null,null,null,null,null,null,null,null,null,null,null,null,null,null,null,null,0,0]
[null,null,null,null,null,null,null,null,null,null," ",null,null,null,null,null,null,null,null,null,null,null,null,null,null,null,null,null,null,null,null,null,null,null,null,null,null,null,null,null,"Croatia",35,{"$f":"MOS_Table_3!AP43","v":0},{"$f":"MOS_Table_3!AQ43","v":0},{"$f":"SUM(MOS_Table_3!AR43,MOS_Table_3!AS43,MOS_Table_3!AT43)","v":0},0,{"$f":"MOS_Table_3!AW43","v":0},{"$f":"MOS_Table_3!AX43","v":0},{"$f":"SUM(MOS_Table_3!BB43,MOS_Table_3!BC43,MOS_Table_3!AY43)","v":0},{"$f":"SUM(MOS_Table_3!BE43:BG43)","v":0},{"$f":"MOS_Table_3!BD43","v":0},{"$f":"MOS_Table_3!BJ43","v":0},{"$f":"MOS_Table_3!BH43","v":0},{"$f":"MOS_Table_3!BM43","v":0},{"$f":"SUM(MOS_Table_3!AV43,MOS_Table_3!BP43,MOS_Table_3!BQ43)","v":0},0,null,null,"Croatia",35,{"$f":"MOS_Table_4!BH43","v":0},{"$f":"MOS_Table_4!BI43","v":0},{"$f":"MOS_Table_4!BJ43+MOS_Table_4!BK43+MOS_Table_4!BL43","v":0},0,{"$f":"MOS_Table_4!BO43","v":0},{"$f":"MOS_Table_4!BP43","v":0},{"$f":"MOS_Table_4!BT43+MOS_Table_4!BU43+MOS_Table_4!BQ43","v":0},{"$f":"MOS_Table_4!BW43+MOS_Table_4!BX43+MOS_Table_4!BY43","v":0},{"$f":"MOS_Table_4!BV43","v":0},{"$f":"MOS_Table_4!CB43","v":0},{"$f":"MOS_Table_4!BZ43","v":0},{"$f":"MOS_Table_4!CE43","v":0},{"$f":"MOS_Table_4!BN43+MOS_Table_4!CH43+MOS_Table_4!CI43","v":0},0,null,null,null,null,null,null,null,null,null,null,null,null,null,null,null,null,null,null,null,null,null,null,null,null,null,null,null,null,null,null,null,null,null,null,null,null,null,null,null,null,null,null,null,null,null,null,"Croatia",35,null,null,null,null,null,0,null,null,null,null,null,null,null,null,null,null,null,null,null,null,null,null,null,null,null,null,null,null,0,0,null,null,"Croatia",35,null,null,null,null,null,0,null,null,null,null,null,null,null,null,null,null,null,null,null,null,null,null,null,null,null,null,null,null,0,0]
[null,null,null,null,null,null,null,null,null,null,"ê",null,null,null,null,null,null,null,null,null,null,null,null,null,null,null,null,null,null,null,null,null,null,null,null,null,null,null,null,null,"Cuba",36,{"$f":"MOS_Table_3!AP44","v":0},{"$f":"MOS_Table_3!AQ44","v":0},{"$f":"SUM(MOS_Table_3!AR44,MOS_Table_3!AS44,MOS_Table_3!AT44)","v":0},0,{"$f":"MOS_Table_3!AW44","v":0},{"$f":"MOS_Table_3!AX44","v":0},{"$f":"SUM(MOS_Table_3!BB44,MOS_Table_3!BC44,MOS_Table_3!AY44)","v":0},{"$f":"SUM(MOS_Table_3!BE44:BG44)","v":0},{"$f":"MOS_Table_3!BD44","v":0},{"$f":"MOS_Table_3!BJ44","v":0},{"$f":"MOS_Table_3!BH44","v":0},{"$f":"MOS_Table_3!BM44","v":0},{"$f":"SUM(MOS_Table_3!AV44,MOS_Table_3!BP44,MOS_Table_3!BQ44)","v":0},0,null,null,"Cuba",36,{"$f":"MOS_Table_4!BH44","v":0},{"$f":"MOS_Table_4!BI44","v":0},{"$f":"MOS_Table_4!BJ44+MOS_Table_4!BK44+MOS_Table_4!BL44","v":0},0,{"$f":"MOS_Table_4!BO44","v":0},{"$f":"MOS_Table_4!BP44","v":0},{"$f":"MOS_Table_4!BT44+MOS_Table_4!BU44+MOS_Table_4!BQ44","v":0},{"$f":"MOS_Table_4!BW44+MOS_Table_4!BX44+MOS_Table_4!BY44","v":0},{"$f":"MOS_Table_4!BV44","v":0},{"$f":"MOS_Table_4!CB44","v":0},{"$f":"MOS_Table_4!BZ44","v":0},{"$f":"MOS_Table_4!CE44","v":0},{"$f":"MOS_Table_4!BN44+MOS_Table_4!CH44+MOS_Table_4!CI44","v":0},0,null,null,null,null,null,null,null,null,null,null,null,null,null,null,null,null,null,null,null,null,null,null,null,null,null,null,null,null,null,null,null,null,null,null,null,null,null,null,null,null,null,null,null,null,null,null,"Cuba",36,null,null,null,null,null,0,null,null,null,null,null,null,null,null,null,null,null,null,null,null,null,null,null,null,null,null,null,null,0,0,null,null,"Cuba",36,null,null,null,null,null,0,null,null,null,null,null,null,null,null,null,null,null,null,null,null,null,null,null,null,null,null,null,null,0,0]
[null,null,null,null,null,null,null,null,null,null," ",null,null,null,null,null,null,null,null,null,null,null,null,null,null,null,null,null,null,null,null,null,null,null,null,null,null,null,null,null,"Curaçao",37,{"$f":"MOS_Table_3!AP45","v":0},{"$f":"MOS_Table_3!AQ45","v":0},{"$f":"SUM(MOS_Table_3!AR45,MOS_Table_3!AS45,MOS_Table_3!AT45)","v":0},0,{"$f":"MOS_Table_3!AW45","v":0},{"$f":"MOS_Table_3!AX45","v":0},{"$f":"SUM(MOS_Table_3!BB45,MOS_Table_3!BC45,MOS_Table_3!AY45)","v":0},{"$f":"SUM(MOS_Table_3!BE45:BG45)","v":0},{"$f":"MOS_Table_3!BD45","v":0},{"$f":"MOS_Table_3!BJ45","v":0},{"$f":"MOS_Table_3!BH45","v":0},{"$f":"MOS_Table_3!BM45","v":0},{"$f":"SUM(MOS_Table_3!AV45,MOS_Table_3!BP45,MOS_Table_3!BQ45)","v":0},0,null,null,"Curaçao",37,{"$f":"MOS_Table_4!BH45","v":0},{"$f":"MOS_Table_4!BI45","v":0},{"$f":"MOS_Table_4!BJ45+MOS_Table_4!BK45+MOS_Table_4!BL45","v":0},0,{"$f":"MOS_Table_4!BO45","v":0},{"$f":"MOS_Table_4!BP45","v":0},{"$f":"MOS_Table_4!BT45+MOS_Table_4!BU45+MOS_Table_4!BQ45","v":0},{"$f":"MOS_Table_4!BW45+MOS_Table_4!BX45+MOS_Table_4!BY45","v":0},{"$f":"MOS_Table_4!BV45","v":0},{"$f":"MOS_Table_4!CB45","v":0},{"$f":"MOS_Table_4!BZ45","v":0},{"$f":"MOS_Table_4!CE45","v":0},{"$f":"MOS_Table_4!BN45+MOS_Table_4!CH45+MOS_Table_4!CI45","v":0},0,null,null,null,null,null,null,null,null,null,null,null,null,null,null,null,null,null,null,null,null,null,null,null,null,null,null,null,null,null,null,null,null,null,null,null,null,null,null,null,null,null,null,null,null,null,null,"Curaçao",37,null,null,null,null,null,0,null,null,null,null,null,null,null,null,null,null,null,null,null,null,null,null,null,null,null,null,null,null,0,0,null,null,"Curaçao",37,null,null,null,null,null,0,null,null,null,null,null,null,null,null,null,null,null,null,null,null,null,null,null,null,null,null,null,null,0,0]
[null,null,null,null,null,null,null,null,null,null,"ê",null,null,null,null,null,null,null,null,null,null,null,null,null,null,null,null,null,null,null,null,null,null,null,null,null,null,null,null,null,"Cyprus",38,{"$f":"MOS_Table_3!AP46","v":0},{"$f":"MOS_Table_3!AQ46","v":0},{"$f":"SUM(MOS_Table_3!AR46,MOS_Table_3!AS46,MOS_Table_3!AT46)","v":0},0,{"$f":"MOS_Table_3!AW46","v":0},{"$f":"MOS_Table_3!AX46","v":0},{"$f":"SUM(MOS_Table_3!BB46,MOS_Table_3!BC46,MOS_Table_3!AY46)","v":0},{"$f":"SUM(MOS_Table_3!BE46:BG46)","v":0},{"$f":"MOS_Table_3!BD46","v":0},{"$f":"MOS_Table_3!BJ46","v":0},{"$f":"MOS_Table_3!BH46","v":0},{"$f":"MOS_Table_3!BM46","v":0},{"$f":"SUM(MOS_Table_3!AV46,MOS_Table_3!BP46,MOS_Table_3!BQ46)","v":0},0,null,null,"Cyprus",38,{"$f":"MOS_Table_4!BH46","v":0},{"$f":"MOS_Table_4!BI46","v":0},{"$f":"MOS_Table_4!BJ46+MOS_Table_4!BK46+MOS_Table_4!BL46","v":0},0,{"$f":"MOS_Table_4!BO46","v":0},{"$f":"MOS_Table_4!BP46","v":0},{"$f":"MOS_Table_4!BT46+MOS_Table_4!BU46+MOS_Table_4!BQ46","v":0},{"$f":"MOS_Table_4!BW46+MOS_Table_4!BX46+MOS_Table_4!BY46","v":0},{"$f":"MOS_Table_4!BV46","v":0},{"$f":"MOS_Table_4!CB46","v":0},{"$f":"MOS_Table_4!BZ46","v":0},{"$f":"MOS_Table_4!CE46","v":0},{"$f":"MOS_Table_4!BN46+MOS_Table_4!CH46+MOS_Table_4!CI46","v":0},0,null,null,null,null,null,null,null,null,null,null,null,null,null,null,null,null,null,null,null,null,null,null,null,null,null,null,null,null,null,null,null,null,null,null,null,null,null,null,null,null,null,null,null,null,null,null,"Cyprus",38,null,null,null,null,null,0,null,null,null,null,null,null,null,null,null,null,null,null,null,null,null,null,null,null,null,null,null,null,0,0,null,null,"Cyprus",38,null,null,null,null,null,0,null,null,null,null,null,null,null,null,null,null,null,null,null,null,null,null,null,null,null,null,null,null,0,0]
[null,null,null,null,null,null,null,null,null,null," ",null,null,null,null,null,null,null,null,null,null,null,null,null,null,null,null,null,null,null,null,null,null,null,null,null,null,null,null,null,"Czech Republic",39,{"$f":"MOS_Table_3!AP47","v":0},{"$f":"MOS_Table_3!AQ47","v":0},{"$f":"SUM(MOS_Table_3!AR47,MOS_Table_3!AS47,MOS_Table_3!AT47)","v":0},0,{"$f":"MOS_Table_3!AW47","v":0},{"$f":"MOS_Table_3!AX47","v":0},{"$f":"SUM(MOS_Table_3!BB47,MOS_Table_3!BC47,MOS_Table_3!AY47)","v":0},{"$f":"SUM(MOS_Table_3!BE47:BG47)","v":0},{"$f":"MOS_Table_3!BD47","v":0},{"$f":"MOS_Table_3!BJ47","v":0},{"$f":"MOS_Table_3!BH47","v":0},{"$f":"MOS_Table_3!BM47","v":0},{"$f":"SUM(MOS_Table_3!AV47,MOS_Table_3!BP47,MOS_Table_3!BQ47)","v":0},0,null,null,"Czech Republic",39,{"$f":"MOS_Table_4!BH47","v":0},{"$f":"MOS_Table_4!BI47","v":0},{"$f":"MOS_Table_4!BJ47+MOS_Table_4!BK47+MOS_Table_4!BL47","v":0},0,{"$f":"MOS_Table_4!BO47","v":0},{"$f":"MOS_Table_4!BP47","v":0},{"$f":"MOS_Table_4!BT47+MOS_Table_4!BU47+MOS_Table_4!BQ47","v":0},{"$f":"MOS_Table_4!BW47+MOS_Table_4!BX47+MOS_Table_4!BY47","v":0},{"$f":"MOS_Table_4!BV47","v":0},{"$f":"MOS_Table_4!CB47","v":0},{"$f":"MOS_Table_4!BZ47","v":0},{"$f":"MOS_Table_4!CE47","v":0},{"$f":"MOS_Table_4!BN47+MOS_Table_4!CH47+MOS_Table_4!CI47","v":0},0,null,null,null,null,null,null,null,null,null,null,null,null,null,null,null,null,null,null,null,null,null,null,null,null,null,null,null,null,null,null,null,null,null,null,null,null,null,null,null,null,null,null,null,null,null,null,"Czech Republic",39,null,null,null,null,null,0,null,null,null,null,null,null,null,null,null,null,null,null,null,null,null,null,null,null,null,null,null,null,0,0,null,null,"Czech Republic",39,null,null,null,null,null,0,null,null,null,null,null,null,null,null,null,null,null,null,null,null,null,null,null,null,null,null,null,null,0,0]
[null,null,null,null,null,null,null,null,null,null,"ê",null,null,null,null,null,null,null,null,null,null,null,null,null,null,null,null,null,null,null,null,null,null,null,null,null,null,null,null,null,"Korea, Democratic People's Republic of",40,{"$f":"MOS_Table_3!AP48","v":0},{"$f":"MOS_Table_3!AQ48","v":0},{"$f":"SUM(MOS_Table_3!AR48,MOS_Table_3!AS48,MOS_Table_3!AT48)","v":0},0,{"$f":"MOS_Table_3!AW48","v":0},{"$f":"MOS_Table_3!AX48","v":0},{"$f":"SUM(MOS_Table_3!BB48,MOS_Table_3!BC48,MOS_Table_3!AY48)","v":0},{"$f":"SUM(MOS_Table_3!BE48:BG48)","v":0},{"$f":"MOS_Table_3!BD48","v":0},{"$f":"MOS_Table_3!BJ48","v":0},{"$f":"MOS_Table_3!BH48","v":0},{"$f":"MOS_Table_3!BM48","v":0},{"$f":"SUM(MOS_Table_3!AV48,MOS_Table_3!BP48,MOS_Table_3!BQ48)","v":0},0,null,null,"Korea, Democratic People's Republic of",40,{"$f":"MOS_Table_4!BH48","v":0},{"$f":"MOS_Table_4!BI48","v":0},{"$f":"MOS_Table_4!BJ48+MOS_Table_4!BK48+MOS_Table_4!BL48","v":0},0,{"$f":"MOS_Table_4!BO48","v":0},{"$f":"MOS_Table_4!BP48","v":0},{"$f":"MOS_Table_4!BT48+MOS_Table_4!BU48+MOS_Table_4!BQ48","v":0},{"$f":"MOS_Table_4!BW48+MOS_Table_4!BX48+MOS_Table_4!BY48","v":0},{"$f":"MOS_Table_4!BV48","v":0},{"$f":"MOS_Table_4!CB48","v":0},{"$f":"MOS_Table_4!BZ48","v":0},{"$f":"MOS_Table_4!CE48","v":0},{"$f":"MOS_Table_4!BN48+MOS_Table_4!CH48+MOS_Table_4!CI48","v":0},0,null,null,null,null,null,null,null,null,null,null,null,null,null,null,null,null,null,null,null,null,null,null,null,null,null,null,null,null,null,null,null,null,null,null,null,null,null,null,null,null,null,null,null,null,null,null,"Korea, Democratic People's Republic of",40,null,null,null,null,null,0,null,null,null,null,null,null,null,null,null,null,null,null,null,null,null,null,null,null,null,null,null,null,0,0,null,null,"Korea, Democratic People's Republic of",40,null,null,null,null,null,0,null,null,null,null,null,null,null,null,null,null,null,null,null,null,null,null,null,null,null,null,null,null,0,0]
[null,null,null,null,null,null,null,null,null,null," ",null,null,null,null,null,null,null,null,null,null,null,null,null,null,null,null,null,null,null,null,null,null,null,null,null,null,null,null,null,"Congo, Democratic Republic of the",41,{"$f":"MOS_Table_3!AP49","v":0},{"$f":"MOS_Table_3!AQ49","v":0},{"$f":"SUM(MOS_Table_3!AR49,MOS_Table_3!AS49,MOS_Table_3!AT49)","v":0},0,{"$f":"MOS_Table_3!AW49","v":0},{"$f":"MOS_Table_3!AX49","v":0},{"$f":"SUM(MOS_Table_3!BB49,MOS_Table_3!BC49,MOS_Table_3!AY49)","v":0},{"$f":"SUM(MOS_Table_3!BE49:BG49)","v":0},{"$f":"MOS_Table_3!BD49","v":0},{"$f":"MOS_Table_3!BJ49","v":0},{"$f":"MOS_Table_3!BH49","v":0},{"$f":"MOS_Table_3!BM49","v":0},{"$f":"SUM(MOS_Table_3!AV49,MOS_Table_3!BP49,MOS_Table_3!BQ49)","v":0},0,null,null,"Congo, Democratic Republic of the",41,{"$f":"MOS_Table_4!BH49","v":0},{"$f":"MOS_Table_4!BI49","v":0},{"$f":"MOS_Table_4!BJ49+MOS_Table_4!BK49+MOS_Table_4!BL49","v":0},0,{"$f":"MOS_Table_4!BO49","v":0},{"$f":"MOS_Table_4!BP49","v":0},{"$f":"MOS_Table_4!BT49+MOS_Table_4!BU49+MOS_Table_4!BQ49","v":0},{"$f":"MOS_Table_4!BW49+MOS_Table_4!BX49+MOS_Table_4!BY49","v":0},{"$f":"MOS_Table_4!BV49","v":0},{"$f":"MOS_Table_4!CB49","v":0},{"$f":"MOS_Table_4!BZ49","v":0},{"$f":"MOS_Table_4!CE49","v":0},{"$f":"MOS_Table_4!BN49+MOS_Table_4!CH49+MOS_Table_4!CI49","v":0},0,null,null,null,null,null,null,null,null,null,null,null,null,null,null,null,null,null,null,null,null,null,null,null,null,null,null,null,null,null,null,null,null,null,null,null,null,null,null,null,null,null,null,null,null,null,null,"Congo, Democratic Republic of the",41,null,null,null,null,null,0,null,null,null,null,null,null,null,null,null,null,null,null,null,null,null,null,null,null,null,null,null,null,0,0,null,null,"Congo, Democratic Republic of the",41,null,null,null,null,null,0,null,null,null,null,null,null,null,null,null,null,null,null,null,null,null,null,null,null,null,null,null,null,0,0]
[null,null,null,null,null,null,null,null,null,null,"ê",null,null,null,null,null,null,null,null,null,null,null,null,null,null,null,null,null,null,null,null,null,null,null,null,null,null,null,null,null,"Denmark",42,{"$f":"MOS_Table_3!AP50","v":0},{"$f":"MOS_Table_3!AQ50","v":0},{"$f":"SUM(MOS_Table_3!AR50,MOS_Table_3!AS50,MOS_Table_3!AT50)","v":0},0,{"$f":"MOS_Table_3!AW50","v":0},{"$f":"MOS_Table_3!AX50","v":0},{"$f":"SUM(MOS_Table_3!BB50,MOS_Table_3!BC50,MOS_Table_3!AY50)","v":0},{"$f":"SUM(MOS_Table_3!BE50:BG50)","v":0},{"$f":"MOS_Table_3!BD50","v":0},{"$f":"MOS_Table_3!BJ50","v":0},{"$f":"MOS_Table_3!BH50","v":0},{"$f":"MOS_Table_3!BM50","v":0},{"$f":"SUM(MOS_Table_3!AV50,MOS_Table_3!BP50,MOS_Table_3!BQ50)","v":0},0,null,null,"Denmark",42,{"$f":"MOS_Table_4!BH50","v":0},{"$f":"MOS_Table_4!BI50","v":0},{"$f":"MOS_Table_4!BJ50+MOS_Table_4!BK50+MOS_Table_4!BL50","v":0},0,{"$f":"MOS_Table_4!BO50","v":0},{"$f":"MOS_Table_4!BP50","v":0},{"$f":"MOS_Table_4!BT50+MOS_Table_4!BU50+MOS_Table_4!BQ50","v":0},{"$f":"MOS_Table_4!BW50+MOS_Table_4!BX50+MOS_Table_4!BY50","v":0},{"$f":"MOS_Table_4!BV50","v":0},{"$f":"MOS_Table_4!CB50","v":0},{"$f":"MOS_Table_4!BZ50","v":0},{"$f":"MOS_Table_4!CE50","v":0},{"$f":"MOS_Table_4!BN50+MOS_Table_4!CH50+MOS_Table_4!CI50","v":0},0,null,null,null,null,null,null,null,null,null,null,null,null,null,null,null,null,null,null,null,null,null,null,null,null,null,null,null,null,null,null,null,null,null,null,null,null,null,null,null,null,null,null,null,null,null,null,"Denmark",42,null,null,null,null,null,0,null,null,null,null,null,null,null,null,null,null,null,null,null,null,null,null,null,null,null,null,null,null,0,0,null,null,"Denmark",42,null,null,null,null,null,0,null,null,null,null,null,null,null,null,null,null,null,null,null,null,null,null,null,null,null,null,null,null,0,0]
[null,null,null,null,null,null,null,null,null,null," ",null,null,null,null,null,null,null,null,null,null,null,null,null,null,null,null,null,null,null,null,null,null,null,null,null,null,null,null,null,"Djibouti",43,{"$f":"MOS_Table_3!AP51","v":0},{"$f":"MOS_Table_3!AQ51","v":0},{"$f":"SUM(MOS_Table_3!AR51,MOS_Table_3!AS51,MOS_Table_3!AT51)","v":0},0,{"$f":"MOS_Table_3!AW51","v":0},{"$f":"MOS_Table_3!AX51","v":0},{"$f":"SUM(MOS_Table_3!BB51,MOS_Table_3!BC51,MOS_Table_3!AY51)","v":0},{"$f":"SUM(MOS_Table_3!BE51:BG51)","v":0},{"$f":"MOS_Table_3!BD51","v":0},{"$f":"MOS_Table_3!BJ51","v":0},{"$f":"MOS_Table_3!BH51","v":0},{"$f":"MOS_Table_3!BM51","v":0},{"$f":"SUM(MOS_Table_3!AV51,MOS_Table_3!BP51,MOS_Table_3!BQ51)","v":0},0,null,null,"Djibouti",43,{"$f":"MOS_Table_4!BH51","v":0},{"$f":"MOS_Table_4!BI51","v":0},{"$f":"MOS_Table_4!BJ51+MOS_Table_4!BK51+MOS_Table_4!BL51","v":0},0,{"$f":"MOS_Table_4!BO51","v":0},{"$f":"MOS_Table_4!BP51","v":0},{"$f":"MOS_Table_4!BT51+MOS_Table_4!BU51+MOS_Table_4!BQ51","v":0},{"$f":"MOS_Table_4!BW51+MOS_Table_4!BX51+MOS_Table_4!BY51","v":0},{"$f":"MOS_Table_4!BV51","v":0},{"$f":"MOS_Table_4!CB51","v":0},{"$f":"MOS_Table_4!BZ51","v":0},{"$f":"MOS_Table_4!CE51","v":0},{"$f":"MOS_Table_4!BN51+MOS_Table_4!CH51+MOS_Table_4!CI51","v":0},0,null,null,null,null,null,null,null,null,null,null,null,null,null,null,null,null,null,null,null,null,null,null,null,null,null,null,null,null,null,null,null,null,null,null,null,null,null,null,null,null,null,null,null,null,null,null,"Djibouti",43,null,null,null,null,null,0,null,null,null,null,null,null,null,null,null,null,null,null,null,null,null,null,null,null,null,null,null,null,0,0,null,null,"Djibouti",43,null,null,null,null,null,0,null,null,null,null,null,null,null,null,null,null,null,null,null,null,null,null,null,null,null,null,null,null,0,0]
[null,null,null,null,null,null,null,null,null,null,"ê",null,null,null,null,null,null,null,null,null,null,null,null,null,null,null,null,null,null,null,null,null,null,null,null,null,null,null,null,null,"Dominican Republic",44,{"$f":"MOS_Table_3!AP52","v":0},{"$f":"MOS_Table_3!AQ52","v":0},{"$f":"SUM(MOS_Table_3!AR52,MOS_Table_3!AS52,MOS_Table_3!AT52)","v":0},0,{"$f":"MOS_Table_3!AW52","v":0},{"$f":"MOS_Table_3!AX52","v":0},{"$f":"SUM(MOS_Table_3!BB52,MOS_Table_3!BC52,MOS_Table_3!AY52)","v":0},{"$f":"SUM(MOS_Table_3!BE52:BG52)","v":0},{"$f":"MOS_Table_3!BD52","v":0},{"$f":"MOS_Table_3!BJ52","v":0},{"$f":"MOS_Table_3!BH52","v":0},{"$f":"MOS_Table_3!BM52","v":0},{"$f":"SUM(MOS_Table_3!AV52,MOS_Table_3!BP52,MOS_Table_3!BQ52)","v":0},0,null,null,"Dominican Republic",44,{"$f":"MOS_Table_4!BH52","v":0},{"$f":"MOS_Table_4!BI52","v":0},{"$f":"MOS_Table_4!BJ52+MOS_Table_4!BK52+MOS_Table_4!BL52","v":0},0,{"$f":"MOS_Table_4!BO52","v":0},{"$f":"MOS_Table_4!BP52","v":0},{"$f":"MOS_Table_4!BT52+MOS_Table_4!BU52+MOS_Table_4!BQ52","v":0},{"$f":"MOS_Table_4!BW52+MOS_Table_4!BX52+MOS_Table_4!BY52","v":0},{"$f":"MOS_Table_4!BV52","v":0},{"$f":"MOS_Table_4!CB52","v":0},{"$f":"MOS_Table_4!BZ52","v":0},{"$f":"MOS_Table_4!CE52","v":0},{"$f":"MOS_Table_4!BN52+MOS_Table_4!CH52+MOS_Table_4!CI52","v":0},0,null,null,null,null,null,null,null,null,null,null,null,null,null,null,null,null,null,null,null,null,null,null,null,null,null,null,null,null,null,null,null,null,null,null,null,null,null,null,null,null,null,null,null,null,null,null,"Dominican Republic",44,null,null,null,null,null,0,null,null,null,null,null,null,null,null,null,null,null,null,null,null,null,null,null,null,null,null,null,null,0,0,null,null,"Dominican Republic",44,null,null,null,null,null,0,null,null,null,null,null,null,null,null,null,null,null,null,null,null,null,null,null,null,null,null,null,null,0,0]
[null,null,null,null,null,null,null,null,null,null," ",null,null,null,null,null,null,null,null,null,null,null,null,null,null,null,null,null,null,null,null,null,null,null,null,null,null,null,null,null,"Ecuador",45,{"$f":"MOS_Table_3!AP53","v":0},{"$f":"MOS_Table_3!AQ53","v":0},{"$f":"SUM(MOS_Table_3!AR53,MOS_Table_3!AS53,MOS_Table_3!AT53)","v":0},0,{"$f":"MOS_Table_3!AW53","v":0},{"$f":"MOS_Table_3!AX53","v":0},{"$f":"SUM(MOS_Table_3!BB53,MOS_Table_3!BC53,MOS_Table_3!AY53)","v":0},{"$f":"SUM(MOS_Table_3!BE53:BG53)","v":0},{"$f":"MOS_Table_3!BD53","v":0},{"$f":"MOS_Table_3!BJ53","v":0},{"$f":"MOS_Table_3!BH53","v":0},{"$f":"MOS_Table_3!BM53","v":0},{"$f":"SUM(MOS_Table_3!AV53,MOS_Table_3!BP53,MOS_Table_3!BQ53)","v":0},0,null,null,"Ecuador",45,{"$f":"MOS_Table_4!BH53","v":0},{"$f":"MOS_Table_4!BI53","v":0},{"$f":"MOS_Table_4!BJ53+MOS_Table_4!BK53+MOS_Table_4!BL53","v":0},0,{"$f":"MOS_Table_4!BO53","v":0},{"$f":"MOS_Table_4!BP53","v":0},{"$f":"MOS_Table_4!BT53+MOS_Table_4!BU53+MOS_Table_4!BQ53","v":0},{"$f":"MOS_Table_4!BW53+MOS_Table_4!BX53+MOS_Table_4!BY53","v":0},{"$f":"MOS_Table_4!BV53","v":0},{"$f":"MOS_Table_4!CB53","v":0},{"$f":"MOS_Table_4!BZ53","v":0},{"$f":"MOS_Table_4!CE53","v":0},{"$f":"MOS_Table_4!BN53+MOS_Table_4!CH53+MOS_Table_4!CI53","v":0},0,null,null,null,null,null,null,null,null,null,null,null,null,null,null,null,null,null,null,null,null,null,null,null,null,null,null,null,null,null,null,null,null,null,null,null,null,null,null,null,null,null,null,null,null,null,null,"Ecuador",45,null,null,null,null,null,{"$f":"SUM(DS56:DW56)","v":0},null,null,null,null,null,null,null,null,null,null,null,null,null,null,null,null,null,null,null,null,null,null,0,{"$f":"SUM(DX56,EU56)","v":0},null,null,"Ecuador",45,null,null,null,null,null,0,null,null,null,null,null,null,null,null,null,null,null,null,null,null,null,null,null,null,null,null,null,null,0,0]
[null,null,null,null,null,null,null,null,null,null,"ê",null,null,null,null,null,null,null,null,null,null,null,null,null,null,null,null,null,null,null,null,null,null,null,null,null,null,null,null,null,"Egypt",46,{"$f":"MOS_Table_3!AP54","v":0},{"$f":"MOS_Table_3!AQ54","v":0},{"$f":"SUM(MOS_Table_3!AR54,MOS_Table_3!AS54,MOS_Table_3!AT54)","v":0},0,{"$f":"MOS_Table_3!AW54","v":0},{"$f":"MOS_Table_3!AX54","v":0},{"$f":"SUM(MOS_Table_3!BB54,MOS_Table_3!BC54,MOS_Table_3!AY54)","v":0},{"$f":"SUM(MOS_Table_3!BE54:BG54)","v":0},{"$f":"MOS_Table_3!BD54","v":0},{"$f":"MOS_Table_3!BJ54","v":0},{"$f":"MOS_Table_3!BH54","v":0},{"$f":"MOS_Table_3!BM54","v":0},{"$f":"SUM(MOS_Table_3!AV54,MOS_Table_3!BP54,MOS_Table_3!BQ54)","v":0},0,null,null,"Egypt",46,{"$f":"MOS_Table_4!BH54","v":0},{"$f":"MOS_Table_4!BI54","v":0},{"$f":"MOS_Table_4!BJ54+MOS_Table_4!BK54+MOS_Table_4!BL54","v":0},0,{"$f":"MOS_Table_4!BO54","v":0},{"$f":"MOS_Table_4!BP54","v":0},{"$f":"MOS_Table_4!BT54+MOS_Table_4!BU54+MOS_Table_4!BQ54","v":0},{"$f":"MOS_Table_4!BW54+MOS_Table_4!BX54+MOS_Table_4!BY54","v":0},{"$f":"MOS_Table_4!BV54","v":0},{"$f":"MOS_Table_4!CB54","v":0},{"$f":"MOS_Table_4!BZ54","v":0},{"$f":"MOS_Table_4!CE54","v":0},{"$f":"MOS_Table_4!BN54+MOS_Table_4!CH54+MOS_Table_4!CI54","v":0},0,null,null,null,null,null,null,null,null,null,null,null,null,null,null,null,null,null,null,null,null,null,null,null,null,null,null,null,null,null,null,null,null,null,null,null,null,null,null,null,null,null,null,null,null,null,null,"Egypt",46,null,null,null,null,null,0,null,null,null,null,null,null,null,null,null,null,null,null,null,null,null,null,null,null,null,null,null,null,0,0,null,null,"Egypt",46,null,null,null,null,null,{"$f":"SUM(FA57:FE57)","v":0},null,null,null,null,null,null,null,null,null,null,null,null,null,null,null,null,null,null,null,null,null,null,0,{"$f":"SUM(FF57,GC57)","v":0}]
[null,null,null,null,null,null,null,null,null,null," ",null,null,null,null,null,null,null,null,null,null,null,null,null,null,null,null,null,null,null,null,null,null,null,null,null,null,null,null,null,"Equatorial Guinea",47,{"$f":"MOS_Table_3!AP55","v":0},{"$f":"MOS_Table_3!AQ55","v":0},{"$f":"SUM(MOS_Table_3!AR55,MOS_Table_3!AS55,MOS_Table_3!AT55)","v":0},0,{"$f":"MOS_Table_3!AW55","v":0},{"$f":"MOS_Table_3!AX55","v":0},{"$f":"SUM(MOS_Table_3!BB55,MOS_Table_3!BC55,MOS_Table_3!AY55)","v":0},{"$f":"SUM(MOS_Table_3!BE55:BG55)","v":0},{"$f":"MOS_Table_3!BD55","v":0},{"$f":"MOS_Table_3!BJ55","v":0},{"$f":"MOS_Table_3!BH55","v":0},{"$f":"MOS_Table_3!BM55","v":0},{"$f":"SUM(MOS_Table_3!AV55,MOS_Table_3!BP55,MOS_Table_3!BQ55)","v":0},0,null,null,"Equatorial Guinea",47,{"$f":"MOS_Table_4!BH55","v":0},{"$f":"MOS_Table_4!BI55","v":0},{"$f":"MOS_Table_4!BJ55+MOS_Table_4!BK55+MOS_Table_4!BL55","v":0},0,{"$f":"MOS_Table_4!BO55","v":0},{"$f":"MOS_Table_4!BP55","v":0},{"$f":"MOS_Table_4!BT55+MOS_Table_4!BU55+MOS_Table_4!BQ55","v":0},{"$f":"MOS_Table_4!BW55+MOS_Table_4!BX55+MOS_Table_4!BY55","v":0},{"$f":"MOS_Table_4!BV55","v":0},{"$f":"MOS_Table_4!CB55","v":0},{"$f":"MOS_Table_4!BZ55","v":0},{"$f":"MOS_Table_4!CE55","v":0},{"$f":"MOS_Table_4!BN55+MOS_Table_4!CH55+MOS_Table_4!CI55","v":0},0,null,null,null,null,null,null,null,null,null,null,null,null,null,null,null,null,null,null,null,null,null,null,null,null,null,null,null,null,null,null,null,null,null,null,null,null,null,null,null,null,null,null,null,null,null,null,"Equatorial Guinea",47,null,null,null,null,null,0,null,null,null,null,null,null,null,null,null,null,null,null,null,null,null,null,null,null,null,null,null,null,0,0,null,null,"Equatorial Guinea",47,null,null,null,null,null,0,null,null,null,null,null,null,null,null,null,null,null,null,null,null,null,null,null,null,null,null,null,null,0,0]
[null,null,null,null,null,null,null,null,null,null,"ê",null,null,null,null,null,null,null,null,null,null,null,null,null,null,null,null,null,null,null,null,null,null,null,null,null,null,null,null,null,"Eritrea",48,{"$f":"MOS_Table_3!AP56","v":0},{"$f":"MOS_Table_3!AQ56","v":0},{"$f":"SUM(MOS_Table_3!AR56,MOS_Table_3!AS56,MOS_Table_3!AT56)","v":0},0,{"$f":"MOS_Table_3!AW56","v":0},{"$f":"MOS_Table_3!AX56","v":0},{"$f":"SUM(MOS_Table_3!BB56,MOS_Table_3!BC56,MOS_Table_3!AY56)","v":0},{"$f":"SUM(MOS_Table_3!BE56:BG56)","v":0},{"$f":"MOS_Table_3!BD56","v":0},{"$f":"MOS_Table_3!BJ56","v":0},{"$f":"MOS_Table_3!BH56","v":0},{"$f":"MOS_Table_3!BM56","v":0},{"$f":"SUM(MOS_Table_3!AV56,MOS_Table_3!BP56,MOS_Table_3!BQ56)","v":0},0,null,null,"Eritrea",48,{"$f":"MOS_Table_4!BH56","v":0},{"$f":"MOS_Table_4!BI56","v":0},{"$f":"MOS_Table_4!BJ56+MOS_Table_4!BK56+MOS_Table_4!BL56","v":0},0,{"$f":"MOS_Table_4!BO56","v":0},{"$f":"MOS_Table_4!BP56","v":0},{"$f":"MOS_Table_4!BT56+MOS_Table_4!BU56+MOS_Table_4!BQ56","v":0},{"$f":"MOS_Table_4!BW56+MOS_Table_4!BX56+MOS_Table_4!BY56","v":0},{"$f":"MOS_Table_4!BV56","v":0},{"$f":"MOS_Table_4!CB56","v":0},{"$f":"MOS_Table_4!BZ56","v":0},{"$f":"MOS_Table_4!CE56","v":0},{"$f":"MOS_Table_4!BN56+MOS_Table_4!CH56+MOS_Table_4!CI56","v":0},0,null,null,null,null,null,null,null,null,null,null,null,null,null,null,null,null,null,null,null,null,null,null,null,null,null,null,null,null,null,null,null,null,null,null,null,null,null,null,null,null,null,null,null,null,null,null,"Eritrea",48,null,null,null,null,null,0,null,null,null,null,null,null,null,null,null,null,null,null,null,null,null,null,null,null,null,null,null,null,0,0,null,null,"Eritrea",48,null,null,null,null,null,0,null,null,null,null,null,null,null,null,null,null,null,null,null,null,null,null,null,null,null,null,null,null,0,0]
[null,null,null,null,null,null,null,null,null,null," ",null,null,null,null,null,null,null,null,null,null,null,null,null,null,null,null,null,null,null,null,null,null,null,null,null,null,null,null,null,"Estonia",49,{"$f":"MOS_Table_3!AP57","v":0},{"$f":"MOS_Table_3!AQ57","v":0},{"$f":"SUM(MOS_Table_3!AR57,MOS_Table_3!AS57,MOS_Table_3!AT57)","v":0},0,{"$f":"MOS_Table_3!AW57","v":0},{"$f":"MOS_Table_3!AX57","v":0},{"$f":"SUM(MOS_Table_3!BB57,MOS_Table_3!BC57,MOS_Table_3!AY57)","v":0},{"$f":"SUM(MOS_Table_3!BE57:BG57)","v":0},{"$f":"MOS_Table_3!BD57","v":0},{"$f":"MOS_Table_3!BJ57","v":0},{"$f":"MOS_Table_3!BH57","v":0},{"$f":"MOS_Table_3!BM57","v":0},{"$f":"SUM(MOS_Table_3!AV57,MOS_Table_3!BP57,MOS_Table_3!BQ57)","v":0},0,null,null,"Estonia",49,{"$f":"MOS_Table_4!BH57","v":0},{"$f":"MOS_Table_4!BI57","v":0},{"$f":"MOS_Table_4!BJ57+MOS_Table_4!BK57+MOS_Table_4!BL57","v":0},0,{"$f":"MOS_Table_4!BO57","v":0},{"$f":"MOS_Table_4!BP57","v":0},{"$f":"MOS_Table_4!BT57+MOS_Table_4!BU57+MOS_Table_4!BQ57","v":0},{"$f":"MOS_Table_4!BW57+MOS_Table_4!BX57+MOS_Table_4!BY57","v":0},{"$f":"MOS_Table_4!BV57","v":0},{"$f":"MOS_Table_4!CB57","v":0},{"$f":"MOS_Table_4!BZ57","v":0},{"$f":"MOS_Table_4!CE57","v":0},{"$f":"MOS_Table_4!BN57+MOS_Table_4!CH57+MOS_Table_4!CI57","v":0},0,null,null,null,null,null,null,null,null,null,null,null,null,null,null,null,null,null,null,null,null,null,null,null,null,null,null,null,null,null,null,null,null,null,null,null,null,null,null,null,null,null,null,null,null,null,null,"Estonia",49,null,null,null,null,null,0,null,null,null,null,null,null,null,null,null,null,null,null,null,null,null,null,null,null,null,null,null,null,0,0,null,null,"Estonia",49,null,null,null,null,null,0,null,null,null,null,null,null,null,null,null,null,null,null,null,null,null,null,null,null,null,null,null,null,0,0]
[null,null,null,null,null,null,null,null,null,null,"ê",null,null,null,null,null,null,null,null,null,null,null,null,null,null,null,null,null,null,null,null,null,null,null,null,null,null,null,null,null,"Ethiopia",50,{"$f":"MOS_Table_3!AP58","v":0},{"$f":"MOS_Table_3!AQ58","v":0},{"$f":"SUM(MOS_Table_3!AR58,MOS_Table_3!AS58,MOS_Table_3!AT58)","v":0},0,{"$f":"MOS_Table_3!AW58","v":0},{"$f":"MOS_Table_3!AX58","v":0},{"$f":"SUM(MOS_Table_3!BB58,MOS_Table_3!BC58,MOS_Table_3!AY58)","v":0},{"$f":"SUM(MOS_Table_3!BE58:BG58)","v":0},{"$f":"MOS_Table_3!BD58","v":0},{"$f":"MOS_Table_3!BJ58","v":0},{"$f":"MOS_Table_3!BH58","v":0},{"$f":"MOS_Table_3!BM58","v":0},{"$f":"SUM(MOS_Table_3!AV58,MOS_Table_3!BP58,MOS_Table_3!BQ58)","v":0},0,null,null,"Ethiopia",50,{"$f":"MOS_Table_4!BH58","v":0},{"$f":"MOS_Table_4!BI58","v":0},{"$f":"MOS_Table_4!BJ58+MOS_Table_4!BK58+MOS_Table_4!BL58","v":0},0,{"$f":"MOS_Table_4!BO58","v":0},{"$f":"MOS_Table_4!BP58","v":0},{"$f":"MOS_Table_4!BT58+MOS_Table_4!BU58+MOS_Table_4!BQ58","v":0},{"$f":"MOS_Table_4!BW58+MOS_Table_4!BX58+MOS_Table_4!BY58","v":0},{"$f":"MOS_Table_4!BV58","v":0},{"$f":"MOS_Table_4!CB58","v":0},{"$f":"MOS_Table_4!BZ58","v":0},{"$f":"MOS_Table_4!CE58","v":0},{"$f":"MOS_Table_4!BN58+MOS_Table_4!CH58+MOS_Table_4!CI58","v":0},0,null,null,null,null,null,null,null,null,null,null,null,null,null,null,null,null,null,null,null,null,null,null,null,null,null,null,null,null,null,null,null,null,null,null,null,null,null,null,null,null,null,null,null,null,null,null,"Ethiopia",50,null,null,null,null,null,0,null,null,null,null,null,null,null,null,null,null,null,null,null,null,null,null,null,null,null,null,null,null,0,0,null,null,"Ethiopia",50,null,null,null,null,null,0,null,null,null,null,null,null,null,null,null,null,null,null,null,null,null,null,null,null,null,null,null,null,0,0]
[null,null,null,null,null,null,null,null,null,null," ",null,null,null,null,null,null,null,null,null,null,null,null,null,null,null,null,null,null,null,null,null,null,null,null,null,null,null,null,null,"Finland",51,{"$f":"MOS_Table_3!AP59","v":0},{"$f":"MOS_Table_3!AQ59","v":0},{"$f":"SUM(MOS_Table_3!AR59,MOS_Table_3!AS59,MOS_Table_3!AT59)","v":0},0,{"$f":"MOS_Table_3!AW59","v":0},{"$f":"MOS_Table_3!AX59","v":0},{"$f":"SUM(MOS_Table_3!BB59,MOS_Table_3!BC59,MOS_Table_3!AY59)","v":0},{"$f":"SUM(MOS_Table_3!BE59:BG59)","v":0},{"$f":"MOS_Table_3!BD59","v":0},{"$f":"MOS_Table_3!BJ59","v":0},{"$f":"MOS_Table_3!BH59","v":0},{"$f":"MOS_Table_3!BM59","v":0},{"$f":"SUM(MOS_Table_3!AV59,MOS_Table_3!BP59,MOS_Table_3!BQ59)","v":0},0,null,null,"Finland",51,{"$f":"MOS_Table_4!BH59","v":0},{"$f":"MOS_Table_4!BI59","v":0},{"$f":"MOS_Table_4!BJ59+MOS_Table_4!BK59+MOS_Table_4!BL59","v":0},0,{"$f":"MOS_Table_4!BO59","v":0},{"$f":"MOS_Table_4!BP59","v":0},{"$f":"MOS_Table_4!BT59+MOS_Table_4!BU59+MOS_Table_4!BQ59","v":0},{"$f":"MOS_Table_4!BW59+MOS_Table_4!BX59+MOS_Table_4!BY59","v":0},{"$f":"MOS_Table_4!BV59","v":0},{"$f":"MOS_Table_4!CB59","v":0},{"$f":"MOS_Table_4!BZ59","v":0},{"$f":"MOS_Table_4!CE59","v":0},{"$f":"MOS_Table_4!BN59+MOS_Table_4!CH59+MOS_Table_4!CI59","v":0},0,null,null,null,null,null,null,null,null,null,null,null,null,null,null,null,null,null,null,null,null,null,null,null,null,null,null,null,null,null,null,null,null,null,null,null,null,null,null,null,null,null,null,null,null,null,null,"Finland",51,null,null,null,null,null,0,null,null,null,null,null,null,null,null,null,null,null,null,null,null,null,null,null,null,null,null,null,null,0,0,null,null,"Finland",51,null,null,null,null,null,0,null,null,null,null,null,null,null,null,null,null,null,null,null,null,null,null,null,null,null,null,null,null,0,0]
[null,null,null,null,null,null,null,null,null,null,"ê",null,null,null,null,null,null,null,null,null,null,null,null,null,null,null,null,null,null,null,null,null,null,null,null,null,null,null,null,null,"France",52,{"$f":"MOS_Table_3!AP60","v":0},{"$f":"MOS_Table_3!AQ60","v":0},{"$f":"SUM(MOS_Table_3!AR60,MOS_Table_3!AS60,MOS_Table_3!AT60)","v":0},0,{"$f":"MOS_Table_3!AW60","v":0},{"$f":"MOS_Table_3!AX60","v":0},{"$f":"SUM(MOS_Table_3!BB60,MOS_Table_3!BC60,MOS_Table_3!AY60)","v":0},{"$f":"SUM(MOS_Table_3!BE60:BG60)","v":0},{"$f":"MOS_Table_3!BD60","v":0},{"$f":"MOS_Table_3!BJ60","v":0},{"$f":"MOS_Table_3!BH60","v":0},{"$f":"MOS_Table_3!BM60","v":0},{"$f":"SUM(MOS_Table_3!AV60,MOS_Table_3!BP60,MOS_Table_3!BQ60)","v":0},0,null,null,"France",52,{"$f":"MOS_Table_4!BH60","v":0},{"$f":"MOS_Table_4!BI60","v":0},{"$f":"MOS_Table_4!BJ60+MOS_Table_4!BK60+MOS_Table_4!BL60","v":0},0,{"$f":"MOS_Table_4!BO60","v":0},{"$f":"MOS_Table_4!BP60","v":0},{"$f":"MOS_Table_4!BT60+MOS_Table_4!BU60+MOS_Table_4!BQ60","v":0},{"$f":"MOS_Table_4!BW60+MOS_Table_4!BX60+MOS_Table_4!BY60","v":0},{"$f":"MOS_Table_4!BV60","v":0},{"$f":"MOS_Table_4!CB60","v":0},{"$f":"MOS_Table_4!BZ60","v":0},{"$f":"MOS_Table_4!CE60","v":0},{"$f":"MOS_Table_4!BN60+MOS_Table_4!CH60+MOS_Table_4!CI60","v":0},0,null,null,null,null,null,null,null,null,null,null,null,null,null,null,null,null,null,null,null,null,null,null,null,null,null,null,null,null,null,null,null,null,null,null,null,null,null,null,null,null,null,null,null,null,null,null,"France",52,null,null,null,null,null,0,null,null,null,null,null,null,null,null,null,null,null,null,null,null,null,null,null,null,null,null,null,null,0,0,null,null,"France",52,null,null,null,null,null,0,null,null,null,null,null,null,null,null,null,null,null,null,null,null,null,null,null,null,null,null,null,null,0,0]
[null,null,null,null,null,null,null,null,null,null," ",null,null,null,null,null,null,null,null,null,null,null,null,null,null,null,null,null,null,null,null,null,null,null,null,null,null,null,null,null,"Gabon",53,{"$f":"MOS_Table_3!AP61","v":0},{"$f":"MOS_Table_3!AQ61","v":0},{"$f":"SUM(MOS_Table_3!AR61,MOS_Table_3!AS61,MOS_Table_3!AT61)","v":0},0,{"$f":"MOS_Table_3!AW61","v":0},{"$f":"MOS_Table_3!AX61","v":0},{"$f":"SUM(MOS_Table_3!BB61,MOS_Table_3!BC61,MOS_Table_3!AY61)","v":0},{"$f":"SUM(MOS_Table_3!BE61:BG61)","v":0},{"$f":"MOS_Table_3!BD61","v":0},{"$f":"MOS_Table_3!BJ61","v":0},{"$f":"MOS_Table_3!BH61","v":0},{"$f":"MOS_Table_3!BM61","v":0},{"$f":"SUM(MOS_Table_3!AV61,MOS_Table_3!BP61,MOS_Table_3!BQ61)","v":0},0,null,null,"Gabon",53,{"$f":"MOS_Table_4!BH61","v":0},{"$f":"MOS_Table_4!BI61","v":0},{"$f":"MOS_Table_4!BJ61+MOS_Table_4!BK61+MOS_Table_4!BL61","v":0},0,{"$f":"MOS_Table_4!BO61","v":0},{"$f":"MOS_Table_4!BP61","v":0},{"$f":"MOS_Table_4!BT61+MOS_Table_4!BU61+MOS_Table_4!BQ61","v":0},{"$f":"MOS_Table_4!BW61+MOS_Table_4!BX61+MOS_Table_4!BY61","v":0},{"$f":"MOS_Table_4!BV61","v":0},{"$f":"MOS_Table_4!CB61","v":0},{"$f":"MOS_Table_4!BZ61","v":0},{"$f":"MOS_Table_4!CE61","v":0},{"$f":"MOS_Table_4!BN61+MOS_Table_4!CH61+MOS_Table_4!CI61","v":0},0,null,null,null,null,null,null,null,null,null,null,null,null,null,null,null,null,null,null,null,null,null,null,null,null,null,null,null,null,null,null,null,null,null,null,null,null,null,null,null,null,null,null,null,null,null,null,"Gabon",53,null,null,null,null,null,0,null,null,null,null,null,null,null,null,null,null,null,null,null,null,null,null,null,null,null,null,null,null,0,0,null,null,"Gabon",53,null,null,null,null,null,0,null,null,null,null,null,null,null,null,null,null,null,null,null,null,null,null,null,null,null,null,null,null,0,0]
[null,null,null,null,null,null,null,null,null,null,"ê",null,null,null,null,null,null,null,null,null,null,null,null,null,null,null,null,null,null,null,null,null,null,null,null,null,null,null,null,null,"Georgia",54,{"$f":"MOS_Table_3!AP62","v":0},{"$f":"MOS_Table_3!AQ62","v":0},{"$f":"SUM(MOS_Table_3!AR62,MOS_Table_3!AS62,MOS_Table_3!AT62)","v":0},0,{"$f":"MOS_Table_3!AW62","v":0},{"$f":"MOS_Table_3!AX62","v":0},{"$f":"SUM(MOS_Table_3!BB62,MOS_Table_3!BC62,MOS_Table_3!AY62)","v":0},{"$f":"SUM(MOS_Table_3!BE62:BG62)","v":0},{"$f":"MOS_Table_3!BD62","v":0},{"$f":"MOS_Table_3!BJ62","v":0},{"$f":"MOS_Table_3!BH62","v":0},{"$f":"MOS_Table_3!BM62","v":0},{"$f":"SUM(MOS_Table_3!AV62,MOS_Table_3!BP62,MOS_Table_3!BQ62)","v":0},0,null,null,"Georgia",54,{"$f":"MOS_Table_4!BH62","v":0},{"$f":"MOS_Table_4!BI62","v":0},{"$f":"MOS_Table_4!BJ62+MOS_Table_4!BK62+MOS_Table_4!BL62","v":0},0,{"$f":"MOS_Table_4!BO62","v":0},{"$f":"MOS_Table_4!BP62","v":0},{"$f":"MOS_Table_4!BT62+MOS_Table_4!BU62+MOS_Table_4!BQ62","v":0},{"$f":"MOS_Table_4!BW62+MOS_Table_4!BX62+MOS_Table_4!BY62","v":0},{"$f":"MOS_Table_4!BV62","v":0},{"$f":"MOS_Table_4!CB62","v":0},{"$f":"MOS_Table_4!BZ62","v":0},{"$f":"MOS_Table_4!CE62","v":0},{"$f":"MOS_Table_4!BN62+MOS_Table_4!CH62+MOS_Table_4!CI62","v":0},0,null,null,null,null,null,null,null,null,null,null,null,null,null,null,null,null,null,null,null,null,null,null,null,null,null,null,null,null,null,null,null,null,null,null,null,null,null,null,null,null,null,null,null,null,null,null,"Georgia",54,null,null,null,null,null,0,null,null,null,null,null,null,null,null,null,null,null,null,null,null,null,null,null,null,null,null,null,null,0,0,null,null,"Georgia",54,null,null,null,null,null,0,null,null,null,null,null,null,null,null,null,null,null,null,null,null,null,null,null,null,null,null,null,null,0,0]
[null,null,null,null,null,null,null,null,null,null," ",null,null,null,null,null,null,null,null,null,null,null,null,null,null,null,null,null,null,null,null,null,null,null,null,null,null,null,null,null,"Germany",55,{"$f":"MOS_Table_3!AP63","v":0},{"$f":"MOS_Table_3!AQ63","v":0},{"$f":"SUM(MOS_Table_3!AR63,MOS_Table_3!AS63,MOS_Table_3!AT63)","v":0},0,{"$f":"MOS_Table_3!AW63","v":0},{"$f":"MOS_Table_3!AX63","v":0},{"$f":"SUM(MOS_Table_3!BB63,MOS_Table_3!BC63,MOS_Table_3!AY63)","v":0},{"$f":"SUM(MOS_Table_3!BE63:BG63)","v":0},{"$f":"MOS_Table_3!BD63","v":0},{"$f":"MOS_Table_3!BJ63","v":0},{"$f":"MOS_Table_3!BH63","v":0},{"$f":"MOS_Table_3!BM63","v":0},{"$f":"SUM(MOS_Table_3!AV63,MOS_Table_3!BP63,MOS_Table_3!BQ63)","v":0},0,null,null,"Germany",55,{"$f":"MOS_Table_4!BH63","v":0},{"$f":"MOS_Table_4!BI63","v":0},{"$f":"MOS_Table_4!BJ63+MOS_Table_4!BK63+MOS_Table_4!BL63","v":0},0,{"$f":"MOS_Table_4!BO63","v":0},{"$f":"MOS_Table_4!BP63","v":0},{"$f":"MOS_Table_4!BT63+MOS_Table_4!BU63+MOS_Table_4!BQ63","v":0},{"$f":"MOS_Table_4!BW63+MOS_Table_4!BX63+MOS_Table_4!BY63","v":0},{"$f":"MOS_Table_4!BV63","v":0},{"$f":"MOS_Table_4!CB63","v":0},{"$f":"MOS_Table_4!BZ63","v":0},{"$f":"MOS_Table_4!CE63","v":0},{"$f":"MOS_Table_4!BN63+MOS_Table_4!CH63+MOS_Table_4!CI63","v":0},0,null,null,null,null,null,null,null,null,null,null,null,null,null,null,null,null,null,null,null,null,null,null,null,null,null,null,null,null,null,null,null,null,null,null,null,null,null,null,null,null,null,null,null,null,null,null,"Germany",55,null,null,null,null,null,0,null,null,null,null,null,null,null,null,null,null,null,null,null,null,null,null,null,null,null,null,null,null,0,0,null,null,"Germany",55,null,null,null,null,null,0,null,null,null,null,null,null,null,null,null,null,null,null,null,null,null,null,null,null,null,null,null,null,0,0]
[null,null,null,null,null,null,null,null,null,null,"ê",null,null,null,null,null,null,null,null,null,null,null,null,null,null,null,null,null,null,null,null,null,null,null,null,null,null,null,null,null,"Ghana",56,{"$f":"MOS_Table_3!AP64","v":0},{"$f":"MOS_Table_3!AQ64","v":0},{"$f":"SUM(MOS_Table_3!AR64,MOS_Table_3!AS64,MOS_Table_3!AT64)","v":0},0,{"$f":"MOS_Table_3!AW64","v":0},{"$f":"MOS_Table_3!AX64","v":0},{"$f":"SUM(MOS_Table_3!BB64,MOS_Table_3!BC64,MOS_Table_3!AY64)","v":0},{"$f":"SUM(MOS_Table_3!BE64:BG64)","v":0},{"$f":"MOS_Table_3!BD64","v":0},{"$f":"MOS_Table_3!BJ64","v":0},{"$f":"MOS_Table_3!BH64","v":0},{"$f":"MOS_Table_3!BM64","v":0},{"$f":"SUM(MOS_Table_3!AV64,MOS_Table_3!BP64,MOS_Table_3!BQ64)","v":0},0,null,null,"Ghana",56,{"$f":"MOS_Table_4!BH64","v":0},{"$f":"MOS_Table_4!BI64","v":0},{"$f":"MOS_Table_4!BJ64+MOS_Table_4!BK64+MOS_Table_4!BL64","v":0},0,{"$f":"MOS_Table_4!BO64","v":0},{"$f":"MOS_Table_4!BP64","v":0},{"$f":"MOS_Table_4!BT64+MOS_Table_4!BU64+MOS_Table_4!BQ64","v":0},{"$f":"MOS_Table_4!BW64+MOS_Table_4!BX64+MOS_Table_4!BY64","v":0},{"$f":"MOS_Table_4!BV64","v":0},{"$f":"MOS_Table_4!CB64","v":0},{"$f":"MOS_Table_4!BZ64","v":0},{"$f":"MOS_Table_4!CE64","v":0},{"$f":"MOS_Table_4!BN64+MOS_Table_4!CH64+MOS_Table_4!CI64","v":0},0,null,null,null,null,null,null,null,null,null,null,null,null,null,null,null,null,null,null,null,null,null,null,null,null,null,null,null,null,null,null,null,null,null,null,null,null,null,null,null,null,null,null,null,null,null,null,"Ghana",56,null,null,null,null,null,0,null,null,null,null,null,null,null,null,null,null,null,null,null,null,null,null,null,null,null,null,null,null,0,0,null,null,"Ghana",56,null,null,null,null,null,0,null,null,null,null,null,null,null,null,null,null,null,null,null,null,null,null,null,null,null,null,null,null,0,0]
[null,null,null,null,null,null,null,null,null,null," ",null,null,null,null,null,null,null,null,null,null,null,null,null,null,null,null,null,null,null,null,null,null,null,null,null,null,null,null,null,"Gibraltar",57,{"$f":"MOS_Table_3!AP65","v":0},{"$f":"MOS_Table_3!AQ65","v":0},{"$f":"SUM(MOS_Table_3!AR65,MOS_Table_3!AS65,MOS_Table_3!AT65)","v":0},0,{"$f":"MOS_Table_3!AW65","v":0},{"$f":"MOS_Table_3!AX65","v":0},{"$f":"SUM(MOS_Table_3!BB65,MOS_Table_3!BC65,MOS_Table_3!AY65)","v":0},{"$f":"SUM(MOS_Table_3!BE65:BG65)","v":0},{"$f":"MOS_Table_3!BD65","v":0},{"$f":"MOS_Table_3!BJ65","v":0},{"$f":"MOS_Table_3!BH65","v":0},{"$f":"MOS_Table_3!BM65","v":0},{"$f":"SUM(MOS_Table_3!AV65,MOS_Table_3!BP65,MOS_Table_3!BQ65)","v":0},0,null,null,"Gibraltar",57,{"$f":"MOS_Table_4!BH65","v":0},{"$f":"MOS_Table_4!BI65","v":0},{"$f":"MOS_Table_4!BJ65+MOS_Table_4!BK65+MOS_Table_4!BL65","v":0},0,{"$f":"MOS_Table_4!BO65","v":0},{"$f":"MOS_Table_4!BP65","v":0},{"$f":"MOS_Table_4!BT65+MOS_Table_4!BU65+MOS_Table_4!BQ65","v":0},{"$f":"MOS_Table_4!BW65+MOS_Table_4!BX65+MOS_Table_4!BY65","v":0},{"$f":"MOS_Table_4!BV65","v":0},{"$f":"MOS_Table_4!CB65","v":0},{"$f":"MOS_Table_4!BZ65","v":0},{"$f":"MOS_Table_4!CE65","v":0},{"$f":"MOS_Table_4!BN65+MOS_Table_4!CH65+MOS_Table_4!CI65","v":0},0,null,null,null,null,null,null,null,null,null,null,null,null,null,null,null,null,null,null,null,null,null,null,null,null,null,null,null,null,null,null,null,null,null,null,null,null,null,null,null,null,null,null,null,null,null,null,"Gibraltar",57,null,null,null,null,null,0,null,null,null,null,null,null,null,null,null,null,null,null,null,null,null,null,null,null,null,null,null,null,0,0,null,null,"Gibraltar",57,null,null,null,null,null,0,null,null,null,null,null,null,null,null,null,null,null,null,null,null,null,null,null,null,null,null,null,null,0,0]
[null,null,null,null,null,null,null,null,null,null,"ê",null,null,null,null,null,null,null,null,null,null,null,null,null,null,null,null,null,null,null,null,null,null,null,null,null,null,null,null,null,"Greece",58,{"$f":"MOS_Table_3!AP66","v":0},{"$f":"MOS_Table_3!AQ66","v":0},{"$f":"SUM(MOS_Table_3!AR66,MOS_Table_3!AS66,MOS_Table_3!AT66)","v":0},0,{"$f":"MOS_Table_3!AW66","v":0},{"$f":"MOS_Table_3!AX66","v":0},{"$f":"SUM(MOS_Table_3!BB66,MOS_Table_3!BC66,MOS_Table_3!AY66)","v":0},{"$f":"SUM(MOS_Table_3!BE66:BG66)","v":0},{"$f":"MOS_Table_3!BD66","v":0},{"$f":"MOS_Table_3!BJ66","v":0},{"$f":"MOS_Table_3!BH66","v":0},{"$f":"MOS_Table_3!BM66","v":0},{"$f":"SUM(MOS_Table_3!AV66,MOS_Table_3!BP66,MOS_Table_3!BQ66)","v":0},0,null,null,"Greece",58,{"$f":"MOS_Table_4!BH66","v":0},{"$f":"MOS_Table_4!BI66","v":0},{"$f":"MOS_Table_4!BJ66+MOS_Table_4!BK66+MOS_Table_4!BL66","v":0},0,{"$f":"MOS_Table_4!BO66","v":0},{"$f":"MOS_Table_4!BP66","v":0},{"$f":"MOS_Table_4!BT66+MOS_Table_4!BU66+MOS_Table_4!BQ66","v":0},{"$f":"MOS_Table_4!BW66+MOS_Table_4!BX66+MOS_Table_4!BY66","v":0},{"$f":"MOS_Table_4!BV66","v":0},{"$f":"MOS_Table_4!CB66","v":0},{"$f":"MOS_Table_4!BZ66","v":0},{"$f":"MOS_Table_4!CE66","v":0},{"$f":"MOS_Table_4!BN66+MOS_Table_4!CH66+MOS_Table_4!CI66","v":0},0,null,null,null,null,null,null,null,null,null,null,null,null,null,null,null,null,null,null,null,null,null,null,null,null,null,null,null,null,null,null,null,null,null,null,null,null,null,null,null,null,null,null,null,null,null,null,"Greece",58,null,null,null,null,null,0,null,null,null,null,null,null,null,null,null,null,null,null,null,null,null,null,null,null,null,null,null,null,0,0,null,null,"Greece",58,null,null,null,null,null,0,null,null,null,null,null,null,null,null,null,null,null,null,null,null,null,null,null,null,null,null,null,null,0,0]
[null,null,null,null,null,null,null,null,null,null," ",null,null,null,null,null,null,null,null,null,null,null,null,null,null,null,null,null,null,null,null,null,null,null,null,null,null,null,null,null,"Guatemala",59,{"$f":"MOS_Table_3!AP67","v":0},{"$f":"MOS_Table_3!AQ67","v":0},{"$f":"SUM(MOS_Table_3!AR67,MOS_Table_3!AS67,MOS_Table_3!AT67)","v":0},0,{"$f":"MOS_Table_3!AW67","v":0},{"$f":"MOS_Table_3!AX67","v":0},{"$f":"SUM(MOS_Table_3!BB67,MOS_Table_3!BC67,MOS_Table_3!AY67)","v":0},{"$f":"SUM(MOS_Table_3!BE67:BG67)","v":0},{"$f":"MOS_Table_3!BD67","v":0},{"$f":"MOS_Table_3!BJ67","v":0},{"$f":"MOS_Table_3!BH67","v":0},{"$f":"MOS_Table_3!BM67","v":0},{"$f":"SUM(MOS_Table_3!AV67,MOS_Table_3!BP67,MOS_Table_3!BQ67)","v":0},0,null,null,"Guatemala",59,{"$f":"MOS_Table_4!BH67","v":0},{"$f":"MOS_Table_4!BI67","v":0},{"$f":"MOS_Table_4!BJ67+MOS_Table_4!BK67+MOS_Table_4!BL67","v":0},0,{"$f":"MOS_Table_4!BO67","v":0},{"$f":"MOS_Table_4!BP67","v":0},{"$f":"MOS_Table_4!BT67+MOS_Table_4!BU67+MOS_Table_4!BQ67","v":0},{"$f":"MOS_Table_4!BW67+MOS_Table_4!BX67+MOS_Table_4!BY67","v":0},{"$f":"MOS_Table_4!BV67","v":0},{"$f":"MOS_Table_4!CB67","v":0},{"$f":"MOS_Table_4!BZ67","v":0},{"$f":"MOS_Table_4!CE67","v":0},{"$f":"MOS_Table_4!BN67+MOS_Table_4!CH67+MOS_Table_4!CI67","v":0},0,null,null,null,null,null,null,null,null,null,null,null,null,null,null,null,null,null,null,null,null,null,null,null,null,null,null,null,null,null,null,null,null,null,null,null,null,null,null,null,null,null,null,null,null,null,null,"Guatemala",59,null,null,null,null,null,0,null,null,null,null,null,null,null,null,null,null,null,null,null,null,null,null,null,null,null,null,null,null,0,0,null,null,"Guatemala",59,null,null,null,null,null,0,null,null,null,null,null,null,null,null,null,null,null,null,null,null,null,null,null,null,null,null,null,null,0,0]
[null,null,null,null,null,null,null,null,null,null,"ê",null,null,null,null,null,null,null,null,null,null,null,null,null,null,null,null,null,null,null,null,null,null,null,null,null,null,null,null,null,"Guinea-Bissau",60,{"$f":"MOS_Table_3!AP68","v":0},{"$f":"MOS_Table_3!AQ68","v":0},{"$f":"SUM(MOS_Table_3!AR68,MOS_Table_3!AS68,MOS_Table_3!AT68)","v":0},0,{"$f":"MOS_Table_3!AW68","v":0},{"$f":"MOS_Table_3!AX68","v":0},{"$f":"SUM(MOS_Table_3!BB68,MOS_Table_3!BC68,MOS_Table_3!AY68)","v":0},{"$f":"SUM(MOS_Table_3!BE68:BG68)","v":0},{"$f":"MOS_Table_3!BD68","v":0},{"$f":"MOS_Table_3!BJ68","v":0},{"$f":"MOS_Table_3!BH68","v":0},{"$f":"MOS_Table_3!BM68","v":0},{"$f":"SUM(MOS_Table_3!AV68,MOS_Table_3!BP68,MOS_Table_3!BQ68)","v":0},0,null,null,"Guinea-Bissau",60,{"$f":"MOS_Table_4!BH68","v":0},{"$f":"MOS_Table_4!BI68","v":0},{"$f":"MOS_Table_4!BJ68+MOS_Table_4!BK68+MOS_Table_4!BL68","v":0},0,{"$f":"MOS_Table_4!BO68","v":0},{"$f":"MOS_Table_4!BP68","v":0},{"$f":"MOS_Table_4!BT68+MOS_Table_4!BU68+MOS_Table_4!BQ68","v":0},{"$f":"MOS_Table_4!BW68+MOS_Table_4!BX68+MOS_Table_4!BY68","v":0},{"$f":"MOS_Table_4!BV68","v":0},{"$f":"MOS_Table_4!CB68","v":0},{"$f":"MOS_Table_4!BZ68","v":0},{"$f":"MOS_Table_4!CE68","v":0},{"$f":"MOS_Table_4!BN68+MOS_Table_4!CH68+MOS_Table_4!CI68","v":0},0,null,null,null,null,null,null,null,null,null,null,null,null,null,null,null,null,null,null,null,null,null,null,null,null,null,null,null,null,null,null,null,null,null,null,null,null,null,null,null,null,null,null,null,null,null,null,"Guinea-Bissau",60,null,null,null,null,null,0,null,null,null,null,null,null,null,null,null,null,null,null,null,null,null,null,null,null,null,null,null,null,0,0,null,null,"Guinea-Bissau",60,null,null,null,null,null,0,null,null,null,null,null,null,null,null,null,null,null,null,null,null,null,null,null,null,null,null,null,null,0,0]
[null,null,null,null,null,null,null,null,null,null," ",null,null,null,null,null,null,null,null,null,null,null,null,null,null,null,null,null,null,null,null,null,null,null,null,null,null,null,null,null,"Honduras",61,{"$f":"MOS_Table_3!AP69","v":0},{"$f":"MOS_Table_3!AQ69","v":0},{"$f":"SUM(MOS_Table_3!AR69,MOS_Table_3!AS69,MOS_Table_3!AT69)","v":0},0,{"$f":"MOS_Table_3!AW69","v":0},{"$f":"MOS_Table_3!AX69","v":0},{"$f":"SUM(MOS_Table_3!BB69,MOS_Table_3!BC69,MOS_Table_3!AY69)","v":0},{"$f":"SUM(MOS_Table_3!BE69:BG69)","v":0},{"$f":"MOS_Table_3!BD69","v":0},{"$f":"MOS_Table_3!BJ69","v":0},{"$f":"MOS_Table_3!BH69","v":0},{"$f":"MOS_Table_3!BM69","v":0},{"$f":"SUM(MOS_Table_3!AV69,MOS_Table_3!BP69,MOS_Table_3!BQ69)","v":0},0,null,null,"Honduras",61,{"$f":"MOS_Table_4!BH69","v":0},{"$f":"MOS_Table_4!BI69","v":0},{"$f":"MOS_Table_4!BJ69+MOS_Table_4!BK69+MOS_Table_4!BL69","v":0},0,{"$f":"MOS_Table_4!BO69","v":0},{"$f":"MOS_Table_4!BP69","v":0},{"$f":"MOS_Table_4!BT69+MOS_Table_4!BU69+MOS_Table_4!BQ69","v":0},{"$f":"MOS_Table_4!BW69+MOS_Table_4!BX69+MOS_Table_4!BY69","v":0},{"$f":"MOS_Table_4!BV69","v":0},{"$f":"MOS_Table_4!CB69","v":0},{"$f":"MOS_Table_4!BZ69","v":0},{"$f":"MOS_Table_4!CE69","v":0},{"$f":"MOS_Table_4!BN69+MOS_Table_4!CH69+MOS_Table_4!CI69","v":0},0,null,null,null,null,null,null,null,null,null,null,null,null,null,null,null,null,null,null,null,null,null,null,null,null,null,null,null,null,null,null,null,null,null,null,null,null,null,null,null,null,null,null,null,null,null,null,"Honduras",61,null,null,null,null,null,0,null,null,null,null,null,null,null,null,null,null,null,null,null,null,null,null,null,null,null,null,null,null,0,0,null,null,"Honduras",61,null,null,null,null,null,0,null,null,null,null,null,null,null,null,null,null,null,null,null,null,null,null,null,null,null,null,null,null,0,0]
[null,null,null,null,null,null,null,null,null,null,"ê",null,null,null,null,null,null,null,null,null,null,null,null,null,null,null,null,null,null,null,null,null,null,null,null,null,null,null,null,null,"Hong Kong, China",62,{"$f":"MOS_Table_3!AP70","v":0},{"$f":"MOS_Table_3!AQ70","v":0},{"$f":"SUM(MOS_Table_3!AR70,MOS_Table_3!AS70,MOS_Table_3!AT70)","v":0},0,{"$f":"MOS_Table_3!AW70","v":0},{"$f":"MOS_Table_3!AX70","v":0},{"$f":"SUM(MOS_Table_3!BB70,MOS_Table_3!BC70,MOS_Table_3!AY70)","v":0},{"$f":"SUM(MOS_Table_3!BE70:BG70)","v":0},{"$f":"MOS_Table_3!BD70","v":0},{"$f":"MOS_Table_3!BJ70","v":0},{"$f":"MOS_Table_3!BH70","v":0},{"$f":"MOS_Table_3!BM70","v":0},{"$f":"SUM(MOS_Table_3!AV70,MOS_Table_3!BP70,MOS_Table_3!BQ70)","v":0},0,null,null,"Hong Kong, China",62,{"$f":"MOS_Table_4!BH70","v":0},{"$f":"MOS_Table_4!BI70","v":0},{"$f":"MOS_Table_4!BJ70+MOS_Table_4!BK70+MOS_Table_4!BL70","v":0},0,{"$f":"MOS_Table_4!BO70","v":0},{"$f":"MOS_Table_4!BP70","v":0},{"$f":"MOS_Table_4!BT70+MOS_Table_4!BU70+MOS_Table_4!BQ70","v":0},{"$f":"MOS_Table_4!BW70+MOS_Table_4!BX70+MOS_Table_4!BY70","v":0},{"$f":"MOS_Table_4!BV70","v":0},{"$f":"MOS_Table_4!CB70","v":0},{"$f":"MOS_Table_4!BZ70","v":0},{"$f":"MOS_Table_4!CE70","v":0},{"$f":"MOS_Table_4!BN70+MOS_Table_4!CH70+MOS_Table_4!CI70","v":0},0,null,null,null,null,null,null,null,null,null,null,null,null,null,null,null,null,null,null,null,null,null,null,null,null,null,null,null,null,null,null,null,null,null,null,null,null,null,null,null,null,null,null,null,null,null,null,"Hong Kong, China",62,null,null,null,null,null,0,null,null,null,null,null,null,null,null,null,null,null,null,null,null,null,null,null,null,null,null,null,null,0,0,null,null,"Hong Kong, China",62,null,null,null,null,null,0,null,null,null,null,null,null,null,null,null,null,null,null,null,null,null,null,null,null,null,null,null,null,0,0]
[null,null,null,null,null,null,null,null,null,null," ",null,null,null,null,null,null,null,null,null,null,null,null,null,null,null,null,null,null,null,null,null,null,null,null,null,null,null,null,null,"Hungary",63,{"$f":"MOS_Table_3!AP71","v":0},{"$f":"MOS_Table_3!AQ71","v":0},{"$f":"SUM(MOS_Table_3!AR71,MOS_Table_3!AS71,MOS_Table_3!AT71)","v":0},0,{"$f":"MOS_Table_3!AW71","v":0},{"$f":"MOS_Table_3!AX71","v":0},{"$f":"SUM(MOS_Table_3!BB71,MOS_Table_3!BC71,MOS_Table_3!AY71)","v":0},{"$f":"SUM(MOS_Table_3!BE71:BG71)","v":0},{"$f":"MOS_Table_3!BD71","v":0},{"$f":"MOS_Table_3!BJ71","v":0},{"$f":"MOS_Table_3!BH71","v":0},{"$f":"MOS_Table_3!BM71","v":0},{"$f":"SUM(MOS_Table_3!AV71,MOS_Table_3!BP71,MOS_Table_3!BQ71)","v":0},0,null,null,"Hungary",63,{"$f":"MOS_Table_4!BH71","v":0},{"$f":"MOS_Table_4!BI71","v":0},{"$f":"MOS_Table_4!BJ71+MOS_Table_4!BK71+MOS_Table_4!BL71","v":0},0,{"$f":"MOS_Table_4!BO71","v":0},{"$f":"MOS_Table_4!BP71","v":0},{"$f":"MOS_Table_4!BT71+MOS_Table_4!BU71+MOS_Table_4!BQ71","v":0},{"$f":"MOS_Table_4!BW71+MOS_Table_4!BX71+MOS_Table_4!BY71","v":0},{"$f":"MOS_Table_4!BV71","v":0},{"$f":"MOS_Table_4!CB71","v":0},{"$f":"MOS_Table_4!BZ71","v":0},{"$f":"MOS_Table_4!CE71","v":0},{"$f":"MOS_Table_4!BN71+MOS_Table_4!CH71+MOS_Table_4!CI71","v":0},0,null,null,null,null,null,null,null,null,null,null,null,null,null,null,null,null,null,null,null,null,null,null,null,null,null,null,null,null,null,null,null,null,null,null,null,null,null,null,null,null,null,null,null,null,null,null,"Hungary",63,null,null,null,null,null,0,null,null,null,null,null,null,null,null,null,null,null,null,null,null,null,null,null,null,null,null,null,null,0,0,null,null,"Hungary",63,null,null,null,null,null,0,null,null,null,null,null,null,null,null,null,null,null,null,null,null,null,null,null,null,null,null,null,null,0,0]
[null,null,null,null,null,null,null,null,null,null,"ê",null,null,null,null,null,null,null,null,null,null,null,null,null,null,null,null,null,null,null,null,null,null,null,null,null,null,null,null,null,"Iceland",64,{"$f":"MOS_Table_3!AP72","v":0},{"$f":"MOS_Table_3!AQ72","v":0},{"$f":"SUM(MOS_Table_3!AR72,MOS_Table_3!AS72,MOS_Table_3!AT72)","v":0},0,{"$f":"MOS_Table_3!AW72","v":0},{"$f":"MOS_Table_3!AX72","v":0},{"$f":"SUM(MOS_Table_3!BB72,MOS_Table_3!BC72,MOS_Table_3!AY72)","v":0},{"$f":"SUM(MOS_Table_3!BE72:BG72)","v":0},{"$f":"MOS_Table_3!BD72","v":0},{"$f":"MOS_Table_3!BJ72","v":0},{"$f":"MOS_Table_3!BH72","v":0},{"$f":"MOS_Table_3!BM72","v":0},{"$f":"SUM(MOS_Table_3!AV72,MOS_Table_3!BP72,MOS_Table_3!BQ72)","v":0},0,null,null,"Iceland",64,{"$f":"MOS_Table_4!BH72","v":0},{"$f":"MOS_Table_4!BI72","v":0},{"$f":"MOS_Table_4!BJ72+MOS_Table_4!BK72+MOS_Table_4!BL72","v":0},0,{"$f":"MOS_Table_4!BO72","v":0},{"$f":"MOS_Table_4!BP72","v":0},{"$f":"MOS_Table_4!BT72+MOS_Table_4!BU72+MOS_Table_4!BQ72","v":0},{"$f":"MOS_Table_4!BW72+MOS_Table_4!BX72+MOS_Table_4!BY72","v":0},{"$f":"MOS_Table_4!BV72","v":0},{"$f":"MOS_Table_4!CB72","v":0},{"$f":"MOS_Table_4!BZ72","v":0},{"$f":"MOS_Table_4!CE72","v":0},{"$f":"MOS_Table_4!BN72+MOS_Table_4!CH72+MOS_Table_4!CI72","v":0},0,null,null,null,null,null,null,null,null,null,null,null,null,null,null,null,null,null,null,null,null,null,null,null,null,null,null,null,null,null,null,null,null,null,null,null,null,null,null,null,null,null,null,null,null,null,null,"Iceland",64,null,null,null,null,null,0,null,null,null,null,null,null,null,null,null,null,null,null,null,null,null,null,null,null,null,null,null,null,0,0,null,null,"Iceland",64,null,null,null,null,null,0,null,null,null,null,null,null,null,null,null,null,null,null,null,null,null,null,null,null,null,null,null,null,0,0]
[null,null,null,null,null,null,null,null,null,null," ",null,null,null,null,null,null,null,null,null,null,null,null,null,null,null,null,null,null,null,null,null,null,null,null,null,null,null,null,null,"India",65,{"$f":"MOS_Table_3!AP73","v":0},{"$f":"MOS_Table_3!AQ73","v":0},{"$f":"SUM(MOS_Table_3!AR73,MOS_Table_3!AS73,MOS_Table_3!AT73)","v":0},0,{"$f":"MOS_Table_3!AW73","v":0},{"$f":"MOS_Table_3!AX73","v":0},{"$f":"SUM(MOS_Table_3!BB73,MOS_Table_3!BC73,MOS_Table_3!AY73)","v":0},{"$f":"SUM(MOS_Table_3!BE73:BG73)","v":0},{"$f":"MOS_Table_3!BD73","v":0},{"$f":"MOS_Table_3!BJ73","v":0},{"$f":"MOS_Table_3!BH73","v":0},{"$f":"MOS_Table_3!BM73","v":0},{"$f":"SUM(MOS_Table_3!AV73,MOS_Table_3!BP73,MOS_Table_3!BQ73)","v":0},0,null,null,"India",65,{"$f":"MOS_Table_4!BH73","v":0},{"$f":"MOS_Table_4!BI73","v":0},{"$f":"MOS_Table_4!BJ73+MOS_Table_4!BK73+MOS_Table_4!BL73","v":0},0,{"$f":"MOS_Table_4!BO73","v":0},{"$f":"MOS_Table_4!BP73","v":0},{"$f":"MOS_Table_4!BT73+MOS_Table_4!BU73+MOS_Table_4!BQ73","v":0},{"$f":"MOS_Table_4!BW73+MOS_Table_4!BX73+MOS_Table_4!BY73","v":0},{"$f":"MOS_Table_4!BV73","v":0},{"$f":"MOS_Table_4!CB73","v":0},{"$f":"MOS_Table_4!BZ73","v":0},{"$f":"MOS_Table_4!CE73","v":0},{"$f":"MOS_Table_4!BN73+MOS_Table_4!CH73+MOS_Table_4!CI73","v":0},0,null,null,null,null,null,null,null,null,null,null,null,null,null,null,null,null,null,null,null,null,null,null,null,null,null,null,null,null,null,null,null,null,null,null,null,null,null,null,null,null,null,null,null,null,null,null,"India",65,null,null,null,null,null,0,null,null,null,null,null,null,null,null,null,null,null,null,null,null,null,null,null,null,null,null,null,null,0,0,null,null,"India",65,null,null,null,null,null,0,null,null,null,null,null,null,null,null,null,null,null,null,null,null,null,null,null,null,null,null,null,null,0,0]
[null,null,null,null,null,null,null,null,null,null,"ê",null,null,null,null,null,null,null,null,null,null,null,null,null,null,null,null,null,null,null,null,null,null,null,null,null,null,null,null,null,"Indonesia",66,{"$f":"MOS_Table_3!AP74","v":0},{"$f":"MOS_Table_3!AQ74","v":0},{"$f":"SUM(MOS_Table_3!AR74,MOS_Table_3!AS74,MOS_Table_3!AT74)","v":0},{"$f":"SUM(AQ77:AS77)","v":0},{"$f":"MOS_Table_3!AW74","v":0},{"$f":"MOS_Table_3!AX74","v":0},{"$f":"SUM(MOS_Table_3!BB74,MOS_Table_3!BC74,MOS_Table_3!AY74)","v":0},{"$f":"SUM(MOS_Table_3!BE74:BG74)","v":0},{"$f":"MOS_Table_3!BD74","v":0},{"$f":"MOS_Table_3!BJ74","v":0},{"$f":"MOS_Table_3!BH74","v":0},{"$f":"MOS_Table_3!BM74","v":0},{"$f":"SUM(MOS_Table_3!AV74,MOS_Table_3!BP74,MOS_Table_3!BQ74)","v":0},{"$f":"SUM(AU77:BC77)-AY77-BA77","v":0},null,null,"Indonesia",66,{"$f":"MOS_Table_4!BH74","v":0},{"$f":"MOS_Table_4!BI74","v":0},{"$f":"MOS_Table_4!BJ74+MOS_Table_4!BK74+MOS_Table_4!BL74","v":0},{"$f":"SUM(BI77:BK77)","v":0},{"$f":"MOS_Table_4!BO74","v":0},{"$f":"MOS_Table_4!BP74","v":0},{"$f":"MOS_Table_4!BT74+MOS_Table_4!BU74+MOS_Table_4!BQ74","v":0},{"$f":"MOS_Table_4!BW74+MOS_Table_4!BX74+MOS_Table_4!BY74","v":0},{"$f":"MOS_Table_4!BV74","v":0},{"$f":"MOS_Table_4!CB74","v":0},{"$f":"MOS_Table_4!BZ74","v":0},{"$f":"MOS_Table_4!CE74","v":0},{"$f":"MOS_Table_4!BN74+MOS_Table_4!CH74+MOS_Table_4!CI74","v":0},{"$f":"+BM77+BN77+BO77+BP77+BR77+BT77+BU77","v":0},null,null,null,null,null,null,null,null,null,null,null,null,null,null,null,null,null,null,null,null,null,null,null,null,null,null,null,null,null,null,null,null,null,null,null,null,null,null,null,null,null,null,null,null,null,null,"Indonesia",66,null,null,null,null,null,0,null,null,null,null,null,null,null,null,null,null,null,null,null,null,null,null,null,null,null,null,null,null,{"$f":"SUM(DY77:EB77,EE77:EG77,EJ77,EM77,EP77,ES77:ET77)","v":0},{"$f":"SUM(DX77,EU77)","v":0},null,null,"Indonesia",66,null,null,null,null,null,{"$f":"SUM(FA77:FE77)","v":0},null,null,null,null,null,null,null,null,null,null,null,null,null,null,null,null,null,null,null,null,null,null,{"$f":"SUM(FG77:FI77,FJ77,FM77:FO77,FR77,FU77,FX77,GA77:GB77)","v":0},{"$f":"SUM(FF77,GC77)","v":0}]
[null,null,null,null,null,null,null,null,null,null," ",null,null,null,null,null,null,null,null,null,null,null,null,null,null,null,null,null,null,null,null,null,null,null,null,null,null,null,null,null,"Iran, Islamic Republic of",67,{"$f":"MOS_Table_3!AP75","v":0},{"$f":"MOS_Table_3!AQ75","v":0},{"$f":"SUM(MOS_Table_3!AR75,MOS_Table_3!AS75,MOS_Table_3!AT75)","v":0},0,{"$f":"MOS_Table_3!AW75","v":0},{"$f":"MOS_Table_3!AX75","v":0},{"$f":"SUM(MOS_Table_3!BB75,MOS_Table_3!BC75,MOS_Table_3!AY75)","v":0},{"$f":"SUM(MOS_Table_3!BE75:BG75)","v":0},{"$f":"MOS_Table_3!BD75","v":0},{"$f":"MOS_Table_3!BJ75","v":0},{"$f":"MOS_Table_3!BH75","v":0},{"$f":"MOS_Table_3!BM75","v":0},{"$f":"SUM(MOS_Table_3!AV75,MOS_Table_3!BP75,MOS_Table_3!BQ75)","v":0},0,null,null,"Iran, Islamic Republic of",67,{"$f":"MOS_Table_4!BH75","v":0},{"$f":"MOS_Table_4!BI75","v":0},{"$f":"MOS_Table_4!BJ75+MOS_Table_4!BK75+MOS_Table_4!BL75","v":0},0,{"$f":"MOS_Table_4!BO75","v":0},{"$f":"MOS_Table_4!BP75","v":0},{"$f":"MOS_Table_4!BT75+MOS_Table_4!BU75+MOS_Table_4!BQ75","v":0},{"$f":"MOS_Table_4!BW75+MOS_Table_4!BX75+MOS_Table_4!BY75","v":0},{"$f":"MOS_Table_4!BV75","v":0},{"$f":"MOS_Table_4!CB75","v":0},{"$f":"MOS_Table_4!BZ75","v":0},{"$f":"MOS_Table_4!CE75","v":0},{"$f":"MOS_Table_4!BN75+MOS_Table_4!CH75+MOS_Table_4!CI75","v":0},0,null,null,null,null,null,null,null,null,null,null,null,null,null,null,null,null,null,null,null,null,null,null,null,null,null,null,null,null,null,null,null,null,null,null,null,null,null,null,null,null,null,null,null,null,null,null,"Iran, Islamic Republic of",67,null,null,null,null,null,0,null,null,null,null,null,null,null,null,null,null,null,null,null,null,null,null,null,null,null,null,null,null,0,0,null,null,"Iran, Islamic Republic of",67,null,null,null,null,null,0,null,null,null,null,null,null,null,null,null,null,null,null,null,null,null,null,null,null,null,null,null,null,0,0]
[null,null,null,null,null,null,null,null,null,null,"ê",null,null,null,null,null,null,null,null,null,null,null,null,null,null,null,null,null,null,null,null,null,null,null,null,null,null,null,null,null,"Iraq",68,{"$f":"MOS_Table_3!AP76","v":0},{"$f":"MOS_Table_3!AQ76","v":0},{"$f":"SUM(MOS_Table_3!AR76,MOS_Table_3!AS76,MOS_Table_3!AT76)","v":0},0,{"$f":"MOS_Table_3!AW76","v":0},{"$f":"MOS_Table_3!AX76","v":0},{"$f":"SUM(MOS_Table_3!BB76,MOS_Table_3!BC76,MOS_Table_3!AY76)","v":0},{"$f":"SUM(MOS_Table_3!BE76:BG76)","v":0},{"$f":"MOS_Table_3!BD76","v":0},{"$f":"MOS_Table_3!BJ76","v":0},{"$f":"MOS_Table_3!BH76","v":0},{"$f":"MOS_Table_3!BM76","v":0},{"$f":"SUM(MOS_Table_3!AV76,MOS_Table_3!BP76,MOS_Table_3!BQ76)","v":0},0,null,null,"Iraq",68,{"$f":"MOS_Table_4!BH76","v":0},{"$f":"MOS_Table_4!BI76","v":0},{"$f":"MOS_Table_4!BJ76+MOS_Table_4!BK76+MOS_Table_4!BL76","v":0},0,{"$f":"MOS_Table_4!BO76","v":0},{"$f":"MOS_Table_4!BP76","v":0},{"$f":"MOS_Table_4!BT76+MOS_Table_4!BU76+MOS_Table_4!BQ76","v":0},{"$f":"MOS_Table_4!BW76+MOS_Table_4!BX76+MOS_Table_4!BY76","v":0},{"$f":"MOS_Table_4!BV76","v":0},{"$f":"MOS_Table_4!CB76","v":0},{"$f":"MOS_Table_4!BZ76","v":0},{"$f":"MOS_Table_4!CE76","v":0},{"$f":"MOS_Table_4!BN76+MOS_Table_4!CH76+MOS_Table_4!CI76","v":0},0,null,null,null,null,null,null,null,null,null,null,null,null,null,null,null,null,null,null,null,null,null,null,null,null,null,null,null,null,null,null,null,null,null,null,null,null,null,null,null,null,null,null,null,null,null,null,"Iraq",68,null,null,null,null,null,0,null,null,null,null,null,null,null,null,null,null,null,null,null,null,null,null,null,null,null,null,null,null,0,0,null,null,"Iraq",68,null,null,null,null,null,0,null,null,null,null,null,null,null,null,null,null,null,null,null,null,null,null,null,null,null,null,null,null,0,0]
[null,null,null,null,null,null,null,null,null,null," ",null,null,null,null,null,null,null,null,null,null,null,null,null,null,null,null,null,null,null,null,null,null,null,null,null,null,null,null,null,"Ireland",69,{"$f":"MOS_Table_3!AP77","v":0},{"$f":"MOS_Table_3!AQ77","v":0},{"$f":"SUM(MOS_Table_3!AR77,MOS_Table_3!AS77,MOS_Table_3!AT77)","v":0},0,{"$f":"MOS_Table_3!AW77","v":0},{"$f":"MOS_Table_3!AX77","v":0},{"$f":"SUM(MOS_Table_3!BB77,MOS_Table_3!BC77,MOS_Table_3!AY77)","v":0},{"$f":"SUM(MOS_Table_3!BE77:BG77)","v":0},{"$f":"MOS_Table_3!BD77","v":0},{"$f":"MOS_Table_3!BJ77","v":0},{"$f":"MOS_Table_3!BH77","v":0},{"$f":"MOS_Table_3!BM77","v":0},{"$f":"SUM(MOS_Table_3!AV77,MOS_Table_3!BP77,MOS_Table_3!BQ77)","v":0},0,null,null,"Ireland",69,{"$f":"MOS_Table_4!BH77","v":0},{"$f":"MOS_Table_4!BI77","v":0},{"$f":"MOS_Table_4!BJ77+MOS_Table_4!BK77+MOS_Table_4!BL77","v":0},0,{"$f":"MOS_Table_4!BO77","v":0},{"$f":"MOS_Table_4!BP77","v":0},{"$f":"MOS_Table_4!BT77+MOS_Table_4!BU77+MOS_Table_4!BQ77","v":0},{"$f":"MOS_Table_4!BW77+MOS_Table_4!BX77+MOS_Table_4!BY77","v":0},{"$f":"MOS_Table_4!BV77","v":0},{"$f":"MOS_Table_4!CB77","v":0},{"$f":"MOS_Table_4!BZ77","v":0},{"$f":"MOS_Table_4!CE77","v":0},{"$f":"MOS_Table_4!BN77+MOS_Table_4!CH77+MOS_Table_4!CI77","v":0},0,null,null,null,null,null,null,null,null,null,null,null,null,null,null,null,null,null,null,null,null,null,null,null,null,null,null,null,null,null,null,null,null,null,null,null,null,null,null,null,null,null,null,null,null,null,null,"Ireland",69,null,null,null,null,null,{"$f":"SUM(DS80:DW80)","v":0},null,null,null,null,null,null,null,null,null,null,null,null,null,null,null,null,null,null,null,null,null,null,0,0,null,null,"Ireland",69,null,null,null,null,null,0,null,null,null,null,null,null,null,null,null,null,null,null,null,null,null,null,null,null,null,null,null,null,0,0]
[null,null,null,null,null,null,null,null,null,null,"ê",null,null,null,null,null,null,null,null,null,null,null,null,null,null,null,null,null,null,null,null,null,null,null,null,null,null,null,null,null,"Israel",70,{"$f":"MOS_Table_3!AP78","v":0},{"$f":"MOS_Table_3!AQ78","v":0},{"$f":"SUM(MOS_Table_3!AR78,MOS_Table_3!AS78,MOS_Table_3!AT78)","v":0},0,{"$f":"MOS_Table_3!AW78","v":0},{"$f":"MOS_Table_3!AX78","v":0},{"$f":"SUM(MOS_Table_3!BB78,MOS_Table_3!BC78,MOS_Table_3!AY78)","v":0},{"$f":"SUM(MOS_Table_3!BE78:BG78)","v":0},{"$f":"MOS_Table_3!BD78","v":0},{"$f":"MOS_Table_3!BJ78","v":0},{"$f":"MOS_Table_3!BH78","v":0},{"$f":"MOS_Table_3!BM78","v":0},{"$f":"SUM(MOS_Table_3!AV78,MOS_Table_3!BP78,MOS_Table_3!BQ78)","v":0},0,null,null,"Israel",70,{"$f":"MOS_Table_4!BH78","v":0},{"$f":"MOS_Table_4!BI78","v":0},{"$f":"MOS_Table_4!BJ78+MOS_Table_4!BK78+MOS_Table_4!BL78","v":0},0,{"$f":"MOS_Table_4!BO78","v":0},{"$f":"MOS_Table_4!BP78","v":0},{"$f":"MOS_Table_4!BT78+MOS_Table_4!BU78+MOS_Table_4!BQ78","v":0},{"$f":"MOS_Table_4!BW78+MOS_Table_4!BX78+MOS_Table_4!BY78","v":0},{"$f":"MOS_Table_4!BV78","v":0},{"$f":"MOS_Table_4!CB78","v":0},{"$f":"MOS_Table_4!BZ78","v":0},{"$f":"MOS_Table_4!CE78","v":0},{"$f":"MOS_Table_4!BN78+MOS_Table_4!CH78+MOS_Table_4!CI78","v":0},0,null,null,null,null,null,null,null,null,null,null,null,null,null,null,null,null,null,null,null,null,null,null,null,null,null,null,null,null,null,null,null,null,null,null,null,null,null,null,null,null,null,null,null,null,null,null,"Israel",70,null,null,null,null,null,0,null,null,null,null,null,null,null,null,null,null,null,null,null,null,null,null,null,null,null,null,null,null,0,0,null,null,"Israel",70,null,null,null,null,null,0,null,null,null,null,null,null,null,null,null,null,null,null,null,null,null,null,null,null,null,null,null,null,0,0]
[null,null,null,null,null,null,null,null,null,null," ",null,null,null,null,null,null,null,null,null,null,null,null,null,null,null,null,null,null,null,null,null,null,null,null,null,null,null,null,null,"Italy",71,{"$f":"MOS_Table_3!AP79","v":0},{"$f":"MOS_Table_3!AQ79","v":0},{"$f":"SUM(MOS_Table_3!AR79,MOS_Table_3!AS79,MOS_Table_3!AT79)","v":0},0,{"$f":"MOS_Table_3!AW79","v":0},{"$f":"MOS_Table_3!AX79","v":0},{"$f":"SUM(MOS_Table_3!BB79,MOS_Table_3!BC79,MOS_Table_3!AY79)","v":0},{"$f":"SUM(MOS_Table_3!BE79:BG79)","v":0},{"$f":"MOS_Table_3!BD79","v":0},{"$f":"MOS_Table_3!BJ79","v":0},{"$f":"MOS_Table_3!BH79","v":0},{"$f":"MOS_Table_3!BM79","v":0},{"$f":"SUM(MOS_Table_3!AV79,MOS_Table_3!BP79,MOS_Table_3!BQ79)","v":0},0,null,null,"Italy",71,{"$f":"MOS_Table_4!BH79","v":0},{"$f":"MOS_Table_4!BI79","v":0},{"$f":"MOS_Table_4!BJ79+MOS_Table_4!BK79+MOS_Table_4!BL79","v":0},0,{"$f":"MOS_Table_4!BO79","v":0},{"$f":"MOS_Table_4!BP79","v":0},{"$f":"MOS_Table_4!BT79+MOS_Table_4!BU79+MOS_Table_4!BQ79","v":0},{"$f":"MOS_Table_4!BW79+MOS_Table_4!BX79+MOS_Table_4!BY79","v":0},{"$f":"MOS_Table_4!BV79","v":0},{"$f":"MOS_Table_4!CB79","v":0},{"$f":"MOS_Table_4!BZ79","v":0},{"$f":"MOS_Table_4!CE79","v":0},{"$f":"MOS_Table_4!BN79+MOS_Table_4!CH79+MOS_Table_4!CI79","v":0},0,null,null,null,null,null,null,null,null,null,null,null,null,null,null,null,null,null,null,null,null,null,null,null,null,null,null,null,null,null,null,null,null,null,null,null,null,null,null,null,null,null,null,null,null,null,null,"Italy",71,null,null,null,null,null,0,null,null,null,null,null,null,null,null,null,null,null,null,null,null,null,null,null,null,null,null,null,null,0,0,null,null,"Italy",71,null,null,null,null,null,0,null,null,null,null,null,null,null,null,null,null,null,null,null,null,null,null,null,null,null,null,null,null,0,0]
[null,null,null,null,null,null,null,null,null,null,"ê",null,null,null,null,null,null,null,null,null,null,null,null,null,null,null,null,null,null,null,null,null,null,null,null,null,null,null,null,null,"Jamaica",72,{"$f":"MOS_Table_3!AP80","v":0},{"$f":"MOS_Table_3!AQ80","v":0},{"$f":"SUM(MOS_Table_3!AR80,MOS_Table_3!AS80,MOS_Table_3!AT80)","v":0},0,{"$f":"MOS_Table_3!AW80","v":0},{"$f":"MOS_Table_3!AX80","v":0},{"$f":"SUM(MOS_Table_3!BB80,MOS_Table_3!BC80,MOS_Table_3!AY80)","v":0},{"$f":"SUM(MOS_Table_3!BE80:BG80)","v":0},{"$f":"MOS_Table_3!BD80","v":0},{"$f":"MOS_Table_3!BJ80","v":0},{"$f":"MOS_Table_3!BH80","v":0},{"$f":"MOS_Table_3!BM80","v":0},{"$f":"SUM(MOS_Table_3!AV80,MOS_Table_3!BP80,MOS_Table_3!BQ80)","v":0},0,null,null,"Jamaica",72,{"$f":"MOS_Table_4!BH80","v":0},{"$f":"MOS_Table_4!BI80","v":0},{"$f":"MOS_Table_4!BJ80+MOS_Table_4!BK80+MOS_Table_4!BL80","v":0},0,{"$f":"MOS_Table_4!BO80","v":0},{"$f":"MOS_Table_4!BP80","v":0},{"$f":"MOS_Table_4!BT80+MOS_Table_4!BU80+MOS_Table_4!BQ80","v":0},{"$f":"MOS_Table_4!BW80+MOS_Table_4!BX80+MOS_Table_4!BY80","v":0},{"$f":"MOS_Table_4!BV80","v":0},{"$f":"MOS_Table_4!CB80","v":0},{"$f":"MOS_Table_4!BZ80","v":0},{"$f":"MOS_Table_4!CE80","v":0},{"$f":"MOS_Table_4!BN80+MOS_Table_4!CH80+MOS_Table_4!CI80","v":0},0,null,null,null,null,null,null,null,null,null,null,null,null,null,null,null,null,null,null,null,null,null,null,null,null,null,null,null,null,null,null,null,null,null,null,null,null,null,null,null,null,null,null,null,null,null,null,"Jamaica",72,null,null,null,null,null,0,null,null,null,null,null,null,null,null,null,null,null,null,null,null,null,null,null,null,null,null,null,null,0,0,null,null,"Jamaica",72,null,null,null,null,null,0,null,null,null,null,null,null,null,null,null,null,null,null,null,null,null,null,null,null,null,null,null,null,0,0]
[null,null,null,null,null,null,null,null,null,null," ",null,null,null,null,null,null,null,null,null,null,null,null,null,null,null,null,null,null,null,null,null,null,null,null,null,null,null,null,null,"Japan",73,{"$f":"MOS_Table_3!AP81","v":0},{"$f":"MOS_Table_3!AQ81","v":0},{"$f":"SUM(MOS_Table_3!AR81,MOS_Table_3!AS81,MOS_Table_3!AT81)","v":0},0,{"$f":"MOS_Table_3!AW81","v":0},{"$f":"MOS_Table_3!AX81","v":0},{"$f":"SUM(MOS_Table_3!BB81,MOS_Table_3!BC81,MOS_Table_3!AY81)","v":0},{"$f":"SUM(MOS_Table_3!BE81:BG81)","v":0},{"$f":"MOS_Table_3!BD81","v":0},{"$f":"MOS_Table_3!BJ81","v":0},{"$f":"MOS_Table_3!BH81","v":0},{"$f":"MOS_Table_3!BM81","v":0},{"$f":"SUM(MOS_Table_3!AV81,MOS_Table_3!BP81,MOS_Table_3!BQ81)","v":0},0,null,null,"Japan",73,{"$f":"MOS_Table_4!BH81","v":0},{"$f":"MOS_Table_4!BI81","v":0},{"$f":"MOS_Table_4!BJ81+MOS_Table_4!BK81+MOS_Table_4!BL81","v":0},0,{"$f":"MOS_Table_4!BO81","v":0},{"$f":"MOS_Table_4!BP81","v":0},{"$f":"MOS_Table_4!BT81+MOS_Table_4!BU81+MOS_Table_4!BQ81","v":0},{"$f":"MOS_Table_4!BW81+MOS_Table_4!BX81+MOS_Table_4!BY81","v":0},{"$f":"MOS_Table_4!BV81","v":0},{"$f":"MOS_Table_4!CB81","v":0},{"$f":"MOS_Table_4!BZ81","v":0},{"$f":"MOS_Table_4!CE81","v":0},{"$f":"MOS_Table_4!BN81+MOS_Table_4!CH81+MOS_Table_4!CI81","v":0},0,null,null,null,null,null,null,null,null,null,null,null,null,null,null,null,null,null,null,null,null,null,null,null,null,null,null,null,null,null,null,null,null,null,null,null,null,null,null,null,null,null,null,null,null,null,null,"Japan",73,null,null,null,null,null,0,null,null,null,null,null,null,null,null,null,null,null,null,null,null,null,null,null,null,null,null,null,null,0,0,null,null,"Japan",73,null,null,null,null,null,0,null,null,null,null,null,null,null,null,null,null,null,null,null,null,null,null,null,null,null,null,null,null,0,0]
[null,null,null,null,null,null,null,null,null,null,"ê",null,null,null,null,null,null,null,null,null,null,null,null,null,null,null,null,null,null,null,null,null,null,null,null,null,null,null,null,null,"Jordan",74,{"$f":"MOS_Table_3!AP82","v":0},{"$f":"MOS_Table_3!AQ82","v":0},{"$f":"SUM(MOS_Table_3!AR82,MOS_Table_3!AS82,MOS_Table_3!AT82)","v":0},0,{"$f":"MOS_Table_3!AW82","v":0},{"$f":"MOS_Table_3!AX82","v":0},{"$f":"SUM(MOS_Table_3!BB82,MOS_Table_3!BC82,MOS_Table_3!AY82)","v":0},{"$f":"SUM(MOS_Table_3!BE82:BG82)","v":0},{"$f":"MOS_Table_3!BD82","v":0},{"$f":"MOS_Table_3!BJ82","v":0},{"$f":"MOS_Table_3!BH82","v":0},{"$f":"MOS_Table_3!BM82","v":0},{"$f":"SUM(MOS_Table_3!AV82,MOS_Table_3!BP82,MOS_Table_3!BQ82)","v":0},0,null,null,"Jordan",74,{"$f":"MOS_Table_4!BH82","v":0},{"$f":"MOS_Table_4!BI82","v":0},{"$f":"MOS_Table_4!BJ82+MOS_Table_4!BK82+MOS_Table_4!BL82","v":0},0,{"$f":"MOS_Table_4!BO82","v":0},{"$f":"MOS_Table_4!BP82","v":0},{"$f":"MOS_Table_4!BT82+MOS_Table_4!BU82+MOS_Table_4!BQ82","v":0},{"$f":"MOS_Table_4!BW82+MOS_Table_4!BX82+MOS_Table_4!BY82","v":0},{"$f":"MOS_Table_4!BV82","v":0},{"$f":"MOS_Table_4!CB82","v":0},{"$f":"MOS_Table_4!BZ82","v":0},{"$f":"MOS_Table_4!CE82","v":0},{"$f":"MOS_Table_4!BN82+MOS_Table_4!CH82+MOS_Table_4!CI82","v":0},0,null,null,null,null,null,null,null,null,null,null,null,null,null,null,null,null,null,null,null,null,null,null,null,null,null,null,null,null,null,null,null,null,null,null,null,null,null,null,null,null,null,null,null,null,null,null,"Jordan",74,null,null,null,null,null,0,null,null,null,null,null,null,null,null,null,null,null,null,null,null,null,null,null,null,null,null,null,null,0,0,null,null,"Jordan",74,null,null,null,null,null,0,null,null,null,null,null,null,null,null,null,null,null,null,null,null,null,null,null,null,null,null,null,null,0,0]
[null,null,null,null,null,null,null,null,null,null," ",null,null,null,null,null,null,null,null,null,null,null,null,null,null,null,null,null,null,null,null,null,null,null,null,null,null,null,null,null,"Kazakhstan",75,{"$f":"MOS_Table_3!AP83","v":0},{"$f":"MOS_Table_3!AQ83","v":0},{"$f":"SUM(MOS_Table_3!AR83,MOS_Table_3!AS83,MOS_Table_3!AT83)","v":0},0,{"$f":"MOS_Table_3!AW83","v":0},{"$f":"MOS_Table_3!AX83","v":0},{"$f":"SUM(MOS_Table_3!BB83,MOS_Table_3!BC83,MOS_Table_3!AY83)","v":0},{"$f":"SUM(MOS_Table_3!BE83:BG83)","v":0},{"$f":"MOS_Table_3!BD83","v":0},{"$f":"MOS_Table_3!BJ83","v":0},{"$f":"MOS_Table_3!BH83","v":0},{"$f":"MOS_Table_3!BM83","v":0},{"$f":"SUM(MOS_Table_3!AV83,MOS_Table_3!BP83,MOS_Table_3!BQ83)","v":0},0,null,null,"Kazakhstan",75,{"$f":"MOS_Table_4!BH83","v":0},{"$f":"MOS_Table_4!BI83","v":0},{"$f":"MOS_Table_4!BJ83+MOS_Table_4!BK83+MOS_Table_4!BL83","v":0},0,{"$f":"MOS_Table_4!BO83","v":0},{"$f":"MOS_Table_4!BP83","v":0},{"$f":"MOS_Table_4!BT83+MOS_Table_4!BU83+MOS_Table_4!BQ83","v":0},{"$f":"MOS_Table_4!BW83+MOS_Table_4!BX83+MOS_Table_4!BY83","v":0},{"$f":"MOS_Table_4!BV83","v":0},{"$f":"MOS_Table_4!CB83","v":0},{"$f":"MOS_Table_4!BZ83","v":0},{"$f":"MOS_Table_4!CE83","v":0},{"$f":"MOS_Table_4!BN83+MOS_Table_4!CH83+MOS_Table_4!CI83","v":0},0,null,null,null,null,null,null,null,null,null,null,null,null,null,null,null,null,null,null,null,null,null,null,null,null,null,null,null,null,null,null,null,null,null,null,null,null,null,null,null,null,null,null,null,null,null,null,"Kazakhstan",75,null,null,null,null,null,0,null,null,null,null,null,null,null,null,null,null,null,null,null,null,null,null,null,null,null,null,null,null,0,0,null,null,"Kazakhstan",75,null,null,null,null,null,0,null,null,null,null,null,null,null,null,null,null,null,null,null,null,null,null,null,null,null,null,null,null,0,0]
[null,null,null,null,null,null,null,null,null,null,"ê",null,null,null,null,null,null,null,null,null,null,null,null,null,null,null,null,null,null,null,null,null,null,null,null,null,null,null,null,null,"Kenya",76,{"$f":"MOS_Table_3!AP84","v":0},{"$f":"MOS_Table_3!AQ84","v":0},{"$f":"SUM(MOS_Table_3!AR84,MOS_Table_3!AS84,MOS_Table_3!AT84)","v":0},0,{"$f":"MOS_Table_3!AW84","v":0},{"$f":"MOS_Table_3!AX84","v":0},{"$f":"SUM(MOS_Table_3!BB84,MOS_Table_3!BC84,MOS_Table_3!AY84)","v":0},{"$f":"SUM(MOS_Table_3!BE84:BG84)","v":0},{"$f":"MOS_Table_3!BD84","v":0},{"$f":"MOS_Table_3!BJ84","v":0},{"$f":"MOS_Table_3!BH84","v":0},{"$f":"MOS_Table_3!BM84","v":0},{"$f":"SUM(MOS_Table_3!AV84,MOS_Table_3!BP84,MOS_Table_3!BQ84)","v":0},0,null,null,"Kenya",76,{"$f":"MOS_Table_4!BH84","v":0},{"$f":"MOS_Table_4!BI84","v":0},{"$f":"MOS_Table_4!BJ84+MOS_Table_4!BK84+MOS_Table_4!BL84","v":0},0,{"$f":"MOS_Table_4!BO84","v":0},{"$f":"MOS_Table_4!BP84","v":0},{"$f":"MOS_Table_4!BT84+MOS_Table_4!BU84+MOS_Table_4!BQ84","v":0},{"$f":"MOS_Table_4!BW84+MOS_Table_4!BX84+MOS_Table_4!BY84","v":0},{"$f":"MOS_Table_4!BV84","v":0},{"$f":"MOS_Table_4!CB84","v":0},{"$f":"MOS_Table_4!BZ84","v":0},{"$f":"MOS_Table_4!CE84","v":0},{"$f":"MOS_Table_4!BN84+MOS_Table_4!CH84+MOS_Table_4!CI84","v":0},0,null,null,null,null,null,null,null,null,null,null,null,null,null,null,null,null,null,null,null,null,null,null,null,null,null,null,null,null,null,null,null,null,null,null,null,null,null,null,null,null,null,null,null,null,null,null,"Kenya",76,null,null,null,null,null,0,null,null,null,null,null,null,null,null,null,null,null,null,null,null,null,null,null,null,null,null,null,null,0,0,null,null,"Kenya",76,null,null,null,null,null,0,null,null,null,null,null,null,null,null,null,null,null,null,null,null,null,null,null,null,null,null,null,null,0,0]
[null,null,null,null,null,null,null,null,null,null," ",null,null,null,null,null,null,null,null,null,null,null,null,null,null,null,null,null,null,null,null,null,null,null,null,null,null,null,null,null,"Korea",77,{"$f":"MOS_Table_3!AP85","v":0},{"$f":"MOS_Table_3!AQ85","v":0},{"$f":"SUM(MOS_Table_3!AR85,MOS_Table_3!AS85,MOS_Table_3!AT85)","v":0},0,{"$f":"MOS_Table_3!AW85","v":0},{"$f":"MOS_Table_3!AX85","v":0},{"$f":"SUM(MOS_Table_3!BB85,MOS_Table_3!BC85,MOS_Table_3!AY85)","v":0},{"$f":"SUM(MOS_Table_3!BE85:BG85)","v":0},{"$f":"MOS_Table_3!BD85","v":0},{"$f":"MOS_Table_3!BJ85","v":0},{"$f":"MOS_Table_3!BH85","v":0},{"$f":"MOS_Table_3!BM85","v":0},{"$f":"SUM(MOS_Table_3!AV85,MOS_Table_3!BP85,MOS_Table_3!BQ85)","v":0},0,null,null,"Korea",77,{"$f":"MOS_Table_4!BH85","v":0},{"$f":"MOS_Table_4!BI85","v":0},{"$f":"MOS_Table_4!BJ85+MOS_Table_4!BK85+MOS_Table_4!BL85","v":0},0,{"$f":"MOS_Table_4!BO85","v":0},{"$f":"MOS_Table_4!BP85","v":0},{"$f":"MOS_Table_4!BT85+MOS_Table_4!BU85+MOS_Table_4!BQ85","v":0},{"$f":"MOS_Table_4!BW85+MOS_Table_4!BX85+MOS_Table_4!BY85","v":0},{"$f":"MOS_Table_4!BV85","v":0},{"$f":"MOS_Table_4!CB85","v":0},{"$f":"MOS_Table_4!BZ85","v":0},{"$f":"MOS_Table_4!CE85","v":0},{"$f":"MOS_Table_4!BN85+MOS_Table_4!CH85+MOS_Table_4!CI85","v":0},0,null,null,null,null,null,null,null,null,null,null,null,null,null,null,null,null,null,null,null,null,null,null,null,null,null,null,null,null,null,null,null,null,null,null,null,null,null,null,null,null,null,null,null,null,null,null,"Korea",77,null,null,null,null,null,0,null,null,null,null,null,null,null,null,null,null,null,null,null,null,null,null,null,null,null,null,null,null,0,0,null,null,"Korea",77,null,null,null,null,null,0,null,null,null,null,null,null,null,null,null,null,null,null,null,null,null,null,null,null,null,null,null,null,0,0]
[null,null,null,null,null,null,null,null,null,null,"ê",null,null,null,null,null,null,null,null,null,null,null,null,null,null,null,null,null,null,null,null,null,null,null,null,null,null,null,null,null,"Kosovo*",78,{"$f":"MOS_Table_3!AP86","v":0},{"$f":"MOS_Table_3!AQ86","v":0},{"$f":"SUM(MOS_Table_3!AR86,MOS_Table_3!AS86,MOS_Table_3!AT86)","v":0},0,{"$f":"MOS_Table_3!AW86","v":0},{"$f":"MOS_Table_3!AX86","v":0},{"$f":"SUM(MOS_Table_3!BB86,MOS_Table_3!BC86,MOS_Table_3!AY86)","v":0},{"$f":"SUM(MOS_Table_3!BE86:BG86)","v":0},{"$f":"MOS_Table_3!BD86","v":0},{"$f":"MOS_Table_3!BJ86","v":0},{"$f":"MOS_Table_3!BH86","v":0},{"$f":"MOS_Table_3!BM86","v":0},{"$f":"SUM(MOS_Table_3!AV86,MOS_Table_3!BP86,MOS_Table_3!BQ86)","v":0},0,null,null,"Kosovo*",78,{"$f":"MOS_Table_4!BH86","v":0},{"$f":"MOS_Table_4!BI86","v":0},{"$f":"MOS_Table_4!BJ86+MOS_Table_4!BK86+MOS_Table_4!BL86","v":0},0,{"$f":"MOS_Table_4!BO86","v":0},{"$f":"MOS_Table_4!BP86","v":0},{"$f":"MOS_Table_4!BT86+MOS_Table_4!BU86+MOS_Table_4!BQ86","v":0},{"$f":"MOS_Table_4!BW86+MOS_Table_4!BX86+MOS_Table_4!BY86","v":0},{"$f":"MOS_Table_4!BV86","v":0},{"$f":"MOS_Table_4!CB86","v":0},{"$f":"MOS_Table_4!BZ86","v":0},{"$f":"MOS_Table_4!CE86","v":0},{"$f":"MOS_Table_4!BN86+MOS_Table_4!CH86+MOS_Table_4!CI86","v":0},0,null,null,null,null,null,null,null,null,null,null,null,null,null,null,null,null,null,null,null,null,null,null,null,null,null,null,null,null,null,null,null,null,null,null,null,null,null,null,null,null,null,null,null,null,null,null,"Kosovo*",78,null,null,null,null,null,0,null,null,null,null,null,null,null,null,null,null,null,null,null,null,null,null,null,null,null,null,null,null,0,0,null,null,"Kosovo*",78,null,null,null,null,null,0,null,null,null,null,null,null,null,null,null,null,null,null,null,null,null,null,null,null,null,null,null,null,0,0]
[null,null,null,null,null,null,null,null,null,null,null,null,null,null,null,null,null,null,null,null,null,null,null,null,null,null,null,null,null,null,null,null,null,null,null,null,null,null,null,null,"Kuwait",79,{"$f":"MOS_Table_3!AP87","v":0},{"$f":"MOS_Table_3!AQ87","v":0},{"$f":"SUM(MOS_Table_3!AR87,MOS_Table_3!AS87,MOS_Table_3!AT87)","v":0},{"$f":"SUM(AQ90:AS90)","v":0},{"$f":"MOS_Table_3!AW87","v":0},{"$f":"MOS_Table_3!AX87","v":0},{"$f":"SUM(MOS_Table_3!BB87,MOS_Table_3!BC87,MOS_Table_3!AY87)","v":0},{"$f":"SUM(MOS_Table_3!BE87:BG87)","v":0},{"$f":"MOS_Table_3!BD87","v":0},{"$f":"MOS_Table_3!BJ87","v":0},{"$f":"MOS_Table_3!BH87","v":0},{"$f":"MOS_Table_3!BM87","v":0},{"$f":"SUM(MOS_Table_3!AV87,MOS_Table_3!BP87,MOS_Table_3!BQ87)","v":0},{"$f":"SUM(AU90:BC90)-AY90-BA90","v":0},null,null,"Kuwait",79,{"$f":"MOS_Table_4!BH87","v":0},{"$f":"MOS_Table_4!BI87","v":0},{"$f":"MOS_Table_4!BJ87+MOS_Table_4!BK87+MOS_Table_4!BL87","v":0},{"$f":"SUM(BI90:BK90)","v":0},{"$f":"MOS_Table_4!BO87","v":0},{"$f":"MOS_Table_4!BP87","v":0},{"$f":"MOS_Table_4!BT87+MOS_Table_4!BU87+MOS_Table_4!BQ87","v":0},{"$f":"MOS_Table_4!BW87+MOS_Table_4!BX87+MOS_Table_4!BY87","v":0},{"$f":"MOS_Table_4!BV87","v":0},{"$f":"MOS_Table_4!CB87","v":0},{"$f":"MOS_Table_4!BZ87","v":0},{"$f":"MOS_Table_4!CE87","v":0},{"$f":"MOS_Table_4!BN87+MOS_Table_4!CH87+MOS_Table_4!CI87","v":0},{"$f":"+BM90+BN90+BO90+BP90+BR90+BT90+BU90","v":0},null,null,null,null,null,null,null,null,null,null,null,null,null,null,null,null,null,null,null,null,null,null,null,null,null,null,null,null,null,null,null,null,null,null,null,null,null,null,null,null,null,null,null,null,null,null,"Kuwait",79,null,null,null,null,null,{"$f":"SUM(DS90:DW90)","v":0},null,null,null,null,null,null,null,null,null,null,null,null,null,null,null,null,null,null,null,null,null,null,{"$f":"SUM(DY90:EB90,EE90:EG90,EJ90,EM90,EP90,ES90:ET90)","v":0},{"$f":"SUM(DX90,EU90)","v":0},null,null,"Kuwait",79,null,null,null,null,null,{"$f":"SUM(FA90:FE90)","v":0},null,null,null,null,null,null,null,null,null,null,null,null,null,null,null,null,null,null,null,null,null,null,{"$f":"SUM(FG90:FI90,FJ90,FM90:FO90,FR90,FU90,FX90,GA90:GB90)","v":0},{"$f":"SUM(FF90,GC90)","v":0}]
[null,null,null,null,null,null,null,null,null,null,null,null,null,null,null,null,null,null,null,null,null,null,null,null,null,null,null,null,null,null,null,null,null,null,null,null,null,null,null,null,"Kyrgyzstan",80,{"$f":"MOS_Table_3!AP88","v":0},{"$f":"MOS_Table_3!AQ88","v":0},{"$f":"SUM(MOS_Table_3!AR88,MOS_Table_3!AS88,MOS_Table_3!AT88)","v":0},0,{"$f":"MOS_Table_3!AW88","v":0},{"$f":"MOS_Table_3!AX88","v":0},{"$f":"SUM(MOS_Table_3!BB88,MOS_Table_3!BC88,MOS_Table_3!AY88)","v":0},{"$f":"SUM(MOS_Table_3!BE88:BG88)","v":0},{"$f":"MOS_Table_3!BD88","v":0},{"$f":"MOS_Table_3!BJ88","v":0},{"$f":"MOS_Table_3!BH88","v":0},{"$f":"MOS_Table_3!BM88","v":0},{"$f":"SUM(MOS_Table_3!AV88,MOS_Table_3!BP88,MOS_Table_3!BQ88)","v":0},0,null,null,"Kyrgyzstan",80,{"$f":"MOS_Table_4!BH88","v":0},{"$f":"MOS_Table_4!BI88","v":0},{"$f":"MOS_Table_4!BJ88+MOS_Table_4!BK88+MOS_Table_4!BL88","v":0},0,{"$f":"MOS_Table_4!BO88","v":0},{"$f":"MOS_Table_4!BP88","v":0},{"$f":"MOS_Table_4!BT88+MOS_Table_4!BU88+MOS_Table_4!BQ88","v":0},{"$f":"MOS_Table_4!BW88+MOS_Table_4!BX88+MOS_Table_4!BY88","v":0},{"$f":"MOS_Table_4!BV88","v":0},{"$f":"MOS_Table_4!CB88","v":0},{"$f":"MOS_Table_4!BZ88","v":0},{"$f":"MOS_Table_4!CE88","v":0},{"$f":"MOS_Table_4!BN88+MOS_Table_4!CH88+MOS_Table_4!CI88","v":0},0,null,null,null,null,null,null,null,null,null,null,null,null,null,null,null,null,null,null,null,null,null,null,null,null,null,null,null,null,null,null,null,null,null,null,null,null,null,null,null,null,null,null,null,null,null,null,"Kyrgyzstan",80,null,null,null,null,null,0,null,null,null,null,null,null,null,null,null,null,null,null,null,null,null,null,null,null,null,null,null,null,0,0,null,null,"Kyrgyzstan",80,null,null,null,null,null,0,null,null,null,null,null,null,null,null,null,null,null,null,null,null,null,null,null,null,null,null,null,null,0,0]
[null,null,null,null,null,null,null,null,null,null,null,null,null,null,null,null,null,null,null,null,null,null,null,null,null,null,null,null,null,null,null,null,null,null,null,null,null,null,null,null,"Lao People's Democratic Republic",81,{"$f":"MOS_Table_3!AP89","v":0},{"$f":"MOS_Table_3!AQ89","v":0},{"$f":"SUM(MOS_Table_3!AR89,MOS_Table_3!AS89,MOS_Table_3!AT89)","v":0},0,{"$f":"MOS_Table_3!AW89","v":0},{"$f":"MOS_Table_3!AX89","v":0},{"$f":"SUM(MOS_Table_3!BB89,MOS_Table_3!BC89,MOS_Table_3!AY89)","v":0},{"$f":"SUM(MOS_Table_3!BE89:BG89)","v":0},{"$f":"MOS_Table_3!BD89","v":0},{"$f":"MOS_Table_3!BJ89","v":0},{"$f":"MOS_Table_3!BH89","v":0},{"$f":"MOS_Table_3!BM89","v":0},{"$f":"SUM(MOS_Table_3!AV89,MOS_Table_3!BP89,MOS_Table_3!BQ89)","v":0},0,null,null,"Lao People's Democratic Republic",81,{"$f":"MOS_Table_4!BH89","v":0},{"$f":"MOS_Table_4!BI89","v":0},{"$f":"MOS_Table_4!BJ89+MOS_Table_4!BK89+MOS_Table_4!BL89","v":0},0,{"$f":"MOS_Table_4!BO89","v":0},{"$f":"MOS_Table_4!BP89","v":0},{"$f":"MOS_Table_4!BT89+MOS_Table_4!BU89+MOS_Table_4!BQ89","v":0},{"$f":"MOS_Table_4!BW89+MOS_Table_4!BX89+MOS_Table_4!BY89","v":0},{"$f":"MOS_Table_4!BV89","v":0},{"$f":"MOS_Table_4!CB89","v":0},{"$f":"MOS_Table_4!BZ89","v":0},{"$f":"MOS_Table_4!CE89","v":0},{"$f":"MOS_Table_4!BN89+MOS_Table_4!CH89+MOS_Table_4!CI89","v":0},0,null,null,null,null,null,null,null,null,null,null,null,null,null,null,null,null,null,null,null,null,null,null,null,null,null,null,null,null,null,null,null,null,null,null,null,null,null,null,null,null,null,null,null,null,null,null,"Lao People's Democratic Republic",81,null,null,null,null,null,0,null,null,null,null,null,null,null,null,null,null,null,null,null,null,null,null,null,null,null,null,null,null,0,0,null,null,"Lao People's Democratic Republic",81,null,null,null,null,null,0,null,null,null,null,null,null,null,null,null,null,null,null,null,null,null,null,null,null,null,null,null,null,0,0]
[null,null,null,null,null,null,null,null,null,null,null,null,null,null,null,null,null,null,null,null,null,null,null,null,null,null,null,null,null,null,null,null,null,null,null,null,null,null,null,null,"Latvia",82,{"$f":"MOS_Table_3!AP90","v":0},{"$f":"MOS_Table_3!AQ90","v":0},{"$f":"SUM(MOS_Table_3!AR90,MOS_Table_3!AS90,MOS_Table_3!AT90)","v":0},0,{"$f":"MOS_Table_3!AW90","v":0},{"$f":"MOS_Table_3!AX90","v":0},{"$f":"SUM(MOS_Table_3!BB90,MOS_Table_3!BC90,MOS_Table_3!AY90)","v":0},{"$f":"SUM(MOS_Table_3!BE90:BG90)","v":0},{"$f":"MOS_Table_3!BD90","v":0},{"$f":"MOS_Table_3!BJ90","v":0},{"$f":"MOS_Table_3!BH90","v":0},{"$f":"MOS_Table_3!BM90","v":0},{"$f":"SUM(MOS_Table_3!AV90,MOS_Table_3!BP90,MOS_Table_3!BQ90)","v":0},0,null,null,"Latvia",82,{"$f":"MOS_Table_4!BH90","v":0},{"$f":"MOS_Table_4!BI90","v":0},{"$f":"MOS_Table_4!BJ90+MOS_Table_4!BK90+MOS_Table_4!BL90","v":0},0,{"$f":"MOS_Table_4!BO90","v":0},{"$f":"MOS_Table_4!BP90","v":0},{"$f":"MOS_Table_4!BT90+MOS_Table_4!BU90+MOS_Table_4!BQ90","v":0},{"$f":"MOS_Table_4!BW90+MOS_Table_4!BX90+MOS_Table_4!BY90","v":0},{"$f":"MOS_Table_4!BV90","v":0},{"$f":"MOS_Table_4!CB90","v":0},{"$f":"MOS_Table_4!BZ90","v":0},{"$f":"MOS_Table_4!CE90","v":0},{"$f":"MOS_Table_4!BN90+MOS_Table_4!CH90+MOS_Table_4!CI90","v":0},0,null,null,null,null,null,null,null,null,null,null,null,null,null,null,null,null,null,null,null,null,null,null,null,null,null,null,null,null,null,null,null,null,null,null,null,null,null,null,null,null,null,null,null,null,null,null,"Latvia",82,null,null,null,null,null,0,null,null,null,null,null,null,null,null,null,null,null,null,null,null,null,null,null,null,null,null,null,null,0,0,null,null,"Latvia",82,null,null,null,null,null,0,null,null,null,null,null,null,null,null,null,null,null,null,null,null,null,null,null,null,null,null,null,null,0,0]
[null,null,null,null,null,null,null,null,null,null,null,null,null,null,null,null,null,null,null,null,null,null,null,null,null,null,null,null,null,null,null,null,null,null,null,null,null,null,null,null,"Lebanon",83,{"$f":"MOS_Table_3!AP91","v":0},{"$f":"MOS_Table_3!AQ91","v":0},{"$f":"SUM(MOS_Table_3!AR91,MOS_Table_3!AS91,MOS_Table_3!AT91)","v":0},0,{"$f":"MOS_Table_3!AW91","v":0},{"$f":"MOS_Table_3!AX91","v":0},{"$f":"SUM(MOS_Table_3!BB91,MOS_Table_3!BC91,MOS_Table_3!AY91)","v":0},{"$f":"SUM(MOS_Table_3!BE91:BG91)","v":0},{"$f":"MOS_Table_3!BD91","v":0},{"$f":"MOS_Table_3!BJ91","v":0},{"$f":"MOS_Table_3!BH91","v":0},{"$f":"MOS_Table_3!BM91","v":0},{"$f":"SUM(MOS_Table_3!AV91,MOS_Table_3!BP91,MOS_Table_3!BQ91)","v":0},0,null,null,"Lebanon",83,{"$f":"MOS_Table_4!BH91","v":0},{"$f":"MOS_Table_4!BI91","v":0},{"$f":"MOS_Table_4!BJ91+MOS_Table_4!BK91+MOS_Table_4!BL91","v":0},0,{"$f":"MOS_Table_4!BO91","v":0},{"$f":"MOS_Table_4!BP91","v":0},{"$f":"MOS_Table_4!BT91+MOS_Table_4!BU91+MOS_Table_4!BQ91","v":0},{"$f":"MOS_Table_4!BW91+MOS_Table_4!BX91+MOS_Table_4!BY91","v":0},{"$f":"MOS_Table_4!BV91","v":0},{"$f":"MOS_Table_4!CB91","v":0},{"$f":"MOS_Table_4!BZ91","v":0},{"$f":"MOS_Table_4!CE91","v":0},{"$f":"MOS_Table_4!BN91+MOS_Table_4!CH91+MOS_Table_4!CI91","v":0},0,null,null,null,null,null,null,null,null,null,null,null,null,null,null,null,null,null,null,null,null,null,null,null,null,null,null,null,null,null,null,null,null,null,null,null,null,null,null,null,null,null,null,null,null,null,null,"Lebanon",83,null,null,null,null,null,0,null,null,null,null,null,null,null,null,null,null,null,null,null,null,null,null,null,null,null,null,null,null,0,0,null,null,"Lebanon",83,null,null,null,null,null,0,null,null,null,null,null,null,null,null,null,null,null,null,null,null,null,null,null,null,null,null,null,null,0,0]
[null,null,null,null,null,null,null,null,null,null,null,null,null,null,null,null,null,null,null,null,null,null,null,null,null,null,null,null,null,null,null,null,null,null,null,null,null,null,null,null,"Liberia",84,{"$f":"MOS_Table_3!AP92","v":0},{"$f":"MOS_Table_3!AQ92","v":0},{"$f":"SUM(MOS_Table_3!AR92,MOS_Table_3!AS92,MOS_Table_3!AT92)","v":0},0,{"$f":"MOS_Table_3!AW92","v":0},{"$f":"MOS_Table_3!AX92","v":0},{"$f":"SUM(MOS_Table_3!BB92,MOS_Table_3!BC92,MOS_Table_3!AY92)","v":0},{"$f":"SUM(MOS_Table_3!BE92:BG92)","v":0},{"$f":"MOS_Table_3!BD92","v":0},{"$f":"MOS_Table_3!BJ92","v":0},{"$f":"MOS_Table_3!BH92","v":0},{"$f":"MOS_Table_3!BM92","v":0},{"$f":"SUM(MOS_Table_3!AV92,MOS_Table_3!BP92,MOS_Table_3!BQ92)","v":0},0,null,null,"Liberia",84,{"$f":"MOS_Table_4!BH92","v":0},{"$f":"MOS_Table_4!BI92","v":0},{"$f":"MOS_Table_4!BJ92+MOS_Table_4!BK92+MOS_Table_4!BL92","v":0},0,{"$f":"MOS_Table_4!BO92","v":0},{"$f":"MOS_Table_4!BP92","v":0},{"$f":"MOS_Table_4!BT92+MOS_Table_4!BU92+MOS_Table_4!BQ92","v":0},{"$f":"MOS_Table_4!BW92+MOS_Table_4!BX92+MOS_Table_4!BY92","v":0},{"$f":"MOS_Table_4!BV92","v":0},{"$f":"MOS_Table_4!CB92","v":0},{"$f":"MOS_Table_4!BZ92","v":0},{"$f":"MOS_Table_4!CE92","v":0},{"$f":"MOS_Table_4!BN92+MOS_Table_4!CH92+MOS_Table_4!CI92","v":0},0,null,null,null,null,null,null,null,null,null,null,null,null,null,null,null,null,null,null,null,null,null,null,null,null,null,null,null,null,null,null,null,null,null,null,null,null,null,null,null,null,null,null,null,null,null,null,"Liberia",84,null,null,null,null,null,0,null,null,null,null,null,null,null,null,null,null,null,null,null,null,null,null,null,null,null,null,null,null,0,0,null,null,"Liberia",84,null,null,null,null,null,0,null,null,null,null,null,null,null,null,null,null,null,null,null,null,null,null,null,null,null,null,null,null,0,0]
[null,null,null,null,null,null,null,null,null,null,null,null,null,null,null,null,null,null,null,null,null,null,null,null,null,null,null,null,null,null,null,null,null,null,null,null,null,null,null,null,"Libya",85,{"$f":"MOS_Table_3!AP93","v":0},{"$f":"MOS_Table_3!AQ93","v":0},{"$f":"SUM(MOS_Table_3!AR93,MOS_Table_3!AS93,MOS_Table_3!AT93)","v":0},0,{"$f":"MOS_Table_3!AW93","v":0},{"$f":"MOS_Table_3!AX93","v":0},{"$f":"SUM(MOS_Table_3!BB93,MOS_Table_3!BC93,MOS_Table_3!AY93)","v":0},{"$f":"SUM(MOS_Table_3!BE93:BG93)","v":0},{"$f":"MOS_Table_3!BD93","v":0},{"$f":"MOS_Table_3!BJ93","v":0},{"$f":"MOS_Table_3!BH93","v":0},{"$f":"MOS_Table_3!BM93","v":0},{"$f":"SUM(MOS_Table_3!AV93,MOS_Table_3!BP93,MOS_Table_3!BQ93)","v":0},0,null,null,"Libya",85,{"$f":"MOS_Table_4!BH93","v":0},{"$f":"MOS_Table_4!BI93","v":0},{"$f":"MOS_Table_4!BJ93+MOS_Table_4!BK93+MOS_Table_4!BL93","v":0},0,{"$f":"MOS_Table_4!BO93","v":0},{"$f":"MOS_Table_4!BP93","v":0},{"$f":"MOS_Table_4!BT93+MOS_Table_4!BU93+MOS_Table_4!BQ93","v":0},{"$f":"MOS_Table_4!BW93+MOS_Table_4!BX93+MOS_Table_4!BY93","v":0},{"$f":"MOS_Table_4!BV93","v":0},{"$f":"MOS_Table_4!CB93","v":0},{"$f":"MOS_Table_4!BZ93","v":0},{"$f":"MOS_Table_4!CE93","v":0},{"$f":"MOS_Table_4!BN93+MOS_Table_4!CH93+MOS_Table_4!CI93","v":0},0,null,null,null,null,null,null,null,null,null,null,null,null,null,null,null,null,null,null,null,null,null,null,null,null,null,null,null,null,null,null,null,null,null,null,null,null,null,null,null,null,null,null,null,null,null,null,"Libya",85,null,null,null,null,null,0,null,null,null,null,null,null,null,null,null,null,null,null,null,null,null,null,null,null,null,null,null,null,0,0,null,null,"Libya",85,null,null,null,null,null,0,null,null,null,null,null,null,null,null,null,null,null,null,null,null,null,null,null,null,null,null,null,null,0,0]
[null,null,null,null,null,null,null,null,null,null,null,null,null,null,null,null,null,null,null,null,null,null,null,null,null,null,null,null,null,null,null,null,null,null,null,null,null,null,null,null,"Liechtenstein",86,{"$f":"MOS_Table_3!AP94","v":0},{"$f":"MOS_Table_3!AQ94","v":0},{"$f":"SUM(MOS_Table_3!AR94,MOS_Table_3!AS94,MOS_Table_3!AT94)","v":0},0,{"$f":"MOS_Table_3!AW94","v":0},{"$f":"MOS_Table_3!AX94","v":0},{"$f":"SUM(MOS_Table_3!BB94,MOS_Table_3!BC94,MOS_Table_3!AY94)","v":0},{"$f":"SUM(MOS_Table_3!BE94:BG94)","v":0},{"$f":"MOS_Table_3!BD94","v":0},{"$f":"MOS_Table_3!BJ94","v":0},{"$f":"MOS_Table_3!BH94","v":0},{"$f":"MOS_Table_3!BM94","v":0},{"$f":"SUM(MOS_Table_3!AV94,MOS_Table_3!BP94,MOS_Table_3!BQ94)","v":0},0,null,null,"Liechtenstein",86,{"$f":"MOS_Table_4!BH94","v":0},{"$f":"MOS_Table_4!BI94","v":0},{"$f":"MOS_Table_4!BJ94+MOS_Table_4!BK94+MOS_Table_4!BL94","v":0},0,{"$f":"MOS_Table_4!BO94","v":0},{"$f":"MOS_Table_4!BP94","v":0},{"$f":"MOS_Table_4!BT94+MOS_Table_4!BU94+MOS_Table_4!BQ94","v":0},{"$f":"MOS_Table_4!BW94+MOS_Table_4!BX94+MOS_Table_4!BY94","v":0},{"$f":"MOS_Table_4!BV94","v":0},{"$f":"MOS_Table_4!CB94","v":0},{"$f":"MOS_Table_4!BZ94","v":0},{"$f":"MOS_Table_4!CE94","v":0},{"$f":"MOS_Table_4!BN94+MOS_Table_4!CH94+MOS_Table_4!CI94","v":0},0,null,null,null,null,null,null,null,null,null,null,null,null,null,null,null,null,null,null,null,null,null,null,null,null,null,null,null,null,null,null,null,null,null,null,null,null,null,null,null,null,null,null,null,null,null,null,"Liechtenstein",86,null,null,null,null,null,0,null,null,null,null,null,null,null,null,null,null,null,null,null,null,null,null,null,null,null,null,null,null,0,0,null,null,"Liechtenstein",86,null,null,null,null,null,0,null,null,null,null,null,null,null,null,null,null,null,null,null,null,null,null,null,null,null,null,null,null,0,0]
[null,null,null,null,null,null,null,null,null,null,null,null,null,null,null,null,null,null,null,null,null,null,null,null,null,null,null,null,null,null,null,null,null,null,null,null,null,null,null,null,"Lithuania",87,{"$f":"MOS_Table_3!AP95","v":0},{"$f":"MOS_Table_3!AQ95","v":0},{"$f":"SUM(MOS_Table_3!AR95,MOS_Table_3!AS95,MOS_Table_3!AT95)","v":0},0,{"$f":"MOS_Table_3!AW95","v":0},{"$f":"MOS_Table_3!AX95","v":0},{"$f":"SUM(MOS_Table_3!BB95,MOS_Table_3!BC95,MOS_Table_3!AY95)","v":0},{"$f":"SUM(MOS_Table_3!BE95:BG95)","v":0},{"$f":"MOS_Table_3!BD95","v":0},{"$f":"MOS_Table_3!BJ95","v":0},{"$f":"MOS_Table_3!BH95","v":0},{"$f":"MOS_Table_3!BM95","v":0},{"$f":"SUM(MOS_Table_3!AV95,MOS_Table_3!BP95,MOS_Table_3!BQ95)","v":0},0,null,null,"Lithuania",87,{"$f":"MOS_Table_4!BH95","v":0},{"$f":"MOS_Table_4!BI95","v":0},{"$f":"MOS_Table_4!BJ95+MOS_Table_4!BK95+MOS_Table_4!BL95","v":0},0,{"$f":"MOS_Table_4!BO95","v":0},{"$f":"MOS_Table_4!BP95","v":0},{"$f":"MOS_Table_4!BT95+MOS_Table_4!BU95+MOS_Table_4!BQ95","v":0},{"$f":"MOS_Table_4!BW95+MOS_Table_4!BX95+MOS_Table_4!BY95","v":0},{"$f":"MOS_Table_4!BV95","v":0},{"$f":"MOS_Table_4!CB95","v":0},{"$f":"MOS_Table_4!BZ95","v":0},{"$f":"MOS_Table_4!CE95","v":0},{"$f":"MOS_Table_4!BN95+MOS_Table_4!CH95+MOS_Table_4!CI95","v":0},0,null,null,null,null,null,null,null,null,null,null,null,null,null,null,null,null,null,null,null,null,null,null,null,null,null,null,null,null,null,null,null,null,null,null,null,null,null,null,null,null,null,null,null,null,null,null,"Lithuania",87,null,null,null,null,null,0,null,null,null,null,null,null,null,null,null,null,null,null,null,null,null,null,null,null,null,null,null,null,0,0,null,null,"Lithuania",87,null,null,null,null,null,0,null,null,null,null,null,null,null,null,null,null,null,null,null,null,null,null,null,null,null,null,null,null,0,0]
[null,null,null,null,null,null,null,null,null,null,null,null,null,null,null,null,null,null,null,null,null,null,null,null,null,null,null,null,null,null,null,null,null,null,null,null,null,null,null,null,"Luxembourg",88,{"$f":"MOS_Table_3!AP96","v":0},{"$f":"MOS_Table_3!AQ96","v":0},{"$f":"SUM(MOS_Table_3!AR96,MOS_Table_3!AS96,MOS_Table_3!AT96)","v":0},0,{"$f":"MOS_Table_3!AW96","v":0},{"$f":"MOS_Table_3!AX96","v":0},{"$f":"SUM(MOS_Table_3!BB96,MOS_Table_3!BC96,MOS_Table_3!AY96)","v":0},{"$f":"SUM(MOS_Table_3!BE96:BG96)","v":0},{"$f":"MOS_Table_3!BD96","v":0},{"$f":"MOS_Table_3!BJ96","v":0},{"$f":"MOS_Table_3!BH96","v":0},{"$f":"MOS_Table_3!BM96","v":0},{"$f":"SUM(MOS_Table_3!AV96,MOS_Table_3!BP96,MOS_Table_3!BQ96)","v":0},0,null,null,"Luxembourg",88,{"$f":"MOS_Table_4!BH96","v":0},{"$f":"MOS_Table_4!BI96","v":0},{"$f":"MOS_Table_4!BJ96+MOS_Table_4!BK96+MOS_Table_4!BL96","v":0},0,{"$f":"MOS_Table_4!BO96","v":0},{"$f":"MOS_Table_4!BP96","v":0},{"$f":"MOS_Table_4!BT96+MOS_Table_4!BU96+MOS_Table_4!BQ96","v":0},{"$f":"MOS_Table_4!BW96+MOS_Table_4!BX96+MOS_Table_4!BY96","v":0},{"$f":"MOS_Table_4!BV96","v":0},{"$f":"MOS_Table_4!CB96","v":0},{"$f":"MOS_Table_4!BZ96","v":0},{"$f":"MOS_Table_4!CE96","v":0},{"$f":"MOS_Table_4!BN96+MOS_Table_4!CH96+MOS_Table_4!CI96","v":0},0,null,null,null,null,null,null,null,null,null,null,null,null,null,null,null,null,null,null,null,null,null,null,null,null,null,null,null,null,null,null,null,null,null,null,null,null,null,null,null,null,null,null,null,null,null,null,"Luxembourg",88,null,null,null,null,null,0,null,null,null,null,null,null,null,null,null,null,null,null,null,null,null,null,null,null,null,null,null,null,0,0,null,null,"Luxembourg",88,null,null,null,null,null,0,null,null,null,null,null,null,null,null,null,null,null,null,null,null,null,null,null,null,null,null,null,null,0,0]
[null,null,null,null,null,null,null,null,null,null,null,null,null,null,null,null,null,null,null,null,null,null,null,null,null,null,null,null,null,null,null,null,null,null,null,null,null,null,null,null,"Madagascar",89,{"$f":"MOS_Table_3!AP97","v":0},{"$f":"MOS_Table_3!AQ97","v":0},{"$f":"SUM(MOS_Table_3!AR97,MOS_Table_3!AS97,MOS_Table_3!AT97)","v":0},0,{"$f":"MOS_Table_3!AW97","v":0},{"$f":"MOS_Table_3!AX97","v":0},{"$f":"SUM(MOS_Table_3!BB97,MOS_Table_3!BC97,MOS_Table_3!AY97)","v":0},{"$f":"SUM(MOS_Table_3!BE97:BG97)","v":0},{"$f":"MOS_Table_3!BD97","v":0},{"$f":"MOS_Table_3!BJ97","v":0},{"$f":"MOS_Table_3!BH97","v":0},{"$f":"MOS_Table_3!BM97","v":0},{"$f":"SUM(MOS_Table_3!AV97,MOS_Table_3!BP97,MOS_Table_3!BQ97)","v":0},0,null,null,"Madagascar",89,{"$f":"MOS_Table_4!BH97","v":0},{"$f":"MOS_Table_4!BI97","v":0},{"$f":"MOS_Table_4!BJ97+MOS_Table_4!BK97+MOS_Table_4!BL97","v":0},0,{"$f":"MOS_Table_4!BO97","v":0},{"$f":"MOS_Table_4!BP97","v":0},{"$f":"MOS_Table_4!BT97+MOS_Table_4!BU97+MOS_Table_4!BQ97","v":0},{"$f":"MOS_Table_4!BW97+MOS_Table_4!BX97+MOS_Table_4!BY97","v":0},{"$f":"MOS_Table_4!BV97","v":0},{"$f":"MOS_Table_4!CB97","v":0},{"$f":"MOS_Table_4!BZ97","v":0},{"$f":"MOS_Table_4!CE97","v":0},{"$f":"MOS_Table_4!BN97+MOS_Table_4!CH97+MOS_Table_4!CI97","v":0},0,null,null,null,null,null,null,null,null,null,null,null,null,null,null,null,null,null,null,null,null,null,null,null,null,null,null,null,null,null,null,null,null,null,null,null,null,null,null,null,null,null,null,null,null,null,null,"Madagascar",89,null,null,null,null,null,0,null,null,null,null,null,null,null,null,null,null,null,null,null,null,null,null,null,null,null,null,null,null,0,0,null,null,"Madagascar",89,null,null,null,null,null,0,null,null,null,null,null,null,null,null,null,null,null,null,null,null,null,null,null,null,null,null,null,null,0,0]
[null,null,null,null,null,null,null,null,null,null,null,null,null,null,null,null,null,null,null,null,null,null,null,null,null,null,null,null,null,null,null,null,null,null,null,null,null,null,null,null,"Malaysia",90,{"$f":"MOS_Table_3!AP98","v":0},{"$f":"MOS_Table_3!AQ98","v":0},{"$f":"SUM(MOS_Table_3!AR98,MOS_Table_3!AS98,MOS_Table_3!AT98)","v":0},0,{"$f":"MOS_Table_3!AW98","v":0},{"$f":"MOS_Table_3!AX98","v":0},{"$f":"SUM(MOS_Table_3!BB98,MOS_Table_3!BC98,MOS_Table_3!AY98)","v":0},{"$f":"SUM(MOS_Table_3!BE98:BG98)","v":0},{"$f":"MOS_Table_3!BD98","v":0},{"$f":"MOS_Table_3!BJ98","v":0},{"$f":"MOS_Table_3!BH98","v":0},{"$f":"MOS_Table_3!BM98","v":0},{"$f":"SUM(MOS_Table_3!AV98,MOS_Table_3!BP98,MOS_Table_3!BQ98)","v":0},0,null,null,"Malaysia",90,{"$f":"MOS_Table_4!BH98","v":0},{"$f":"MOS_Table_4!BI98","v":0},{"$f":"MOS_Table_4!BJ98+MOS_Table_4!BK98+MOS_Table_4!BL98","v":0},0,{"$f":"MOS_Table_4!BO98","v":0},{"$f":"MOS_Table_4!BP98","v":0},{"$f":"MOS_Table_4!BT98+MOS_Table_4!BU98+MOS_Table_4!BQ98","v":0},{"$f":"MOS_Table_4!BW98+MOS_Table_4!BX98+MOS_Table_4!BY98","v":0},{"$f":"MOS_Table_4!BV98","v":0},{"$f":"MOS_Table_4!CB98","v":0},{"$f":"MOS_Table_4!BZ98","v":0},{"$f":"MOS_Table_4!CE98","v":0},{"$f":"MOS_Table_4!BN98+MOS_Table_4!CH98+MOS_Table_4!CI98","v":0},0,null,null,null,null,null,null,null,null,null,null,null,null,null,null,null,null,null,null,null,null,null,null,null,null,null,null,null,null,null,null,null,null,null,null,null,null,null,null,null,null,null,null,null,null,null,null,"Malaysia",90,null,null,null,null,null,0,null,null,null,null,null,null,null,null,null,null,null,null,null,null,null,null,null,null,null,null,null,null,0,0,null,null,"Malaysia",90,null,null,null,null,null,0,null,null,null,null,null,null,null,null,null,null,null,null,null,null,null,null,null,null,null,null,null,null,0,0]
[null,null,null,null,null,null,null,null,null,null,null,null,null,null,null,null,null,null,null,null,null,null,null,null,null,null,null,null,null,null,null,null,null,null,null,null,null,null,null,null,"Malta",91,{"$f":"MOS_Table_3!AP99","v":0},{"$f":"MOS_Table_3!AQ99","v":0},{"$f":"SUM(MOS_Table_3!AR99,MOS_Table_3!AS99,MOS_Table_3!AT99)","v":0},0,{"$f":"MOS_Table_3!AW99","v":0},{"$f":"MOS_Table_3!AX99","v":0},{"$f":"SUM(MOS_Table_3!BB99,MOS_Table_3!BC99,MOS_Table_3!AY99)","v":0},{"$f":"SUM(MOS_Table_3!BE99:BG99)","v":0},{"$f":"MOS_Table_3!BD99","v":0},{"$f":"MOS_Table_3!BJ99","v":0},{"$f":"MOS_Table_3!BH99","v":0},{"$f":"MOS_Table_3!BM99","v":0},{"$f":"SUM(MOS_Table_3!AV99,MOS_Table_3!BP99,MOS_Table_3!BQ99)","v":0},0,null,null,"Malta",91,{"$f":"MOS_Table_4!BH99","v":0},{"$f":"MOS_Table_4!BI99","v":0},{"$f":"MOS_Table_4!BJ99+MOS_Table_4!BK99+MOS_Table_4!BL99","v":0},0,{"$f":"MOS_Table_4!BO99","v":0},{"$f":"MOS_Table_4!BP99","v":0},{"$f":"MOS_Table_4!BT99+MOS_Table_4!BU99+MOS_Table_4!BQ99","v":0},{"$f":"MOS_Table_4!BW99+MOS_Table_4!BX99+MOS_Table_4!BY99","v":0},{"$f":"MOS_Table_4!BV99","v":0},{"$f":"MOS_Table_4!CB99","v":0},{"$f":"MOS_Table_4!BZ99","v":0},{"$f":"MOS_Table_4!CE99","v":0},{"$f":"MOS_Table_4!BN99+MOS_Table_4!CH99+MOS_Table_4!CI99","v":0},0,null,null,null,null,null,null,null,null,null,null,null,null,null,null,null,null,null,null,null,null,null,null,null,null,null,null,null,null,null,null,null,null,null,null,null,null,null,null,null,null,null,null,null,null,null,null,"Malta",91,null,null,null,null,null,0,null,null,null,null,null,null,null,null,null,null,null,null,null,null,null,null,null,null,null,null,null,null,0,0,null,null,"Malta",91,null,null,null,null,null,0,null,null,null,null,null,null,null,null,null,null,null,null,null,null,null,null,null,null,null,null,null,null,0,0]
[null,null,null,null,null,null,null,null,null,null,null,null,null,null,null,null,null,null,null,null,null,null,null,null,null,null,null,null,null,null,null,null,null,null,null,null,null,null,null,null,"Marshall Islands",92,{"$f":"MOS_Table_3!AP100","v":0},{"$f":"MOS_Table_3!AQ100","v":0},{"$f":"SUM(MOS_Table_3!AR100,MOS_Table_3!AS100,MOS_Table_3!AT100)","v":0},0,{"$f":"MOS_Table_3!AW100","v":0},{"$f":"MOS_Table_3!AX100","v":0},{"$f":"SUM(MOS_Table_3!BB100,MOS_Table_3!BC100,MOS_Table_3!AY100)","v":0},{"$f":"SUM(MOS_Table_3!BE100:BG100)","v":0},{"$f":"MOS_Table_3!BD100","v":0},{"$f":"MOS_Table_3!BJ100","v":0},{"$f":"MOS_Table_3!BH100","v":0},{"$f":"MOS_Table_3!BM100","v":0},{"$f":"SUM(MOS_Table_3!AV100,MOS_Table_3!BP100,MOS_Table_3!BQ100)","v":0},0,null,null,"Marshall Islands",92,{"$f":"MOS_Table_4!BH100","v":0},{"$f":"MOS_Table_4!BI100","v":0},{"$f":"MOS_Table_4!BJ100+MOS_Table_4!BK100+MOS_Table_4!BL100","v":0},0,{"$f":"MOS_Table_4!BO100","v":0},{"$f":"MOS_Table_4!BP100","v":0},{"$f":"MOS_Table_4!BT100+MOS_Table_4!BU100+MOS_Table_4!BQ100","v":0},{"$f":"MOS_Table_4!BW100+MOS_Table_4!BX100+MOS_Table_4!BY100","v":0},{"$f":"MOS_Table_4!BV100","v":0},{"$f":"MOS_Table_4!CB100","v":0},{"$f":"MOS_Table_4!BZ100","v":0},{"$f":"MOS_Table_4!CE100","v":0},{"$f":"MOS_Table_4!BN100+MOS_Table_4!CH100+MOS_Table_4!CI100","v":0},0,null,null,null,null,null,null,null,null,null,null,null,null,null,null,null,null,null,null,null,null,null,null,null,null,null,null,null,null,null,null,null,null,null,null,null,null,null,null,null,null,null,null,null,null,null,null,"Marshall Islands",92,null,null,null,null,null,0,null,null,null,null,null,null,null,null,null,null,null,null,null,null,null,null,null,null,null,null,null,null,0,0,null,null,"Marshall Islands",92,null,null,null,null,null,0,null,null,null,null,null,null,null,null,null,null,null,null,null,null,null,null,null,null,null,null,null,null,0,0]
[null,null,null,null,null,null,null,null,null,null,null,null,null,null,null,null,null,null,null,null,null,null,null,null,null,null,null,null,null,null,null,null,null,null,null,null,null,null,null,null,"Mauritania",93,{"$f":"MOS_Table_3!AP101","v":0},{"$f":"MOS_Table_3!AQ101","v":0},{"$f":"SUM(MOS_Table_3!AR101,MOS_Table_3!AS101,MOS_Table_3!AT101)","v":0},0,{"$f":"MOS_Table_3!AW101","v":0},{"$f":"MOS_Table_3!AX101","v":0},{"$f":"SUM(MOS_Table_3!BB101,MOS_Table_3!BC101,MOS_Table_3!AY101)","v":0},{"$f":"SUM(MOS_Table_3!BE101:BG101)","v":0},{"$f":"MOS_Table_3!BD101","v":0},{"$f":"MOS_Table_3!BJ101","v":0},{"$f":"MOS_Table_3!BH101","v":0},{"$f":"MOS_Table_3!BM101","v":0},{"$f":"SUM(MOS_Table_3!AV101,MOS_Table_3!BP101,MOS_Table_3!BQ101)","v":0},0,null,null,"Mauritania",93,{"$f":"MOS_Table_4!BH101","v":0},{"$f":"MOS_Table_4!BI101","v":0},{"$f":"MOS_Table_4!BJ101+MOS_Table_4!BK101+MOS_Table_4!BL101","v":0},0,{"$f":"MOS_Table_4!BO101","v":0},{"$f":"MOS_Table_4!BP101","v":0},{"$f":"MOS_Table_4!BT101+MOS_Table_4!BU101+MOS_Table_4!BQ101","v":0},{"$f":"MOS_Table_4!BW101+MOS_Table_4!BX101+MOS_Table_4!BY101","v":0},{"$f":"MOS_Table_4!BV101","v":0},{"$f":"MOS_Table_4!CB101","v":0},{"$f":"MOS_Table_4!BZ101","v":0},{"$f":"MOS_Table_4!CE101","v":0},{"$f":"MOS_Table_4!BN101+MOS_Table_4!CH101+MOS_Table_4!CI101","v":0},0,null,null,null,null,null,null,null,null,null,null,null,null,null,null,null,null,null,null,null,null,null,null,null,null,null,null,null,null,null,null,null,null,null,null,null,null,null,null,null,null,null,null,null,null,null,null,"Mauritania",93,null,null,null,null,null,0,null,null,null,null,null,null,null,null,null,null,null,null,null,null,null,null,null,null,null,null,null,null,0,0,null,null,"Mauritania",93,null,null,null,null,null,0,null,null,null,null,null,null,null,null,null,null,null,null,null,null,null,null,null,null,null,null,null,null,0,0]
[null,null,null,null,null,null,null,null,null,null,null,null,null,null,null,null,null,null,null,null,null,null,null,null,null,null,null,null,null,null,null,null,null,null,null,null,null,null,null,null,"Mauritius",94,{"$f":"MOS_Table_3!AP102","v":0},{"$f":"MOS_Table_3!AQ102","v":0},{"$f":"SUM(MOS_Table_3!AR102,MOS_Table_3!AS102,MOS_Table_3!AT102)","v":0},0,{"$f":"MOS_Table_3!AW102","v":0},{"$f":"MOS_Table_3!AX102","v":0},{"$f":"SUM(MOS_Table_3!BB102,MOS_Table_3!BC102,MOS_Table_3!AY102)","v":0},{"$f":"SUM(MOS_Table_3!BE102:BG102)","v":0},{"$f":"MOS_Table_3!BD102","v":0},{"$f":"MOS_Table_3!BJ102","v":0},{"$f":"MOS_Table_3!BH102","v":0},{"$f":"MOS_Table_3!BM102","v":0},{"$f":"SUM(MOS_Table_3!AV102,MOS_Table_3!BP102,MOS_Table_3!BQ102)","v":0},0,null,null,"Mauritius",94,{"$f":"MOS_Table_4!BH102","v":0},{"$f":"MOS_Table_4!BI102","v":0},{"$f":"MOS_Table_4!BJ102+MOS_Table_4!BK102+MOS_Table_4!BL102","v":0},0,{"$f":"MOS_Table_4!BO102","v":0},{"$f":"MOS_Table_4!BP102","v":0},{"$f":"MOS_Table_4!BT102+MOS_Table_4!BU102+MOS_Table_4!BQ102","v":0},{"$f":"MOS_Table_4!BW102+MOS_Table_4!BX102+MOS_Table_4!BY102","v":0},{"$f":"MOS_Table_4!BV102","v":0},{"$f":"MOS_Table_4!CB102","v":0},{"$f":"MOS_Table_4!BZ102","v":0},{"$f":"MOS_Table_4!CE102","v":0},{"$f":"MOS_Table_4!BN102+MOS_Table_4!CH102+MOS_Table_4!CI102","v":0},0,null,null,null,null,null,null,null,null,null,null,null,null,null,null,null,null,null,null,null,null,null,null,null,null,null,null,null,null,null,null,null,null,null,null,null,null,null,null,null,null,null,null,null,null,null,null,"Mauritius",94,null,null,null,null,null,0,null,null,null,null,null,null,null,null,null,null,null,null,null,null,null,null,null,null,null,null,null,null,0,0,null,null,"Mauritius",94,null,null,null,null,null,0,null,null,null,null,null,null,null,null,null,null,null,null,null,null,null,null,null,null,null,null,null,null,0,0]
[null,null,null,null,null,null,null,null,null,null,null,null,null,null,null,null,null,null,null,null,null,null,null,null,null,null,null,null,null,null,null,null,null,null,null,null,null,null,null,null,"Mexico",95,{"$f":"MOS_Table_3!AP103","v":0},{"$f":"MOS_Table_3!AQ103","v":0},{"$f":"SUM(MOS_Table_3!AR103,MOS_Table_3!AS103,MOS_Table_3!AT103)","v":0},0,{"$f":"MOS_Table_3!AW103","v":0},{"$f":"MOS_Table_3!AX103","v":0},{"$f":"SUM(MOS_Table_3!BB103,MOS_Table_3!BC103,MOS_Table_3!AY103)","v":0},{"$f":"SUM(MOS_Table_3!BE103:BG103)","v":0},{"$f":"MOS_Table_3!BD103","v":0},{"$f":"MOS_Table_3!BJ103","v":0},{"$f":"MOS_Table_3!BH103","v":0},{"$f":"MOS_Table_3!BM103","v":0},{"$f":"SUM(MOS_Table_3!AV103,MOS_Table_3!BP103,MOS_Table_3!BQ103)","v":0},0,null,null,"Mexico",95,{"$f":"MOS_Table_4!BH103","v":0},{"$f":"MOS_Table_4!BI103","v":0},{"$f":"MOS_Table_4!BJ103+MOS_Table_4!BK103+MOS_Table_4!BL103","v":0},0,{"$f":"MOS_Table_4!BO103","v":0},{"$f":"MOS_Table_4!BP103","v":0},{"$f":"MOS_Table_4!BT103+MOS_Table_4!BU103+MOS_Table_4!BQ103","v":0},{"$f":"MOS_Table_4!BW103+MOS_Table_4!BX103+MOS_Table_4!BY103","v":0},{"$f":"MOS_Table_4!BV103","v":0},{"$f":"MOS_Table_4!CB103","v":0},{"$f":"MOS_Table_4!BZ103","v":0},{"$f":"MOS_Table_4!CE103","v":0},{"$f":"MOS_Table_4!BN103+MOS_Table_4!CH103+MOS_Table_4!CI103","v":0},0,null,null,null,null,null,null,null,null,null,null,null,null,null,null,null,null,null,null,null,null,null,null,null,null,null,null,null,null,null,null,null,null,null,null,null,null,null,null,null,null,null,null,null,null,null,null,"Mexico",95,null,null,null,null,null,0,null,null,null,null,null,null,null,null,null,null,null,null,null,null,null,null,null,null,null,null,null,null,0,0,null,null,"Mexico",95,null,null,null,null,null,0,null,null,null,null,null,null,null,null,null,null,null,null,null,null,null,null,null,null,null,null,null,null,0,0]
[null,null,null,null,null,null,null,null,null,null,null,null,null,null,null,null,null,null,null,null,null,null,null,null,null,null,null,null,null,null,null,null,null,null,null,null,null,null,null,null,"Moldova, Republic of",96,{"$f":"MOS_Table_3!AP104","v":0},{"$f":"MOS_Table_3!AQ104","v":0},{"$f":"SUM(MOS_Table_3!AR104,MOS_Table_3!AS104,MOS_Table_3!AT104)","v":0},0,{"$f":"MOS_Table_3!AW104","v":0},{"$f":"MOS_Table_3!AX104","v":0},{"$f":"SUM(MOS_Table_3!BB104,MOS_Table_3!BC104,MOS_Table_3!AY104)","v":0},{"$f":"SUM(MOS_Table_3!BE104:BG104)","v":0},{"$f":"MOS_Table_3!BD104","v":0},{"$f":"MOS_Table_3!BJ104","v":0},{"$f":"MOS_Table_3!BH104","v":0},{"$f":"MOS_Table_3!BM104","v":0},{"$f":"SUM(MOS_Table_3!AV104,MOS_Table_3!BP104,MOS_Table_3!BQ104)","v":0},0,null,null,"Moldova, Republic of",96,{"$f":"MOS_Table_4!BH104","v":0},{"$f":"MOS_Table_4!BI104","v":0},{"$f":"MOS_Table_4!BJ104+MOS_Table_4!BK104+MOS_Table_4!BL104","v":0},0,{"$f":"MOS_Table_4!BO104","v":0},{"$f":"MOS_Table_4!BP104","v":0},{"$f":"MOS_Table_4!BT104+MOS_Table_4!BU104+MOS_Table_4!BQ104","v":0},{"$f":"MOS_Table_4!BW104+MOS_Table_4!BX104+MOS_Table_4!BY104","v":0},{"$f":"MOS_Table_4!BV104","v":0},{"$f":"MOS_Table_4!CB104","v":0},{"$f":"MOS_Table_4!BZ104","v":0},{"$f":"MOS_Table_4!CE104","v":0},{"$f":"MOS_Table_4!BN104+MOS_Table_4!CH104+MOS_Table_4!CI104","v":0},0,null,null,null,null,null,null,null,null,null,null,null,null,null,null,null,null,null,null,null,null,null,null,null,null,null,null,null,null,null,null,null,null,null,null,null,null,null,null,null,null,null,null,null,null,null,null,"Moldova, Republic of",96,null,null,null,null,null,0,null,null,null,null,null,null,null,null,null,null,null,null,null,null,null,null,null,null,null,null,null,null,0,0,null,null,"Moldova, Republic of",96,null,null,null,null,null,0,null,null,null,null,null,null,null,null,null,null,null,null,null,null,null,null,null,null,null,null,null,null,0,0]
[null,null,null,null,null,null,null,null,null,null,null,null,null,null,null,null,null,null,null,null,null,null,null,null,null,null,null,null,null,null,null,null,null,null,null,null,null,null,null,null,"Mongolia",97,{"$f":"MOS_Table_3!AP105","v":0},{"$f":"MOS_Table_3!AQ105","v":0},{"$f":"SUM(MOS_Table_3!AR105,MOS_Table_3!AS105,MOS_Table_3!AT105)","v":0},0,{"$f":"MOS_Table_3!AW105","v":0},{"$f":"MOS_Table_3!AX105","v":0},{"$f":"SUM(MOS_Table_3!BB105,MOS_Table_3!BC105,MOS_Table_3!AY105)","v":0},{"$f":"SUM(MOS_Table_3!BE105:BG105)","v":0},{"$f":"MOS_Table_3!BD105","v":0},{"$f":"MOS_Table_3!BJ105","v":0},{"$f":"MOS_Table_3!BH105","v":0},{"$f":"MOS_Table_3!BM105","v":0},{"$f":"SUM(MOS_Table_3!AV105,MOS_Table_3!BP105,MOS_Table_3!BQ105)","v":0},0,null,null,"Mongolia",97,{"$f":"MOS_Table_4!BH105","v":0},{"$f":"MOS_Table_4!BI105","v":0},{"$f":"MOS_Table_4!BJ105+MOS_Table_4!BK105+MOS_Table_4!BL105","v":0},0,{"$f":"MOS_Table_4!BO105","v":0},{"$f":"MOS_Table_4!BP105","v":0},{"$f":"MOS_Table_4!BT105+MOS_Table_4!BU105+MOS_Table_4!BQ105","v":0},{"$f":"MOS_Table_4!BW105+MOS_Table_4!BX105+MOS_Table_4!BY105","v":0},{"$f":"MOS_Table_4!BV105","v":0},{"$f":"MOS_Table_4!CB105","v":0},{"$f":"MOS_Table_4!BZ105","v":0},{"$f":"MOS_Table_4!CE105","v":0},{"$f":"MOS_Table_4!BN105+MOS_Table_4!CH105+MOS_Table_4!CI105","v":0},0,null,null,null,null,null,null,null,null,null,null,null,null,null,null,null,null,null,null,null,null,null,null,null,null,null,null,null,null,null,null,null,null,null,null,null,null,null,null,null,null,null,null,null,null,null,null,"Mongolia",97,null,null,null,null,null,0,null,null,null,null,null,null,null,null,null,null,null,null,null,null,null,null,null,null,null,null,null,null,0,0,null,null,"Mongolia",97,null,null,null,null,null,0,null,null,null,null,null,null,null,null,null,null,null,null,null,null,null,null,null,null,null,null,null,null,0,0]
[null,null,null,null,null,null,null,null,null,null,null,null,null,null,null,null,null,null,null,null,null,null,null,null,null,null,null,null,null,null,null,null,null,null,null,null,null,null,null,null,"Montenegro",98,{"$f":"MOS_Table_3!AP106","v":0},{"$f":"MOS_Table_3!AQ106","v":0},{"$f":"SUM(MOS_Table_3!AR106,MOS_Table_3!AS106,MOS_Table_3!AT106)","v":0},0,{"$f":"MOS_Table_3!AW106","v":0},{"$f":"MOS_Table_3!AX106","v":0},{"$f":"SUM(MOS_Table_3!BB106,MOS_Table_3!BC106,MOS_Table_3!AY106)","v":0},{"$f":"SUM(MOS_Table_3!BE106:BG106)","v":0},{"$f":"MOS_Table_3!BD106","v":0},{"$f":"MOS_Table_3!BJ106","v":0},{"$f":"MOS_Table_3!BH106","v":0},{"$f":"MOS_Table_3!BM106","v":0},{"$f":"SUM(MOS_Table_3!AV106,MOS_Table_3!BP106,MOS_Table_3!BQ106)","v":0},0,null,null,"Montenegro",98,{"$f":"MOS_Table_4!BH106","v":0},{"$f":"MOS_Table_4!BI106","v":0},{"$f":"MOS_Table_4!BJ106+MOS_Table_4!BK106+MOS_Table_4!BL106","v":0},0,{"$f":"MOS_Table_4!BO106","v":0},{"$f":"MOS_Table_4!BP106","v":0},{"$f":"MOS_Table_4!BT106+MOS_Table_4!BU106+MOS_Table_4!BQ106","v":0},{"$f":"MOS_Table_4!BW106+MOS_Table_4!BX106+MOS_Table_4!BY106","v":0},{"$f":"MOS_Table_4!BV106","v":0},{"$f":"MOS_Table_4!CB106","v":0},{"$f":"MOS_Table_4!BZ106","v":0},{"$f":"MOS_Table_4!CE106","v":0},{"$f":"MOS_Table_4!BN106+MOS_Table_4!CH106+MOS_Table_4!CI106","v":0},0,null,null,null,null,null,null,null,null,null,null,null,null,null,null,null,null,null,null,null,null,null,null,null,null,null,null,null,null,null,null,null,null,null,null,null,null,null,null,null,null,null,null,null,null,null,null,"Montenegro",98,null,null,null,null,null,0,null,null,null,null,null,null,null,null,null,null,null,null,null,null,null,null,null,null,null,null,null,null,0,0,null,null,"Montenegro",98,null,null,null,null,null,0,null,null,null,null,null,null,null,null,null,null,null,null,null,null,null,null,null,null,null,null,null,null,0,0]
[null,null,null,null,null,null,null,null,null,null,null,null,null,null,null,null,null,null,null,null,null,null,null,null,null,null,null,null,null,null,null,null,null,null,null,null,null,null,null,null,"Morocco",99,{"$f":"MOS_Table_3!AP107","v":0},{"$f":"MOS_Table_3!AQ107","v":0},{"$f":"SUM(MOS_Table_3!AR107,MOS_Table_3!AS107,MOS_Table_3!AT107)","v":0},0,{"$f":"MOS_Table_3!AW107","v":0},{"$f":"MOS_Table_3!AX107","v":0},{"$f":"SUM(MOS_Table_3!BB107,MOS_Table_3!BC107,MOS_Table_3!AY107)","v":0},{"$f":"SUM(MOS_Table_3!BE107:BG107)","v":0},{"$f":"MOS_Table_3!BD107","v":0},{"$f":"MOS_Table_3!BJ107","v":0},{"$f":"MOS_Table_3!BH107","v":0},{"$f":"MOS_Table_3!BM107","v":0},{"$f":"SUM(MOS_Table_3!AV107,MOS_Table_3!BP107,MOS_Table_3!BQ107)","v":0},0,null,null,"Morocco",99,{"$f":"MOS_Table_4!BH107","v":0},{"$f":"MOS_Table_4!BI107","v":0},{"$f":"MOS_Table_4!BJ107+MOS_Table_4!BK107+MOS_Table_4!BL107","v":0},0,{"$f":"MOS_Table_4!BO107","v":0},{"$f":"MOS_Table_4!BP107","v":0},{"$f":"MOS_Table_4!BT107+MOS_Table_4!BU107+MOS_Table_4!BQ107","v":0},{"$f":"MOS_Table_4!BW107+MOS_Table_4!BX107+MOS_Table_4!BY107","v":0},{"$f":"MOS_Table_4!BV107","v":0},{"$f":"MOS_Table_4!CB107","v":0},{"$f":"MOS_Table_4!BZ107","v":0},{"$f":"MOS_Table_4!CE107","v":0},{"$f":"MOS_Table_4!BN107+MOS_Table_4!CH107+MOS_Table_4!CI107","v":0},0,null,null,null,null,null,null,null,null,null,null,null,null,null,null,null,null,null,null,null,null,null,null,null,null,null,null,null,null,null,null,null,null,null,null,null,null,null,null,null,null,null,null,null,null,null,null,"Morocco",99,null,null,null,null,null,0,null,null,null,null,null,null,null,null,null,null,null,null,null,null,null,null,null,null,null,null,null,null,0,0,null,null,"Morocco",99,null,null,null,null,null,0,null,null,null,null,null,null,null,null,null,null,null,null,null,null,null,null,null,null,null,null,null,null,0,0]
[null,null,null,null,null,null,null,null,null,null,null,null,null,null,null,null,null,null,null,null,null,null,null,null,null,null,null,null,null,null,null,null,null,null,null,null,null,null,null,null,"Mozambique",100,{"$f":"MOS_Table_3!AP108","v":0},{"$f":"MOS_Table_3!AQ108","v":0},{"$f":"SUM(MOS_Table_3!AR108,MOS_Table_3!AS108,MOS_Table_3!AT108)","v":0},0,{"$f":"MOS_Table_3!AW108","v":0},{"$f":"MOS_Table_3!AX108","v":0},{"$f":"SUM(MOS_Table_3!BB108,MOS_Table_3!BC108,MOS_Table_3!AY108)","v":0},{"$f":"SUM(MOS_Table_3!BE108:BG108)","v":0},{"$f":"MOS_Table_3!BD108","v":0},{"$f":"MOS_Table_3!BJ108","v":0},{"$f":"MOS_Table_3!BH108","v":0},{"$f":"MOS_Table_3!BM108","v":0},{"$f":"SUM(MOS_Table_3!AV108,MOS_Table_3!BP108,MOS_Table_3!BQ108)","v":0},0,null,null,"Mozambique",100,{"$f":"MOS_Table_4!BH108","v":0},{"$f":"MOS_Table_4!BI108","v":0},{"$f":"MOS_Table_4!BJ108+MOS_Table_4!BK108+MOS_Table_4!BL108","v":0},0,{"$f":"MOS_Table_4!BO108","v":0},{"$f":"MOS_Table_4!BP108","v":0},{"$f":"MOS_Table_4!BT108+MOS_Table_4!BU108+MOS_Table_4!BQ108","v":0},{"$f":"MOS_Table_4!BW108+MOS_Table_4!BX108+MOS_Table_4!BY108","v":0},{"$f":"MOS_Table_4!BV108","v":0},{"$f":"MOS_Table_4!CB108","v":0},{"$f":"MOS_Table_4!BZ108","v":0},{"$f":"MOS_Table_4!CE108","v":0},{"$f":"MOS_Table_4!BN108+MOS_Table_4!CH108+MOS_Table_4!CI108","v":0},0,null,null,null,null,null,null,null,null,null,null,null,null,null,null,null,null,null,null,null,null,null,null,null,null,null,null,null,null,null,null,null,null,null,null,null,null,null,null,null,null,null,null,null,null,null,null,"Mozambique",100,null,null,null,null,null,0,null,null,null,null,null,null,null,null,null,null,null,null,null,null,null,null,null,null,null,null,null,null,0,0,null,null,"Mozambique",100,null,null,null,null,null,0,null,null,null,null,null,null,null,null,null,null,null,null,null,null,null,null,null,null,null,null,null,null,0,0]
[null,null,null,null,null,null,null,null,null,null,null,null,null,null,null,null,null,null,null,null,null,null,null,null,null,null,null,null,null,null,null,null,null,null,null,null,null,null,null,null,"Myanmar",101,{"$f":"MOS_Table_3!AP109","v":0},{"$f":"MOS_Table_3!AQ109","v":0},{"$f":"SUM(MOS_Table_3!AR109,MOS_Table_3!AS109,MOS_Table_3!AT109)","v":0},0,{"$f":"MOS_Table_3!AW109","v":0},{"$f":"MOS_Table_3!AX109","v":0},{"$f":"SUM(MOS_Table_3!BB109,MOS_Table_3!BC109,MOS_Table_3!AY109)","v":0},{"$f":"SUM(MOS_Table_3!BE109:BG109)","v":0},{"$f":"MOS_Table_3!BD109","v":0},{"$f":"MOS_Table_3!BJ109","v":0},{"$f":"MOS_Table_3!BH109","v":0},{"$f":"MOS_Table_3!BM109","v":0},{"$f":"SUM(MOS_Table_3!AV109,MOS_Table_3!BP109,MOS_Table_3!BQ109)","v":0},0,null,null,"Myanmar",101,{"$f":"MOS_Table_4!BH109","v":0},{"$f":"MOS_Table_4!BI109","v":0},{"$f":"MOS_Table_4!BJ109+MOS_Table_4!BK109+MOS_Table_4!BL109","v":0},0,{"$f":"MOS_Table_4!BO109","v":0},{"$f":"MOS_Table_4!BP109","v":0},{"$f":"MOS_Table_4!BT109+MOS_Table_4!BU109+MOS_Table_4!BQ109","v":0},{"$f":"MOS_Table_4!BW109+MOS_Table_4!BX109+MOS_Table_4!BY109","v":0},{"$f":"MOS_Table_4!BV109","v":0},{"$f":"MOS_Table_4!CB109","v":0},{"$f":"MOS_Table_4!BZ109","v":0},{"$f":"MOS_Table_4!CE109","v":0},{"$f":"MOS_Table_4!BN109+MOS_Table_4!CH109+MOS_Table_4!CI109","v":0},0,null,null,null,null,null,null,null,null,null,null,null,null,null,null,null,null,null,null,null,null,null,null,null,null,null,null,null,null,null,null,null,null,null,null,null,null,null,null,null,null,null,null,null,null,null,null,"Myanmar",101,null,null,null,null,null,0,null,null,null,null,null,null,null,null,null,null,null,null,null,null,null,null,null,null,null,null,null,null,0,0,null,null,"Myanmar",101,null,null,null,null,null,0,null,null,null,null,null,null,null,null,null,null,null,null,null,null,null,null,null,null,null,null,null,null,0,0]
[null,null,null,null,null,null,null,null,null,null,null,null,null,null,null,null,null,null,null,null,null,null,null,null,null,null,null,null,null,null,null,null,null,null,null,null,null,null,null,null,"Namibia",102,{"$f":"MOS_Table_3!AP110","v":0},{"$f":"MOS_Table_3!AQ110","v":0},{"$f":"SUM(MOS_Table_3!AR110,MOS_Table_3!AS110,MOS_Table_3!AT110)","v":0},0,{"$f":"MOS_Table_3!AW110","v":0},{"$f":"MOS_Table_3!AX110","v":0},{"$f":"SUM(MOS_Table_3!BB110,MOS_Table_3!BC110,MOS_Table_3!AY110)","v":0},{"$f":"SUM(MOS_Table_3!BE110:BG110)","v":0},{"$f":"MOS_Table_3!BD110","v":0},{"$f":"MOS_Table_3!BJ110","v":0},{"$f":"MOS_Table_3!BH110","v":0},{"$f":"MOS_Table_3!BM110","v":0},{"$f":"SUM(MOS_Table_3!AV110,MOS_Table_3!BP110,MOS_Table_3!BQ110)","v":0},0,null,null,"Namibia",102,{"$f":"MOS_Table_4!BH110","v":0},{"$f":"MOS_Table_4!BI110","v":0},{"$f":"MOS_Table_4!BJ110+MOS_Table_4!BK110+MOS_Table_4!BL110","v":0},0,{"$f":"MOS_Table_4!BO110","v":0},{"$f":"MOS_Table_4!BP110","v":0},{"$f":"MOS_Table_4!BT110+MOS_Table_4!BU110+MOS_Table_4!BQ110","v":0},{"$f":"MOS_Table_4!BW110+MOS_Table_4!BX110+MOS_Table_4!BY110","v":0},{"$f":"MOS_Table_4!BV110","v":0},{"$f":"MOS_Table_4!CB110","v":0},{"$f":"MOS_Table_4!BZ110","v":0},{"$f":"MOS_Table_4!CE110","v":0},{"$f":"MOS_Table_4!BN110+MOS_Table_4!CH110+MOS_Table_4!CI110","v":0},0,null,null,null,null,null,null,null,null,null,null,null,null,null,null,null,null,null,null,null,null,null,null,null,null,null,null,null,null,null,null,null,null,null,null,null,null,null,null,null,null,null,null,null,null,null,null,"Namibia",102,null,null,null,null,null,0,null,null,null,null,null,null,null,null,null,null,null,null,null,null,null,null,null,null,null,null,null,null,0,0,null,null,"Namibia",102,null,null,null,null,null,0,null,null,null,null,null,null,null,null,null,null,null,null,null,null,null,null,null,null,null,null,null,null,0,0]
[null,null,null,null,null,null,null,null,null,null,null,null,null,null,null,null,null,null,null,null,null,null,null,null,null,null,null,null,null,null,null,null,null,null,null,null,null,null,null,null,"Nepal",103,{"$f":"MOS_Table_3!AP111","v":0},{"$f":"MOS_Table_3!AQ111","v":0},{"$f":"SUM(MOS_Table_3!AR111,MOS_Table_3!AS111,MOS_Table_3!AT111)","v":0},0,{"$f":"MOS_Table_3!AW111","v":0},{"$f":"MOS_Table_3!AX111","v":0},{"$f":"SUM(MOS_Table_3!BB111,MOS_Table_3!BC111,MOS_Table_3!AY111)","v":0},{"$f":"SUM(MOS_Table_3!BE111:BG111)","v":0},{"$f":"MOS_Table_3!BD111","v":0},{"$f":"MOS_Table_3!BJ111","v":0},{"$f":"MOS_Table_3!BH111","v":0},{"$f":"MOS_Table_3!BM111","v":0},{"$f":"SUM(MOS_Table_3!AV111,MOS_Table_3!BP111,MOS_Table_3!BQ111)","v":0},0,null,null,"Nepal",103,{"$f":"MOS_Table_4!BH111","v":0},{"$f":"MOS_Table_4!BI111","v":0},{"$f":"MOS_Table_4!BJ111+MOS_Table_4!BK111+MOS_Table_4!BL111","v":0},0,{"$f":"MOS_Table_4!BO111","v":0},{"$f":"MOS_Table_4!BP111","v":0},{"$f":"MOS_Table_4!BT111+MOS_Table_4!BU111+MOS_Table_4!BQ111","v":0},{"$f":"MOS_Table_4!BW111+MOS_Table_4!BX111+MOS_Table_4!BY111","v":0},{"$f":"MOS_Table_4!BV111","v":0},{"$f":"MOS_Table_4!CB111","v":0},{"$f":"MOS_Table_4!BZ111","v":0},{"$f":"MOS_Table_4!CE111","v":0},{"$f":"MOS_Table_4!BN111+MOS_Table_4!CH111+MOS_Table_4!CI111","v":0},0,null,null,null,null,null,null,null,null,null,null,null,null,null,null,null,null,null,null,null,null,null,null,null,null,null,null,null,null,null,null,null,null,null,null,null,null,null,null,null,null,null,null,null,null,null,null,"Nepal",103,null,null,null,null,null,0,null,null,null,null,null,null,null,null,null,null,null,null,null,null,null,null,null,null,null,null,null,null,0,0,null,null,"Nepal",103,null,null,null,null,null,0,null,null,null,null,null,null,null,null,null,null,null,null,null,null,null,null,null,null,null,null,null,null,0,0]
[null,null,null,null,null,null,null,null,null,null,null,null,null,null,null,null,null,null,null,null,null,null,null,null,null,null,null,null,null,null,null,null,null,null,null,null,null,null,null,null,"Netherlands",104,{"$f":"MOS_Table_3!AP112","v":0},{"$f":"MOS_Table_3!AQ112","v":0},{"$f":"SUM(MOS_Table_3!AR112,MOS_Table_3!AS112,MOS_Table_3!AT112)","v":0},0,{"$f":"MOS_Table_3!AW112","v":0},{"$f":"MOS_Table_3!AX112","v":0},{"$f":"SUM(MOS_Table_3!BB112,MOS_Table_3!BC112,MOS_Table_3!AY112)","v":0},{"$f":"SUM(MOS_Table_3!BE112:BG112)","v":0},{"$f":"MOS_Table_3!BD112","v":0},{"$f":"MOS_Table_3!BJ112","v":0},{"$f":"MOS_Table_3!BH112","v":0},{"$f":"MOS_Table_3!BM112","v":0},{"$f":"SUM(MOS_Table_3!AV112,MOS_Table_3!BP112,MOS_Table_3!BQ112)","v":0},0,null,null,"Netherlands",104,{"$f":"MOS_Table_4!BH112","v":0},{"$f":"MOS_Table_4!BI112","v":0},{"$f":"MOS_Table_4!BJ112+MOS_Table_4!BK112+MOS_Table_4!BL112","v":0},0,{"$f":"MOS_Table_4!BO112","v":0},{"$f":"MOS_Table_4!BP112","v":0},{"$f":"MOS_Table_4!BT112+MOS_Table_4!BU112+MOS_Table_4!BQ112","v":0},{"$f":"MOS_Table_4!BW112+MOS_Table_4!BX112+MOS_Table_4!BY112","v":0},{"$f":"MOS_Table_4!BV112","v":0},{"$f":"MOS_Table_4!CB112","v":0},{"$f":"MOS_Table_4!BZ112","v":0},{"$f":"MOS_Table_4!CE112","v":0},{"$f":"MOS_Table_4!BN112+MOS_Table_4!CH112+MOS_Table_4!CI112","v":0},0,null,null,null,null,null,null,null,null,null,null,null,null,null,null,null,null,null,null,null,null,null,null,null,null,null,null,null,null,null,null,null,null,null,null,null,null,null,null,null,null,null,null,null,null,null,null,"Netherlands",104,null,null,null,null,null,0,null,null,null,null,null,null,null,null,null,null,null,null,null,null,null,null,null,null,null,null,null,null,0,0,null,null,"Netherlands",104,null,null,null,null,null,0,null,null,null,null,null,null,null,null,null,null,null,null,null,null,null,null,null,null,null,null,null,null,0,0]
[null,null,null,null,null,null,null,null,null,null,null,null,null,null,null,null,null,null,null,null,null,null,null,null,null,null,null,null,null,null,null,null,null,null,null,null,null,null,null,null,"New Caledonia",105,{"$f":"MOS_Table_3!AP113","v":0},{"$f":"MOS_Table_3!AQ113","v":0},{"$f":"SUM(MOS_Table_3!AR113,MOS_Table_3!AS113,MOS_Table_3!AT113)","v":0},0,{"$f":"MOS_Table_3!AW113","v":0},{"$f":"MOS_Table_3!AX113","v":0},{"$f":"SUM(MOS_Table_3!BB113,MOS_Table_3!BC113,MOS_Table_3!AY113)","v":0},{"$f":"SUM(MOS_Table_3!BE113:BG113)","v":0},{"$f":"MOS_Table_3!BD113","v":0},{"$f":"MOS_Table_3!BJ113","v":0},{"$f":"MOS_Table_3!BH113","v":0},{"$f":"MOS_Table_3!BM113","v":0},{"$f":"SUM(MOS_Table_3!AV113,MOS_Table_3!BP113,MOS_Table_3!BQ113)","v":0},0,null,null,"New Caledonia",105,{"$f":"MOS_Table_4!BH113","v":0},{"$f":"MOS_Table_4!BI113","v":0},{"$f":"MOS_Table_4!BJ113+MOS_Table_4!BK113+MOS_Table_4!BL113","v":0},0,{"$f":"MOS_Table_4!BO113","v":0},{"$f":"MOS_Table_4!BP113","v":0},{"$f":"MOS_Table_4!BT113+MOS_Table_4!BU113+MOS_Table_4!BQ113","v":0},{"$f":"MOS_Table_4!BW113+MOS_Table_4!BX113+MOS_Table_4!BY113","v":0},{"$f":"MOS_Table_4!BV113","v":0},{"$f":"MOS_Table_4!CB113","v":0},{"$f":"MOS_Table_4!BZ113","v":0},{"$f":"MOS_Table_4!CE113","v":0},{"$f":"MOS_Table_4!BN113+MOS_Table_4!CH113+MOS_Table_4!CI113","v":0},0,null,null,null,null,null,null,null,null,null,null,null,null,null,null,null,null,null,null,null,null,null,null,null,null,null,null,null,null,null,null,null,null,null,null,null,null,null,null,null,null,null,null,null,null,null,null,"New Caledonia",105,null,null,null,null,null,0,null,null,null,null,null,null,null,null,null,null,null,null,null,null,null,null,null,null,null,null,null,null,0,0,null,null,"New Caledonia",105,null,null,null,null,null,0,null,null,null,null,null,null,null,null,null,null,null,null,null,null,null,null,null,null,null,null,null,null,0,0]
[null,null,null,null,null,null,null,null,null,null,null,null,null,null,null,null,null,null,null,null,null,null,null,null,null,null,null,null,null,null,null,null,null,null,null,null,null,null,null,null,"New Zealand",106,{"$f":"MOS_Table_3!AP114","v":0},{"$f":"MOS_Table_3!AQ114","v":0},{"$f":"SUM(MOS_Table_3!AR114,MOS_Table_3!AS114,MOS_Table_3!AT114)","v":0},0,{"$f":"MOS_Table_3!AW114","v":0},{"$f":"MOS_Table_3!AX114","v":0},{"$f":"SUM(MOS_Table_3!BB114,MOS_Table_3!BC114,MOS_Table_3!AY114)","v":0},{"$f":"SUM(MOS_Table_3!BE114:BG114)","v":0},{"$f":"MOS_Table_3!BD114","v":0},{"$f":"MOS_Table_3!BJ114","v":0},{"$f":"MOS_Table_3!BH114","v":0},{"$f":"MOS_Table_3!BM114","v":0},{"$f":"SUM(MOS_Table_3!AV114,MOS_Table_3!BP114,MOS_Table_3!BQ114)","v":0},0,null,null,"New Zealand",106,{"$f":"MOS_Table_4!BH114","v":0},{"$f":"MOS_Table_4!BI114","v":0},{"$f":"MOS_Table_4!BJ114+MOS_Table_4!BK114+MOS_Table_4!BL114","v":0},0,{"$f":"MOS_Table_4!BO114","v":0},{"$f":"MOS_Table_4!BP114","v":0},{"$f":"MOS_Table_4!BT114+MOS_Table_4!BU114+MOS_Table_4!BQ114","v":0},{"$f":"MOS_Table_4!BW114+MOS_Table_4!BX114+MOS_Table_4!BY114","v":0},{"$f":"MOS_Table_4!BV114","v":0},{"$f":"MOS_Table_4!CB114","v":0},{"$f":"MOS_Table_4!BZ114","v":0},{"$f":"MOS_Table_4!CE114","v":0},{"$f":"MOS_Table_4!BN114+MOS_Table_4!CH114+MOS_Table_4!CI114","v":0},0,null,null,null,null,null,null,null,null,null,null,null,null,null,null,null,null,null,null,null,null,null,null,null,null,null,null,null,null,null,null,null,null,null,null,null,null,null,null,null,null,null,null,null,null,null,null,"New Zealand",106,null,null,null,null,null,0,null,null,null,null,null,null,null,null,null,null,null,null,null,null,null,null,null,null,null,null,null,null,0,0,null,null,"New Zealand",106,null,null,null,null,null,0,null,null,null,null,null,null,null,null,null,null,null,null,null,null,null,null,null,null,null,null,null,null,0,0]
[null,null,null,null,null,null,null,null,null,null,null,null,null,null,null,null,null,null,null,null,null,null,null,null,null,null,null,null,null,null,null,null,null,null,null,null,null,null,null,null,"Niger",107,{"$f":"MOS_Table_3!AP115","v":0},{"$f":"MOS_Table_3!AQ115","v":0},{"$f":"SUM(MOS_Table_3!AR115,MOS_Table_3!AS115,MOS_Table_3!AT115)","v":0},0,{"$f":"MOS_Table_3!AW115","v":0},{"$f":"MOS_Table_3!AX115","v":0},{"$f":"SUM(MOS_Table_3!BB115,MOS_Table_3!BC115,MOS_Table_3!AY115)","v":0},{"$f":"SUM(MOS_Table_3!BE115:BG115)","v":0},{"$f":"MOS_Table_3!BD115","v":0},{"$f":"MOS_Table_3!BJ115","v":0},{"$f":"MOS_Table_3!BH115","v":0},{"$f":"MOS_Table_3!BM115","v":0},{"$f":"SUM(MOS_Table_3!AV115,MOS_Table_3!BP115,MOS_Table_3!BQ115)","v":0},0,null,null,"Niger",107,{"$f":"MOS_Table_4!BH115","v":0},{"$f":"MOS_Table_4!BI115","v":0},{"$f":"MOS_Table_4!BJ115+MOS_Table_4!BK115+MOS_Table_4!BL115","v":0},0,{"$f":"MOS_Table_4!BO115","v":0},{"$f":"MOS_Table_4!BP115","v":0},{"$f":"MOS_Table_4!BT115+MOS_Table_4!BU115+MOS_Table_4!BQ115","v":0},{"$f":"MOS_Table_4!BW115+MOS_Table_4!BX115+MOS_Table_4!BY115","v":0},{"$f":"MOS_Table_4!BV115","v":0},{"$f":"MOS_Table_4!CB115","v":0},{"$f":"MOS_Table_4!BZ115","v":0},{"$f":"MOS_Table_4!CE115","v":0},{"$f":"MOS_Table_4!BN115+MOS_Table_4!CH115+MOS_Table_4!CI115","v":0},0,null,null,null,null,null,null,null,null,null,null,null,null,null,null,null,null,null,null,null,null,null,null,null,null,null,null,null,null,null,null,null,null,null,null,null,null,null,null,null,null,null,null,null,null,null,null,"Niger",107,null,null,null,null,null,0,null,null,null,null,null,null,null,null,null,null,null,null,null,null,null,null,null,null,null,null,null,null,0,0,null,null,"Niger",107,null,null,null,null,null,0,null,null,null,null,null,null,null,null,null,null,null,null,null,null,null,null,null,null,null,null,null,null,0,0]
[null,null,null,null,null,null,null,null,null,null,null,null,null,null,null,null,null,null,null,null,null,null,null,null,null,null,null,null,null,null,null,null,null,null,null,null,null,null,null,null,"Nigeria",108,{"$f":"MOS_Table_3!AP116","v":0},{"$f":"MOS_Table_3!AQ116","v":0},{"$f":"SUM(MOS_Table_3!AR116,MOS_Table_3!AS116,MOS_Table_3!AT116)","v":0},0,{"$f":"MOS_Table_3!AW116","v":0},{"$f":"MOS_Table_3!AX116","v":0},{"$f":"SUM(MOS_Table_3!BB116,MOS_Table_3!BC116,MOS_Table_3!AY116)","v":0},{"$f":"SUM(MOS_Table_3!BE116:BG116)","v":0},{"$f":"MOS_Table_3!BD116","v":0},{"$f":"MOS_Table_3!BJ116","v":0},{"$f":"MOS_Table_3!BH116","v":0},{"$f":"MOS_Table_3!BM116","v":0},{"$f":"SUM(MOS_Table_3!AV116,MOS_Table_3!BP116,MOS_Table_3!BQ116)","v":0},0,null,null,"Nigeria",108,{"$f":"MOS_Table_4!BH116","v":0},{"$f":"MOS_Table_4!BI116","v":0},{"$f":"MOS_Table_4!BJ116+MOS_Table_4!BK116+MOS_Table_4!BL116","v":0},0,{"$f":"MOS_Table_4!BO116","v":0},{"$f":"MOS_Table_4!BP116","v":0},{"$f":"MOS_Table_4!BT116+MOS_Table_4!BU116+MOS_Table_4!BQ116","v":0},{"$f":"MOS_Table_4!BW116+MOS_Table_4!BX116+MOS_Table_4!BY116","v":0},{"$f":"MOS_Table_4!BV116","v":0},{"$f":"MOS_Table_4!CB116","v":0},{"$f":"MOS_Table_4!BZ116","v":0},{"$f":"MOS_Table_4!CE116","v":0},{"$f":"MOS_Table_4!BN116+MOS_Table_4!CH116+MOS_Table_4!CI116","v":0},0,null,null,null,null,null,null,null,null,null,null,null,null,null,null,null,null,null,null,null,null,null,null,null,null,null,null,null,null,null,null,null,null,null,null,null,null,null,null,null,null,null,null,null,null,null,null,"Nigeria",108,null,null,null,null,null,0,null,null,null,null,null,null,null,null,null,null,null,null,null,null,null,null,null,null,null,null,null,null,0,0,null,null,"Nigeria",108,null,null,null,null,null,0,null,null,null,null,null,null,null,null,null,null,null,null,null,null,null,null,null,null,null,null,null,null,0,0]
[null,null,null,null,null,null,null,null,null,null,null,null,null,null,null,null,null,null,null,null,null,null,null,null,null,null,null,null,null,null,null,null,null,null,null,null,null,null,null,null,"North Macedonia",109,{"$f":"MOS_Table_3!AP117","v":0},{"$f":"MOS_Table_3!AQ117","v":0},{"$f":"SUM(MOS_Table_3!AR117,MOS_Table_3!AS117,MOS_Table_3!AT117)","v":0},0,{"$f":"MOS_Table_3!AW117","v":0},{"$f":"MOS_Table_3!AX117","v":0},{"$f":"SUM(MOS_Table_3!BB117,MOS_Table_3!BC117,MOS_Table_3!AY117)","v":0},{"$f":"SUM(MOS_Table_3!BE117:BG117)","v":0},{"$f":"MOS_Table_3!BD117","v":0},{"$f":"MOS_Table_3!BJ117","v":0},{"$f":"MOS_Table_3!BH117","v":0},{"$f":"MOS_Table_3!BM117","v":0},{"$f":"SUM(MOS_Table_3!AV117,MOS_Table_3!BP117,MOS_Table_3!BQ117)","v":0},0,null,null,"North Macedonia",109,{"$f":"MOS_Table_4!BH117","v":0},{"$f":"MOS_Table_4!BI117","v":0},{"$f":"MOS_Table_4!BJ117+MOS_Table_4!BK117+MOS_Table_4!BL117","v":0},0,{"$f":"MOS_Table_4!BO117","v":0},{"$f":"MOS_Table_4!BP117","v":0},{"$f":"MOS_Table_4!BT117+MOS_Table_4!BU117+MOS_Table_4!BQ117","v":0},{"$f":"MOS_Table_4!BW117+MOS_Table_4!BX117+MOS_Table_4!BY117","v":0},{"$f":"MOS_Table_4!BV117","v":0},{"$f":"MOS_Table_4!CB117","v":0},{"$f":"MOS_Table_4!BZ117","v":0},{"$f":"MOS_Table_4!CE117","v":0},{"$f":"MOS_Table_4!BN117+MOS_Table_4!CH117+MOS_Table_4!CI117","v":0},0,null,null,null,null,null,null,null,null,null,null,null,null,null,null,null,null,null,null,null,null,null,null,null,null,null,null,null,null,null,null,null,null,null,null,null,null,null,null,null,null,null,null,null,null,null,null,"North Macedonia",109,null,null,null,null,null,0,null,null,null,null,null,null,null,null,null,null,null,null,null,null,null,null,null,null,null,null,null,null,0,0,null,null,"North Macedonia",109,null,null,null,null,null,0,null,null,null,null,null,null,null,null,null,null,null,null,null,null,null,null,null,null,null,null,null,null,0,0]
[null,null,null,null,null,null,null,null,null,null,null,null,null,null,null,null,null,null,null,null,null,null,null,null,null,null,null,null,null,null,null,null,null,null,null,null,null,null,null,null,"Norway",110,{"$f":"MOS_Table_3!AP118","v":0},{"$f":"MOS_Table_3!AQ118","v":0},{"$f":"SUM(MOS_Table_3!AR118,MOS_Table_3!AS118,MOS_Table_3!AT118)","v":0},0,{"$f":"MOS_Table_3!AW118","v":0},{"$f":"MOS_Table_3!AX118","v":0},{"$f":"SUM(MOS_Table_3!BB118,MOS_Table_3!BC118,MOS_Table_3!AY118)","v":0},{"$f":"SUM(MOS_Table_3!BE118:BG118)","v":0},{"$f":"MOS_Table_3!BD118","v":0},{"$f":"MOS_Table_3!BJ118","v":0},{"$f":"MOS_Table_3!BH118","v":0},{"$f":"MOS_Table_3!BM118","v":0},{"$f":"SUM(MOS_Table_3!AV118,MOS_Table_3!BP118,MOS_Table_3!BQ118)","v":0},0,null,null,"Norway",110,{"$f":"MOS_Table_4!BH118","v":0},{"$f":"MOS_Table_4!BI118","v":0},{"$f":"MOS_Table_4!BJ118+MOS_Table_4!BK118+MOS_Table_4!BL118","v":0},0,{"$f":"MOS_Table_4!BO118","v":0},{"$f":"MOS_Table_4!BP118","v":0},{"$f":"MOS_Table_4!BT118+MOS_Table_4!BU118+MOS_Table_4!BQ118","v":0},{"$f":"MOS_Table_4!BW118+MOS_Table_4!BX118+MOS_Table_4!BY118","v":0},{"$f":"MOS_Table_4!BV118","v":0},{"$f":"MOS_Table_4!CB118","v":0},{"$f":"MOS_Table_4!BZ118","v":0},{"$f":"MOS_Table_4!CE118","v":0},{"$f":"MOS_Table_4!BN118+MOS_Table_4!CH118+MOS_Table_4!CI118","v":0},0,null,null,null,null,null,null,null,null,null,null,null,null,null,null,null,null,null,null,null,null,null,null,null,null,null,null,null,null,null,null,null,null,null,null,null,null,null,null,null,null,null,null,null,null,null,null,"Norway",110,null,null,null,null,null,0,null,null,null,null,null,null,null,null,null,null,null,null,null,null,null,null,null,null,null,null,null,null,0,0,null,null,"Norway",110,null,null,null,null,null,0,null,null,null,null,null,null,null,null,null,null,null,null,null,null,null,null,null,null,null,null,null,null,0,0]
[null,null,null,null,null,null,null,null,null,null,null,null,null,null,null,null,null,null,null,null,null,null,null,null,null,null,null,null,null,null,null,null,null,null,null,null,null,null,null,null,"Oman",111,{"$f":"MOS_Table_3!AP119","v":0},{"$f":"MOS_Table_3!AQ119","v":0},{"$f":"SUM(MOS_Table_3!AR119,MOS_Table_3!AS119,MOS_Table_3!AT119)","v":0},0,{"$f":"MOS_Table_3!AW119","v":0},{"$f":"MOS_Table_3!AX119","v":0},{"$f":"SUM(MOS_Table_3!BB119,MOS_Table_3!BC119,MOS_Table_3!AY119)","v":0},{"$f":"SUM(MOS_Table_3!BE119:BG119)","v":0},{"$f":"MOS_Table_3!BD119","v":0},{"$f":"MOS_Table_3!BJ119","v":0},{"$f":"MOS_Table_3!BH119","v":0},{"$f":"MOS_Table_3!BM119","v":0},{"$f":"SUM(MOS_Table_3!AV119,MOS_Table_3!BP119,MOS_Table_3!BQ119)","v":0},0,null,null,"Oman",111,{"$f":"MOS_Table_4!BH119","v":0},{"$f":"MOS_Table_4!BI119","v":0},{"$f":"MOS_Table_4!BJ119+MOS_Table_4!BK119+MOS_Table_4!BL119","v":0},0,{"$f":"MOS_Table_4!BO119","v":0},{"$f":"MOS_Table_4!BP119","v":0},{"$f":"MOS_Table_4!BT119+MOS_Table_4!BU119+MOS_Table_4!BQ119","v":0},{"$f":"MOS_Table_4!BW119+MOS_Table_4!BX119+MOS_Table_4!BY119","v":0},{"$f":"MOS_Table_4!BV119","v":0},{"$f":"MOS_Table_4!CB119","v":0},{"$f":"MOS_Table_4!BZ119","v":0},{"$f":"MOS_Table_4!CE119","v":0},{"$f":"MOS_Table_4!BN119+MOS_Table_4!CH119+MOS_Table_4!CI119","v":0},0,null,null,null,null,null,null,null,null,null,null,null,null,null,null,null,null,null,null,null,null,null,null,null,null,null,null,null,null,null,null,null,null,null,null,null,null,null,null,null,null,null,null,null,null,null,null,"Oman",111,null,null,null,null,null,0,null,null,null,null,null,null,null,null,null,null,null,null,null,null,null,null,null,null,null,null,null,null,0,0,null,null,"Oman",111,null,null,null,null,null,0,null,null,null,null,null,null,null,null,null,null,null,null,null,null,null,null,null,null,null,null,null,null,0,0]
[null,null,null,null,null,null,null,null,null,null,null,null,null,null,null,null,null,null,null,null,null,null,null,null,null,null,null,null,null,null,null,null,null,null,null,null,null,null,null,null,"Other Africa",112,{"$f":"MOS_Table_3!AP120","v":0},{"$f":"MOS_Table_3!AQ120","v":0},{"$f":"SUM(MOS_Table_3!AR120,MOS_Table_3!AS120,MOS_Table_3!AT120)","v":0},0,{"$f":"MOS_Table_3!AW120","v":0},{"$f":"MOS_Table_3!AX120","v":0},{"$f":"SUM(MOS_Table_3!BB120,MOS_Table_3!BC120,MOS_Table_3!AY120)","v":0},{"$f":"SUM(MOS_Table_3!BE120:BG120)","v":0},{"$f":"MOS_Table_3!BD120","v":0},{"$f":"MOS_Table_3!BJ120","v":0},{"$f":"MOS_Table_3!BH120","v":0},{"$f":"MOS_Table_3!BM120","v":0},{"$f":"SUM(MOS_Table_3!AV120,MOS_Table_3!BP120,MOS_Table_3!BQ120)","v":0},0,null,null,"Other Africa",112,{"$f":"MOS_Table_4!BH120","v":0},{"$f":"MOS_Table_4!BI120","v":0},{"$f":"MOS_Table_4!BJ120+MOS_Table_4!BK120+MOS_Table_4!BL120","v":0},0,{"$f":"MOS_Table_4!BO120","v":0},{"$f":"MOS_Table_4!BP120","v":0},{"$f":"MOS_Table_4!BT120+MOS_Table_4!BU120+MOS_Table_4!BQ120","v":0},{"$f":"MOS_Table_4!BW120+MOS_Table_4!BX120+MOS_Table_4!BY120","v":0},{"$f":"MOS_Table_4!BV120","v":0},{"$f":"MOS_Table_4!CB120","v":0},{"$f":"MOS_Table_4!BZ120","v":0},{"$f":"MOS_Table_4!CE120","v":0},{"$f":"MOS_Table_4!BN120+MOS_Table_4!CH120+MOS_Table_4!CI120","v":0},0,null,null,null,null,null,null,null,null,null,null,null,null,null,null,null,null,null,null,null,null,null,null,null,null,null,null,null,null,null,null,null,null,null,null,null,null,null,null,null,null,null,null,null,null,null,null,"Other Africa",112,null,null,null,null,null,0,null,null,null,null,null,null,null,null,null,null,null,null,null,null,null,null,null,null,null,null,null,null,0,0,null,null,"Other Africa",112,null,null,null,null,null,0,null,null,null,null,null,null,null,null,null,null,null,null,null,null,null,null,null,null,null,null,null,null,0,0]
[null,null,null,null,null,null,null,null,null,null,null,null,null,null,null,null,null,null,null,null,null,null,null,null,null,null,null,null,null,null,null,null,null,null,null,null,null,null,null,null,"Other Asia Oceania",113,{"$f":"MOS_Table_3!AP121","v":0},{"$f":"MOS_Table_3!AQ121","v":0},{"$f":"SUM(MOS_Table_3!AR121,MOS_Table_3!AS121,MOS_Table_3!AT121)","v":0},0,{"$f":"MOS_Table_3!AW121","v":0},{"$f":"MOS_Table_3!AX121","v":0},{"$f":"SUM(MOS_Table_3!BB121,MOS_Table_3!BC121,MOS_Table_3!AY121)","v":0},{"$f":"SUM(MOS_Table_3!BE121:BG121)","v":0},{"$f":"MOS_Table_3!BD121","v":0},{"$f":"MOS_Table_3!BJ121","v":0},{"$f":"MOS_Table_3!BH121","v":0},{"$f":"MOS_Table_3!BM121","v":0},{"$f":"SUM(MOS_Table_3!AV121,MOS_Table_3!BP121,MOS_Table_3!BQ121)","v":0},0,null,null,"Other Asia Oceania",113,{"$f":"MOS_Table_4!BH121","v":0},{"$f":"MOS_Table_4!BI121","v":0},{"$f":"MOS_Table_4!BJ121+MOS_Table_4!BK121+MOS_Table_4!BL121","v":0},0,{"$f":"MOS_Table_4!BO121","v":0},{"$f":"MOS_Table_4!BP121","v":0},{"$f":"MOS_Table_4!BT121+MOS_Table_4!BU121+MOS_Table_4!BQ121","v":0},{"$f":"MOS_Table_4!BW121+MOS_Table_4!BX121+MOS_Table_4!BY121","v":0},{"$f":"MOS_Table_4!BV121","v":0},{"$f":"MOS_Table_4!CB121","v":0},{"$f":"MOS_Table_4!BZ121","v":0},{"$f":"MOS_Table_4!CE121","v":0},{"$f":"MOS_Table_4!BN121+MOS_Table_4!CH121+MOS_Table_4!CI121","v":0},0,null,null,null,null,null,null,null,null,null,null,null,null,null,null,null,null,null,null,null,null,null,null,null,null,null,null,null,null,null,null,null,null,null,null,null,null,null,null,null,null,null,null,null,null,null,null,"Other Asia Oceania",113,null,null,null,null,null,0,null,null,null,null,null,null,null,null,null,null,null,null,null,null,null,null,null,null,null,null,null,null,0,0,null,null,"Other Asia Oceania",113,null,null,null,null,null,0,null,null,null,null,null,null,null,null,null,null,null,null,null,null,null,null,null,null,null,null,null,null,0,0]
[null,null,null,null,null,null,null,null,null,null,null,null,null,null,null,null,null,null,null,null,null,null,null,null,null,null,null,null,null,null,null,null,null,null,null,null,null,null,null,null,"Other Europe",114,{"$f":"MOS_Table_3!AP122","v":0},{"$f":"MOS_Table_3!AQ122","v":0},{"$f":"SUM(MOS_Table_3!AR122,MOS_Table_3!AS122,MOS_Table_3!AT122)","v":0},0,{"$f":"MOS_Table_3!AW122","v":0},{"$f":"MOS_Table_3!AX122","v":0},{"$f":"SUM(MOS_Table_3!BB122,MOS_Table_3!BC122,MOS_Table_3!AY122)","v":0},{"$f":"SUM(MOS_Table_3!BE122:BG122)","v":0},{"$f":"MOS_Table_3!BD122","v":0},{"$f":"MOS_Table_3!BJ122","v":0},{"$f":"MOS_Table_3!BH122","v":0},{"$f":"MOS_Table_3!BM122","v":0},{"$f":"SUM(MOS_Table_3!AV122,MOS_Table_3!BP122,MOS_Table_3!BQ122)","v":0},0,null,null,"Other Europe",114,{"$f":"MOS_Table_4!BH122","v":0},{"$f":"MOS_Table_4!BI122","v":0},{"$f":"MOS_Table_4!BJ122+MOS_Table_4!BK122+MOS_Table_4!BL122","v":0},0,{"$f":"MOS_Table_4!BO122","v":0},{"$f":"MOS_Table_4!BP122","v":0},{"$f":"MOS_Table_4!BT122+MOS_Table_4!BU122+MOS_Table_4!BQ122","v":0},{"$f":"MOS_Table_4!BW122+MOS_Table_4!BX122+MOS_Table_4!BY122","v":0},{"$f":"MOS_Table_4!BV122","v":0},{"$f":"MOS_Table_4!CB122","v":0},{"$f":"MOS_Table_4!BZ122","v":0},{"$f":"MOS_Table_4!CE122","v":0},{"$f":"MOS_Table_4!BN122+MOS_Table_4!CH122+MOS_Table_4!CI122","v":0},0,null,null,null,null,null,null,null,null,null,null,null,null,null,null,null,null,null,null,null,null,null,null,null,null,null,null,null,null,null,null,null,null,null,null,null,null,null,null,null,null,null,null,null,null,null,null,"Other Europe",114,null,null,null,null,null,0,null,null,null,null,null,null,null,null,null,null,null,null,null,null,null,null,null,null,null,null,null,null,0,0,null,null,"Other Europe",114,null,null,null,null,null,0,null,null,null,null,null,null,null,null,null,null,null,null,null,null,null,null,null,null,null,null,null,null,0,0]
[null,null,null,null,null,null,null,null,null,null,null,null,null,null,null,null,null,null,null,null,null,null,null,null,null,null,null,null,null,null,null,null,null,null,null,null,null,null,null,null,"Other Former Soviet Union",115,{"$f":"MOS_Table_3!AP123","v":0},{"$f":"MOS_Table_3!AQ123","v":0},{"$f":"SUM(MOS_Table_3!AR123,MOS_Table_3!AS123,MOS_Table_3!AT123)","v":0},0,{"$f":"MOS_Table_3!AW123","v":0},{"$f":"MOS_Table_3!AX123","v":0},{"$f":"SUM(MOS_Table_3!BB123,MOS_Table_3!BC123,MOS_Table_3!AY123)","v":0},{"$f":"SUM(MOS_Table_3!BE123:BG123)","v":0},{"$f":"MOS_Table_3!BD123","v":0},{"$f":"MOS_Table_3!BJ123","v":0},{"$f":"MOS_Table_3!BH123","v":0},{"$f":"MOS_Table_3!BM123","v":0},{"$f":"SUM(MOS_Table_3!AV123,MOS_Table_3!BP123,MOS_Table_3!BQ123)","v":0},0,null,null,"Other Former Soviet Union",115,{"$f":"MOS_Table_4!BH123","v":0},{"$f":"MOS_Table_4!BI123","v":0},{"$f":"MOS_Table_4!BJ123+MOS_Table_4!BK123+MOS_Table_4!BL123","v":0},0,{"$f":"MOS_Table_4!BO123","v":0},{"$f":"MOS_Table_4!BP123","v":0},{"$f":"MOS_Table_4!BT123+MOS_Table_4!BU123+MOS_Table_4!BQ123","v":0},{"$f":"MOS_Table_4!BW123+MOS_Table_4!BX123+MOS_Table_4!BY123","v":0},{"$f":"MOS_Table_4!BV123","v":0},{"$f":"MOS_Table_4!CB123","v":0},{"$f":"MOS_Table_4!BZ123","v":0},{"$f":"MOS_Table_4!CE123","v":0},{"$f":"MOS_Table_4!BN123+MOS_Table_4!CH123+MOS_Table_4!CI123","v":0},0,null,null,null,null,null,null,null,null,null,null,null,null,null,null,null,null,null,null,null,null,null,null,null,null,null,null,null,null,null,null,null,null,null,null,null,null,null,null,null,null,null,null,null,null,null,null,"Other Former Soviet Union",115,null,null,null,null,null,0,null,null,null,null,null,null,null,null,null,null,null,null,null,null,null,null,null,null,null,null,null,null,0,0,null,null,"Other Former Soviet Union",115,null,null,null,null,null,0,null,null,null,null,null,null,null,null,null,null,null,null,null,null,null,null,null,null,null,null,null,null,0,0]
[null,null,null,null,null,null,null,null,null,null,null,null,null,null,null,null,null,null,null,null,null,null,null,null,null,null,null,null,null,null,null,null,null,null,null,null,null,null,null,null,"Other Near and Middle East",116,{"$f":"MOS_Table_3!AP124","v":0},{"$f":"MOS_Table_3!AQ124","v":0},{"$f":"SUM(MOS_Table_3!AR124,MOS_Table_3!AS124,MOS_Table_3!AT124)","v":0},0,{"$f":"MOS_Table_3!AW124","v":0},{"$f":"MOS_Table_3!AX124","v":0},{"$f":"SUM(MOS_Table_3!BB124,MOS_Table_3!BC124,MOS_Table_3!AY124)","v":0},{"$f":"SUM(MOS_Table_3!BE124:BG124)","v":0},{"$f":"MOS_Table_3!BD124","v":0},{"$f":"MOS_Table_3!BJ124","v":0},{"$f":"MOS_Table_3!BH124","v":0},{"$f":"MOS_Table_3!BM124","v":0},{"$f":"SUM(MOS_Table_3!AV124,MOS_Table_3!BP124,MOS_Table_3!BQ124)","v":0},0,null,null,"Other Near and Middle East",116,{"$f":"MOS_Table_4!BH124","v":0},{"$f":"MOS_Table_4!BI124","v":0},{"$f":"MOS_Table_4!BJ124+MOS_Table_4!BK124+MOS_Table_4!BL124","v":0},0,{"$f":"MOS_Table_4!BO124","v":0},{"$f":"MOS_Table_4!BP124","v":0},{"$f":"MOS_Table_4!BT124+MOS_Table_4!BU124+MOS_Table_4!BQ124","v":0},{"$f":"MOS_Table_4!BW124+MOS_Table_4!BX124+MOS_Table_4!BY124","v":0},{"$f":"MOS_Table_4!BV124","v":0},{"$f":"MOS_Table_4!CB124","v":0},{"$f":"MOS_Table_4!BZ124","v":0},{"$f":"MOS_Table_4!CE124","v":0},{"$f":"MOS_Table_4!BN124+MOS_Table_4!CH124+MOS_Table_4!CI124","v":0},0,null,null,null,null,null,null,null,null,null,null,null,null,null,null,null,null,null,null,null,null,null,null,null,null,null,null,null,null,null,null,null,null,null,null,null,null,null,null,null,null,null,null,null,null,null,null,"Other Near and Middle East",116,null,null,null,null,null,0,null,null,null,null,null,null,null,null,null,null,null,null,null,null,null,null,null,null,null,null,null,null,0,0,null,null,"Other Near and Middle East",116,null,null,null,null,null,0,null,null,null,null,null,null,null,null,null,null,null,null,null,null,null,null,null,null,null,null,null,null,0,0]
[null,null,null,null,null,null,null,null,null,null,null,null,null,null,null,null,null,null,null,null,null,null,null,null,null,null,null,null,null,null,null,null,null,null,null,null,null,null,null,null,"Other Non-OECD Americas",117,{"$f":"MOS_Table_3!AP125","v":0},{"$f":"MOS_Table_3!AQ125","v":0},{"$f":"SUM(MOS_Table_3!AR125,MOS_Table_3!AS125,MOS_Table_3!AT125)","v":0},0,{"$f":"MOS_Table_3!AW125","v":0},{"$f":"MOS_Table_3!AX125","v":0},{"$f":"SUM(MOS_Table_3!BB125,MOS_Table_3!BC125,MOS_Table_3!AY125)","v":0},{"$f":"SUM(MOS_Table_3!BE125:BG125)","v":0},{"$f":"MOS_Table_3!BD125","v":0},{"$f":"MOS_Table_3!BJ125","v":0},{"$f":"MOS_Table_3!BH125","v":0},{"$f":"MOS_Table_3!BM125","v":0},{"$f":"SUM(MOS_Table_3!AV125,MOS_Table_3!BP125,MOS_Table_3!BQ125)","v":0},0,null,null,"Other Non-OECD Americas",117,{"$f":"MOS_Table_4!BH125","v":0},{"$f":"MOS_Table_4!BI125","v":0},{"$f":"MOS_Table_4!BJ125+MOS_Table_4!BK125+MOS_Table_4!BL125","v":0},0,{"$f":"MOS_Table_4!BO125","v":0},{"$f":"MOS_Table_4!BP125","v":0},{"$f":"MOS_Table_4!BT125+MOS_Table_4!BU125+MOS_Table_4!BQ125","v":0},{"$f":"MOS_Table_4!BW125+MOS_Table_4!BX125+MOS_Table_4!BY125","v":0},{"$f":"MOS_Table_4!BV125","v":0},{"$f":"MOS_Table_4!CB125","v":0},{"$f":"MOS_Table_4!BZ125","v":0},{"$f":"MOS_Table_4!CE125","v":0},{"$f":"MOS_Table_4!BN125+MOS_Table_4!CH125+MOS_Table_4!CI125","v":0},0,null,null,null,null,null,null,null,null,null,null,null,null,null,null,null,null,null,null,null,null,null,null,null,null,null,null,null,null,null,null,null,null,null,null,null,null,null,null,null,null,null,null,null,null,null,null,"Other Non-OECD Americas",117,null,null,null,null,null,0,null,null,null,null,null,null,null,null,null,null,null,null,null,null,null,null,null,null,null,null,null,null,0,0,null,null,"Other Non-OECD Americas",117,null,null,null,null,null,0,null,null,null,null,null,null,null,null,null,null,null,null,null,null,null,null,null,null,null,null,null,null,0,0]
[null,null,null,null,null,null,null,null,null,null,null,null,null,null,null,null,null,null,null,null,null,null,null,null,null,null,null,null,null,null,null,null,null,null,null,null,null,null,null,null,"Pakistan",118,{"$f":"MOS_Table_3!AP126","v":0},{"$f":"MOS_Table_3!AQ126","v":0},{"$f":"SUM(MOS_Table_3!AR126,MOS_Table_3!AS126,MOS_Table_3!AT126)","v":0},0,{"$f":"MOS_Table_3!AW126","v":0},{"$f":"MOS_Table_3!AX126","v":0},{"$f":"SUM(MOS_Table_3!BB126,MOS_Table_3!BC126,MOS_Table_3!AY126)","v":0},{"$f":"SUM(MOS_Table_3!BE126:BG126)","v":0},{"$f":"MOS_Table_3!BD126","v":0},{"$f":"MOS_Table_3!BJ126","v":0},{"$f":"MOS_Table_3!BH126","v":0},{"$f":"MOS_Table_3!BM126","v":0},{"$f":"SUM(MOS_Table_3!AV126,MOS_Table_3!BP126,MOS_Table_3!BQ126)","v":0},0,null,null,"Pakistan",118,{"$f":"MOS_Table_4!BH126","v":0},{"$f":"MOS_Table_4!BI126","v":0},{"$f":"MOS_Table_4!BJ126+MOS_Table_4!BK126+MOS_Table_4!BL126","v":0},0,{"$f":"MOS_Table_4!BO126","v":0},{"$f":"MOS_Table_4!BP126","v":0},{"$f":"MOS_Table_4!BT126+MOS_Table_4!BU126+MOS_Table_4!BQ126","v":0},{"$f":"MOS_Table_4!BW126+MOS_Table_4!BX126+MOS_Table_4!BY126","v":0},{"$f":"MOS_Table_4!BV126","v":0},{"$f":"MOS_Table_4!CB126","v":0},{"$f":"MOS_Table_4!BZ126","v":0},{"$f":"MOS_Table_4!CE126","v":0},{"$f":"MOS_Table_4!BN126+MOS_Table_4!CH126+MOS_Table_4!CI126","v":0},0,null,null,null,null,null,null,null,null,null,null,null,null,null,null,null,null,null,null,null,null,null,null,null,null,null,null,null,null,null,null,null,null,null,null,null,null,null,null,null,null,null,null,null,null,null,null,"Pakistan",118,null,null,null,null,null,0,null,null,null,null,null,null,null,null,null,null,null,null,null,null,null,null,null,null,null,null,null,null,0,0,null,null,"Pakistan",118,null,null,null,null,null,0,null,null,null,null,null,null,null,null,null,null,null,null,null,null,null,null,null,null,null,null,null,null,0,0]
[null,null,null,null,null,null,null,null,null,null,null,null,null,null,null,null,null,null,null,null,null,null,null,null,null,null,null,null,null,null,null,null,null,null,null,null,null,null,null,null,"Panama",119,{"$f":"MOS_Table_3!AP127","v":0},{"$f":"MOS_Table_3!AQ127","v":0},{"$f":"SUM(MOS_Table_3!AR127,MOS_Table_3!AS127,MOS_Table_3!AT127)","v":0},0,{"$f":"MOS_Table_3!AW127","v":0},{"$f":"MOS_Table_3!AX127","v":0},{"$f":"SUM(MOS_Table_3!BB127,MOS_Table_3!BC127,MOS_Table_3!AY127)","v":0},{"$f":"SUM(MOS_Table_3!BE127:BG127)","v":0},{"$f":"MOS_Table_3!BD127","v":0},{"$f":"MOS_Table_3!BJ127","v":0},{"$f":"MOS_Table_3!BH127","v":0},{"$f":"MOS_Table_3!BM127","v":0},{"$f":"SUM(MOS_Table_3!AV127,MOS_Table_3!BP127,MOS_Table_3!BQ127)","v":0},0,null,null,"Panama",119,{"$f":"MOS_Table_4!BH127","v":0},{"$f":"MOS_Table_4!BI127","v":0},{"$f":"MOS_Table_4!BJ127+MOS_Table_4!BK127+MOS_Table_4!BL127","v":0},0,{"$f":"MOS_Table_4!BO127","v":0},{"$f":"MOS_Table_4!BP127","v":0},{"$f":"MOS_Table_4!BT127+MOS_Table_4!BU127+MOS_Table_4!BQ127","v":0},{"$f":"MOS_Table_4!BW127+MOS_Table_4!BX127+MOS_Table_4!BY127","v":0},{"$f":"MOS_Table_4!BV127","v":0},{"$f":"MOS_Table_4!CB127","v":0},{"$f":"MOS_Table_4!BZ127","v":0},{"$f":"MOS_Table_4!CE127","v":0},{"$f":"MOS_Table_4!BN127+MOS_Table_4!CH127+MOS_Table_4!CI127","v":0},0,null,null,null,null,null,null,null,null,null,null,null,null,null,null,null,null,null,null,null,null,null,null,null,null,null,null,null,null,null,null,null,null,null,null,null,null,null,null,null,null,null,null,null,null,null,null,"Panama",119,null,null,null,null,null,0,null,null,null,null,null,null,null,null,null,null,null,null,null,null,null,null,null,null,null,null,null,null,0,0,null,null,"Panama",119,null,null,null,null,null,0,null,null,null,null,null,null,null,null,null,null,null,null,null,null,null,null,null,null,null,null,null,null,0,0]
[null,null,null,null,null,null,null,null,null,null,null,null,null,null,null,null,null,null,null,null,null,null,null,null,null,null,null,null,null,null,null,null,null,null,null,null,null,null,null,null,"Papua New Guinea",120,{"$f":"MOS_Table_3!AP128","v":0},{"$f":"MOS_Table_3!AQ128","v":0},{"$f":"SUM(MOS_Table_3!AR128,MOS_Table_3!AS128,MOS_Table_3!AT128)","v":0},0,{"$f":"MOS_Table_3!AW128","v":0},{"$f":"MOS_Table_3!AX128","v":0},{"$f":"SUM(MOS_Table_3!BB128,MOS_Table_3!BC128,MOS_Table_3!AY128)","v":0},{"$f":"SUM(MOS_Table_3!BE128:BG128)","v":0},{"$f":"MOS_Table_3!BD128","v":0},{"$f":"MOS_Table_3!BJ128","v":0},{"$f":"MOS_Table_3!BH128","v":0},{"$f":"MOS_Table_3!BM128","v":0},{"$f":"SUM(MOS_Table_3!AV128,MOS_Table_3!BP128,MOS_Table_3!BQ128)","v":0},0,null,null,"Papua New Guinea",120,{"$f":"MOS_Table_4!BH128","v":0},{"$f":"MOS_Table_4!BI128","v":0},{"$f":"MOS_Table_4!BJ128+MOS_Table_4!BK128+MOS_Table_4!BL128","v":0},0,{"$f":"MOS_Table_4!BO128","v":0},{"$f":"MOS_Table_4!BP128","v":0},{"$f":"MOS_Table_4!BT128+MOS_Table_4!BU128+MOS_Table_4!BQ128","v":0},{"$f":"MOS_Table_4!BW128+MOS_Table_4!BX128+MOS_Table_4!BY128","v":0},{"$f":"MOS_Table_4!BV128","v":0},{"$f":"MOS_Table_4!CB128","v":0},{"$f":"MOS_Table_4!BZ128","v":0},{"$f":"MOS_Table_4!CE128","v":0},{"$f":"MOS_Table_4!BN128+MOS_Table_4!CH128+MOS_Table_4!CI128","v":0},0,null,null,null,null,null,null,null,null,null,null,null,null,null,null,null,null,null,null,null,null,null,null,null,null,null,null,null,null,null,null,null,null,null,null,null,null,null,null,null,null,null,null,null,null,null,null,"Papua New Guinea",120,null,null,null,null,null,0,null,null,null,null,null,null,null,null,null,null,null,null,null,null,null,null,null,null,null,null,null,null,0,0,null,null,"Papua New Guinea",120,null,null,null,null,null,0,null,null,null,null,null,null,null,null,null,null,null,null,null,null,null,null,null,null,null,null,null,null,0,0]
[null,null,null,null,null,null,null,null,null,null,null,null,null,null,null,null,null,null,null,null,null,null,null,null,null,null,null,null,null,null,null,null,null,null,null,null,null,null,null,null,"Peru",121,{"$f":"MOS_Table_3!AP129","v":0},{"$f":"MOS_Table_3!AQ129","v":0},{"$f":"SUM(MOS_Table_3!AR129,MOS_Table_3!AS129,MOS_Table_3!AT129)","v":0},0,{"$f":"MOS_Table_3!AW129","v":0},{"$f":"MOS_Table_3!AX129","v":0},{"$f":"SUM(MOS_Table_3!BB129,MOS_Table_3!BC129,MOS_Table_3!AY129)","v":0},{"$f":"SUM(MOS_Table_3!BE129:BG129)","v":0},{"$f":"MOS_Table_3!BD129","v":0},{"$f":"MOS_Table_3!BJ129","v":0},{"$f":"MOS_Table_3!BH129","v":0},{"$f":"MOS_Table_3!BM129","v":0},{"$f":"SUM(MOS_Table_3!AV129,MOS_Table_3!BP129,MOS_Table_3!BQ129)","v":0},0,null,null,"Peru",121,{"$f":"MOS_Table_4!BH129","v":0},{"$f":"MOS_Table_4!BI129","v":0},{"$f":"MOS_Table_4!BJ129+MOS_Table_4!BK129+MOS_Table_4!BL129","v":0},0,{"$f":"MOS_Table_4!BO129","v":0},{"$f":"MOS_Table_4!BP129","v":0},{"$f":"MOS_Table_4!BT129+MOS_Table_4!BU129+MOS_Table_4!BQ129","v":0},{"$f":"MOS_Table_4!BW129+MOS_Table_4!BX129+MOS_Table_4!BY129","v":0},{"$f":"MOS_Table_4!BV129","v":0},{"$f":"MOS_Table_4!CB129","v":0},{"$f":"MOS_Table_4!BZ129","v":0},{"$f":"MOS_Table_4!CE129","v":0},{"$f":"MOS_Table_4!BN129+MOS_Table_4!CH129+MOS_Table_4!CI129","v":0},0,null,null,null,null,null,null,null,null,null,null,null,null,null,null,null,null,null,null,null,null,null,null,null,null,null,null,null,null,null,null,null,null,null,null,null,null,null,null,null,null,null,null,null,null,null,null,"Peru",121,null,null,null,null,null,0,null,null,null,null,null,null,null,null,null,null,null,null,null,null,null,null,null,null,null,null,null,null,0,0,null,null,"Peru",121,null,null,null,null,null,0,null,null,null,null,null,null,null,null,null,null,null,null,null,null,null,null,null,null,null,null,null,null,0,0]
[null,null,null,null,null,null,null,null,null,null,null,null,null,null,null,null,null,null,null,null,null,null,null,null,null,null,null,null,null,null,null,null,null,null,null,null,null,null,null,null,"Philippines",122,{"$f":"MOS_Table_3!AP130","v":0},{"$f":"MOS_Table_3!AQ130","v":0},{"$f":"SUM(MOS_Table_3!AR130,MOS_Table_3!AS130,MOS_Table_3!AT130)","v":0},0,{"$f":"MOS_Table_3!AW130","v":0},{"$f":"MOS_Table_3!AX130","v":0},{"$f":"SUM(MOS_Table_3!BB130,MOS_Table_3!BC130,MOS_Table_3!AY130)","v":0},{"$f":"SUM(MOS_Table_3!BE130:BG130)","v":0},{"$f":"MOS_Table_3!BD130","v":0},{"$f":"MOS_Table_3!BJ130","v":0},{"$f":"MOS_Table_3!BH130","v":0},{"$f":"MOS_Table_3!BM130","v":0},{"$f":"SUM(MOS_Table_3!AV130,MOS_Table_3!BP130,MOS_Table_3!BQ130)","v":0},0,null,null,"Philippines",122,{"$f":"MOS_Table_4!BH130","v":0},{"$f":"MOS_Table_4!BI130","v":0},{"$f":"MOS_Table_4!BJ130+MOS_Table_4!BK130+MOS_Table_4!BL130","v":0},0,{"$f":"MOS_Table_4!BO130","v":0},{"$f":"MOS_Table_4!BP130","v":0},{"$f":"MOS_Table_4!BT130+MOS_Table_4!BU130+MOS_Table_4!BQ130","v":0},{"$f":"MOS_Table_4!BW130+MOS_Table_4!BX130+MOS_Table_4!BY130","v":0},{"$f":"MOS_Table_4!BV130","v":0},{"$f":"MOS_Table_4!CB130","v":0},{"$f":"MOS_Table_4!BZ130","v":0},{"$f":"MOS_Table_4!CE130","v":0},{"$f":"MOS_Table_4!BN130+MOS_Table_4!CH130+MOS_Table_4!CI130","v":0},0,null,null,null,null,null,null,null,null,null,null,null,null,null,null,null,null,null,null,null,null,null,null,null,null,null,null,null,null,null,null,null,null,null,null,null,null,null,null,null,null,null,null,null,null,null,null,"Philippines",122,null,null,null,null,null,0,null,null,null,null,null,null,null,null,null,null,null,null,null,null,null,null,null,null,null,null,null,null,0,0,null,null,"Philippines",122,null,null,null,null,null,0,null,null,null,null,null,null,null,null,null,null,null,null,null,null,null,null,null,null,null,null,null,null,0,0]
[null,null,null,null,null,null,null,null,null,null,null,null,null,null,null,null,null,null,null,null,null,null,null,null,null,null,null,null,null,null,null,null,null,null,null,null,null,null,null,null,"Poland",123,{"$f":"MOS_Table_3!AP131","v":0},{"$f":"MOS_Table_3!AQ131","v":0},{"$f":"SUM(MOS_Table_3!AR131,MOS_Table_3!AS131,MOS_Table_3!AT131)","v":0},0,{"$f":"MOS_Table_3!AW131","v":0},{"$f":"MOS_Table_3!AX131","v":0},{"$f":"SUM(MOS_Table_3!BB131,MOS_Table_3!BC131,MOS_Table_3!AY131)","v":0},{"$f":"SUM(MOS_Table_3!BE131:BG131)","v":0},{"$f":"MOS_Table_3!BD131","v":0},{"$f":"MOS_Table_3!BJ131","v":0},{"$f":"MOS_Table_3!BH131","v":0},{"$f":"MOS_Table_3!BM131","v":0},{"$f":"SUM(MOS_Table_3!AV131,MOS_Table_3!BP131,MOS_Table_3!BQ131)","v":0},0,null,null,"Poland",123,{"$f":"MOS_Table_4!BH131","v":0},{"$f":"MOS_Table_4!BI131","v":0},{"$f":"MOS_Table_4!BJ131+MOS_Table_4!BK131+MOS_Table_4!BL131","v":0},0,{"$f":"MOS_Table_4!BO131","v":0},{"$f":"MOS_Table_4!BP131","v":0},{"$f":"MOS_Table_4!BT131+MOS_Table_4!BU131+MOS_Table_4!BQ131","v":0},{"$f":"MOS_Table_4!BW131+MOS_Table_4!BX131+MOS_Table_4!BY131","v":0},{"$f":"MOS_Table_4!BV131","v":0},{"$f":"MOS_Table_4!CB131","v":0},{"$f":"MOS_Table_4!BZ131","v":0},{"$f":"MOS_Table_4!CE131","v":0},{"$f":"MOS_Table_4!BN131+MOS_Table_4!CH131+MOS_Table_4!CI131","v":0},0,null,null,null,null,null,null,null,null,null,null,null,null,null,null,null,null,null,null,null,null,null,null,null,null,null,null,null,null,null,null,null,null,null,null,null,null,null,null,null,null,null,null,null,null,null,null,"Poland",123,null,null,null,null,null,0,null,null,null,null,null,null,null,null,null,null,null,null,null,null,null,null,null,null,null,null,null,null,0,0,null,null,"Poland",123,null,null,null,null,null,0,null,null,null,null,null,null,null,null,null,null,null,null,null,null,null,null,null,null,null,null,null,null,0,0]
[null,null,null,null,null,null,null,null,null,null,null,null,null,null,null,null,null,null,null,null,null,null,null,null,null,null,null,null,null,null,null,null,null,null,null,null,null,null,null,null,"Portugal",124,{"$f":"MOS_Table_3!AP132","v":0},{"$f":"MOS_Table_3!AQ132","v":0},{"$f":"SUM(MOS_Table_3!AR132,MOS_Table_3!AS132,MOS_Table_3!AT132)","v":0},0,{"$f":"MOS_Table_3!AW132","v":0},{"$f":"MOS_Table_3!AX132","v":0},{"$f":"SUM(MOS_Table_3!BB132,MOS_Table_3!BC132,MOS_Table_3!AY132)","v":0},{"$f":"SUM(MOS_Table_3!BE132:BG132)","v":0},{"$f":"MOS_Table_3!BD132","v":0},{"$f":"MOS_Table_3!BJ132","v":0},{"$f":"MOS_Table_3!BH132","v":0},{"$f":"MOS_Table_3!BM132","v":0},{"$f":"SUM(MOS_Table_3!AV132,MOS_Table_3!BP132,MOS_Table_3!BQ132)","v":0},0,null,null,"Portugal",124,{"$f":"MOS_Table_4!BH132","v":0},{"$f":"MOS_Table_4!BI132","v":0},{"$f":"MOS_Table_4!BJ132+MOS_Table_4!BK132+MOS_Table_4!BL132","v":0},0,{"$f":"MOS_Table_4!BO132","v":0},{"$f":"MOS_Table_4!BP132","v":0},{"$f":"MOS_Table_4!BT132+MOS_Table_4!BU132+MOS_Table_4!BQ132","v":0},{"$f":"MOS_Table_4!BW132+MOS_Table_4!BX132+MOS_Table_4!BY132","v":0},{"$f":"MOS_Table_4!BV132","v":0},{"$f":"MOS_Table_4!CB132","v":0},{"$f":"MOS_Table_4!BZ132","v":0},{"$f":"MOS_Table_4!CE132","v":0},{"$f":"MOS_Table_4!BN132+MOS_Table_4!CH132+MOS_Table_4!CI132","v":0},0,null,null,null,null,null,null,null,null,null,null,null,null,null,null,null,null,null,null,null,null,null,null,null,null,null,null,null,null,null,null,null,null,null,null,null,null,null,null,null,null,null,null,null,null,null,null,"Portugal",124,null,null,null,null,null,0,null,null,null,null,null,null,null,null,null,null,null,null,null,null,null,null,null,null,null,null,null,null,0,0,null,null,"Portugal",124,null,null,null,null,null,0,null,null,null,null,null,null,null,null,null,null,null,null,null,null,null,null,null,null,null,null,null,null,0,0]
[null,null,null,null,null,null,null,null,null,null,null,null,null,null,null,null,null,null,null,null,null,null,null,null,null,null,null,null,null,null,null,null,null,null,null,null,null,null,null,null,"Qatar",125,{"$f":"MOS_Table_3!AP133","v":0},{"$f":"MOS_Table_3!AQ133","v":0},{"$f":"SUM(MOS_Table_3!AR133,MOS_Table_3!AS133,MOS_Table_3!AT133)","v":0},0,{"$f":"MOS_Table_3!AW133","v":0},{"$f":"MOS_Table_3!AX133","v":0},{"$f":"SUM(MOS_Table_3!BB133,MOS_Table_3!BC133,MOS_Table_3!AY133)","v":0},{"$f":"SUM(MOS_Table_3!BE133:BG133)","v":0},{"$f":"MOS_Table_3!BD133","v":0},{"$f":"MOS_Table_3!BJ133","v":0},{"$f":"MOS_Table_3!BH133","v":0},{"$f":"MOS_Table_3!BM133","v":0},{"$f":"SUM(MOS_Table_3!AV133,MOS_Table_3!BP133,MOS_Table_3!BQ133)","v":0},0,null,null,"Qatar",125,{"$f":"MOS_Table_4!BH133","v":0},{"$f":"MOS_Table_4!BI133","v":0},{"$f":"MOS_Table_4!BJ133+MOS_Table_4!BK133+MOS_Table_4!BL133","v":0},0,{"$f":"MOS_Table_4!BO133","v":0},{"$f":"MOS_Table_4!BP133","v":0},{"$f":"MOS_Table_4!BT133+MOS_Table_4!BU133+MOS_Table_4!BQ133","v":0},{"$f":"MOS_Table_4!BW133+MOS_Table_4!BX133+MOS_Table_4!BY133","v":0},{"$f":"MOS_Table_4!BV133","v":0},{"$f":"MOS_Table_4!CB133","v":0},{"$f":"MOS_Table_4!BZ133","v":0},{"$f":"MOS_Table_4!CE133","v":0},{"$f":"MOS_Table_4!BN133+MOS_Table_4!CH133+MOS_Table_4!CI133","v":0},0,null,null,null,null,null,null,null,null,null,null,null,null,null,null,null,null,null,null,null,null,null,null,null,null,null,null,null,null,null,null,null,null,null,null,null,null,null,null,null,null,null,null,null,null,null,null,"Qatar",125,null,null,null,null,null,0,null,null,null,null,null,null,null,null,null,null,null,null,null,null,null,null,null,null,null,null,null,null,0,0,null,null,"Qatar",125,null,null,null,null,null,0,null,null,null,null,null,null,null,null,null,null,null,null,null,null,null,null,null,null,null,null,null,null,0,0]
[null,null,null,null,null,null,null,null,null,null,null,null,null,null,null,null,null,null,null,null,null,null,null,null,null,null,null,null,null,null,null,null,null,null,null,null,null,null,null,null,"Romania",126,{"$f":"MOS_Table_3!AP134","v":0},{"$f":"MOS_Table_3!AQ134","v":0},{"$f":"SUM(MOS_Table_3!AR134,MOS_Table_3!AS134,MOS_Table_3!AT134)","v":0},0,{"$f":"MOS_Table_3!AW134","v":0},{"$f":"MOS_Table_3!AX134","v":0},{"$f":"SUM(MOS_Table_3!BB134,MOS_Table_3!BC134,MOS_Table_3!AY134)","v":0},{"$f":"SUM(MOS_Table_3!BE134:BG134)","v":0},{"$f":"MOS_Table_3!BD134","v":0},{"$f":"MOS_Table_3!BJ134","v":0},{"$f":"MOS_Table_3!BH134","v":0},{"$f":"MOS_Table_3!BM134","v":0},{"$f":"SUM(MOS_Table_3!AV134,MOS_Table_3!BP134,MOS_Table_3!BQ134)","v":0},0,null,null,"Romania",126,{"$f":"MOS_Table_4!BH134","v":0},{"$f":"MOS_Table_4!BI134","v":0},{"$f":"MOS_Table_4!BJ134+MOS_Table_4!BK134+MOS_Table_4!BL134","v":0},0,{"$f":"MOS_Table_4!BO134","v":0},{"$f":"MOS_Table_4!BP134","v":0},{"$f":"MOS_Table_4!BT134+MOS_Table_4!BU134+MOS_Table_4!BQ134","v":0},{"$f":"MOS_Table_4!BW134+MOS_Table_4!BX134+MOS_Table_4!BY134","v":0},{"$f":"MOS_Table_4!BV134","v":0},{"$f":"MOS_Table_4!CB134","v":0},{"$f":"MOS_Table_4!BZ134","v":0},{"$f":"MOS_Table_4!CE134","v":0},{"$f":"MOS_Table_4!BN134+MOS_Table_4!CH134+MOS_Table_4!CI134","v":0},0,null,null,null,null,null,null,null,null,null,null,null,null,null,null,null,null,null,null,null,null,null,null,null,null,null,null,null,null,null,null,null,null,null,null,null,null,null,null,null,null,null,null,null,null,null,null,"Romania",126,null,null,null,null,null,0,null,null,null,null,null,null,null,null,null,null,null,null,null,null,null,null,null,null,null,null,null,null,0,0,null,null,"Romania",126,null,null,null,null,null,0,null,null,null,null,null,null,null,null,null,null,null,null,null,null,null,null,null,null,null,null,null,null,0,0]
[null,null,null,null,null,null,null,null,null,null,null,null,null,null,null,null,null,null,null,null,null,null,null,null,null,null,null,null,null,null,null,null,null,null,null,null,null,null,null,null,"Russian Federation",127,{"$f":"MOS_Table_3!AP135","v":0},{"$f":"MOS_Table_3!AQ135","v":0},{"$f":"SUM(MOS_Table_3!AR135,MOS_Table_3!AS135,MOS_Table_3!AT135)","v":0},0,{"$f":"MOS_Table_3!AW135","v":0},{"$f":"MOS_Table_3!AX135","v":0},{"$f":"SUM(MOS_Table_3!BB135,MOS_Table_3!BC135,MOS_Table_3!AY135)","v":0},{"$f":"SUM(MOS_Table_3!BE135:BG135)","v":0},{"$f":"MOS_Table_3!BD135","v":0},{"$f":"MOS_Table_3!BJ135","v":0},{"$f":"MOS_Table_3!BH135","v":0},{"$f":"MOS_Table_3!BM135","v":0},{"$f":"SUM(MOS_Table_3!AV135,MOS_Table_3!BP135,MOS_Table_3!BQ135)","v":0},0,null,null,"Russian Federation",127,{"$f":"MOS_Table_4!BH135","v":0},{"$f":"MOS_Table_4!BI135","v":0},{"$f":"MOS_Table_4!BJ135+MOS_Table_4!BK135+MOS_Table_4!BL135","v":0},0,{"$f":"MOS_Table_4!BO135","v":0},{"$f":"MOS_Table_4!BP135","v":0},{"$f":"MOS_Table_4!BT135+MOS_Table_4!BU135+MOS_Table_4!BQ135","v":0},{"$f":"MOS_Table_4!BW135+MOS_Table_4!BX135+MOS_Table_4!BY135","v":0},{"$f":"MOS_Table_4!BV135","v":0},{"$f":"MOS_Table_4!CB135","v":0},{"$f":"MOS_Table_4!BZ135","v":0},{"$f":"MOS_Table_4!CE135","v":0},{"$f":"MOS_Table_4!BN135+MOS_Table_4!CH135+MOS_Table_4!CI135","v":0},0,null,null,null,null,null,null,null,null,null,null,null,null,null,null,null,null,null,null,null,null,null,null,null,null,null,null,null,null,null,null,null,null,null,null,null,null,null,null,null,null,null,null,null,null,null,null,"Russian Federation",127,null,null,null,null,null,0,null,null,null,null,null,null,null,null,null,null,null,null,null,null,null,null,null,null,null,null,null,null,0,0,null,null,"Russian Federation",127,null,null,null,null,null,0,null,null,null,null,null,null,null,null,null,null,null,null,null,null,null,null,null,null,null,null,null,null,0,0]
[null,null,null,null,null,null,null,null,null,null,null,null,null,null,null,null,null,null,null,null,null,null,null,null,null,null,null,null,null,null,null,null,null,null,null,null,null,null,null,null,"Sao Tome and Principe",128,{"$f":"MOS_Table_3!AP136","v":0},{"$f":"MOS_Table_3!AQ136","v":0},{"$f":"SUM(MOS_Table_3!AR136,MOS_Table_3!AS136,MOS_Table_3!AT136)","v":0},0,{"$f":"MOS_Table_3!AW136","v":0},{"$f":"MOS_Table_3!AX136","v":0},{"$f":"SUM(MOS_Table_3!BB136,MOS_Table_3!BC136,MOS_Table_3!AY136)","v":0},{"$f":"SUM(MOS_Table_3!BE136:BG136)","v":0},{"$f":"MOS_Table_3!BD136","v":0},{"$f":"MOS_Table_3!BJ136","v":0},{"$f":"MOS_Table_3!BH136","v":0},{"$f":"MOS_Table_3!BM136","v":0},{"$f":"SUM(MOS_Table_3!AV136,MOS_Table_3!BP136,MOS_Table_3!BQ136)","v":0},0,null,null,"Sao Tome and Principe",128,{"$f":"MOS_Table_4!BH136","v":0},{"$f":"MOS_Table_4!BI136","v":0},{"$f":"MOS_Table_4!BJ136+MOS_Table_4!BK136+MOS_Table_4!BL136","v":0},0,{"$f":"MOS_Table_4!BO136","v":0},{"$f":"MOS_Table_4!BP136","v":0},{"$f":"MOS_Table_4!BT136+MOS_Table_4!BU136+MOS_Table_4!BQ136","v":0},{"$f":"MOS_Table_4!BW136+MOS_Table_4!BX136+MOS_Table_4!BY136","v":0},{"$f":"MOS_Table_4!BV136","v":0},{"$f":"MOS_Table_4!CB136","v":0},{"$f":"MOS_Table_4!BZ136","v":0},{"$f":"MOS_Table_4!CE136","v":0},{"$f":"MOS_Table_4!BN136+MOS_Table_4!CH136+MOS_Table_4!CI136","v":0},0,null,null,null,null,null,null,null,null,null,null,null,null,null,null,null,null,null,null,null,null,null,null,null,null,null,null,null,null,null,null,null,null,null,null,null,null,null,null,null,null,null,null,null,null,null,null,"Sao Tome and Principe",128,null,null,null,null,null,0,null,null,null,null,null,null,null,null,null,null,null,null,null,null,null,null,null,null,null,null,null,null,0,0,null,null,"Sao Tome and Principe",128,null,null,null,null,null,0,null,null,null,null,null,null,null,null,null,null,null,null,null,null,null,null,null,null,null,null,null,null,0,0]
[null,null,null,null,null,null,null,null,null,null,null,null,null,null,null,null,null,null,null,null,null,null,null,null,null,null,null,null,null,null,null,null,null,null,null,null,null,null,null,null,"Saudi Arabia",129,{"$f":"MOS_Table_3!AP137","v":0},{"$f":"MOS_Table_3!AQ137","v":0},{"$f":"SUM(MOS_Table_3!AR137,MOS_Table_3!AS137,MOS_Table_3!AT137)","v":0},0,{"$f":"MOS_Table_3!AW137","v":0},{"$f":"MOS_Table_3!AX137","v":0},{"$f":"SUM(MOS_Table_3!BB137,MOS_Table_3!BC137,MOS_Table_3!AY137)","v":0},{"$f":"SUM(MOS_Table_3!BE137:BG137)","v":0},{"$f":"MOS_Table_3!BD137","v":0},{"$f":"MOS_Table_3!BJ137","v":0},{"$f":"MOS_Table_3!BH137","v":0},{"$f":"MOS_Table_3!BM137","v":0},{"$f":"SUM(MOS_Table_3!AV137,MOS_Table_3!BP137,MOS_Table_3!BQ137)","v":0},0,null,null,"Saudi Arabia",129,{"$f":"MOS_Table_4!BH137","v":0},{"$f":"MOS_Table_4!BI137","v":0},{"$f":"MOS_Table_4!BJ137+MOS_Table_4!BK137+MOS_Table_4!BL137","v":0},0,{"$f":"MOS_Table_4!BO137","v":0},{"$f":"MOS_Table_4!BP137","v":0},{"$f":"MOS_Table_4!BT137+MOS_Table_4!BU137+MOS_Table_4!BQ137","v":0},{"$f":"MOS_Table_4!BW137+MOS_Table_4!BX137+MOS_Table_4!BY137","v":0},{"$f":"MOS_Table_4!BV137","v":0},{"$f":"MOS_Table_4!CB137","v":0},{"$f":"MOS_Table_4!BZ137","v":0},{"$f":"MOS_Table_4!CE137","v":0},{"$f":"MOS_Table_4!BN137+MOS_Table_4!CH137+MOS_Table_4!CI137","v":0},0,null,null,null,null,null,null,null,null,null,null,null,null,null,null,null,null,null,null,null,null,null,null,null,null,null,null,null,null,null,null,null,null,null,null,null,null,null,null,null,null,null,null,null,null,null,null,"Saudi Arabia",129,null,null,null,null,null,0,null,null,null,null,null,null,null,null,null,null,null,null,null,null,null,null,null,null,null,null,null,null,0,0,null,null,"Saudi Arabia",129,null,null,null,null,null,0,null,null,null,null,null,null,null,null,null,null,null,null,null,null,null,null,null,null,null,null,null,null,0,0]
[null,null,null,null,null,null,null,null,null,null,null,null,null,null,null,null,null,null,null,null,null,null,null,null,null,null,null,null,null,null,null,null,null,null,null,null,null,null,null,null,"Senegal",130,{"$f":"MOS_Table_3!AP138","v":0},{"$f":"MOS_Table_3!AQ138","v":0},{"$f":"SUM(MOS_Table_3!AR138,MOS_Table_3!AS138,MOS_Table_3!AT138)","v":0},0,{"$f":"MOS_Table_3!AW138","v":0},{"$f":"MOS_Table_3!AX138","v":0},{"$f":"SUM(MOS_Table_3!BB138,MOS_Table_3!BC138,MOS_Table_3!AY138)","v":0},{"$f":"SUM(MOS_Table_3!BE138:BG138)","v":0},{"$f":"MOS_Table_3!BD138","v":0},{"$f":"MOS_Table_3!BJ138","v":0},{"$f":"MOS_Table_3!BH138","v":0},{"$f":"MOS_Table_3!BM138","v":0},{"$f":"SUM(MOS_Table_3!AV138,MOS_Table_3!BP138,MOS_Table_3!BQ138)","v":0},0,null,null,"Senegal",130,{"$f":"MOS_Table_4!BH138","v":0},{"$f":"MOS_Table_4!BI138","v":0},{"$f":"MOS_Table_4!BJ138+MOS_Table_4!BK138+MOS_Table_4!BL138","v":0},0,{"$f":"MOS_Table_4!BO138","v":0},{"$f":"MOS_Table_4!BP138","v":0},{"$f":"MOS_Table_4!BT138+MOS_Table_4!BU138+MOS_Table_4!BQ138","v":0},{"$f":"MOS_Table_4!BW138+MOS_Table_4!BX138+MOS_Table_4!BY138","v":0},{"$f":"MOS_Table_4!BV138","v":0},{"$f":"MOS_Table_4!CB138","v":0},{"$f":"MOS_Table_4!BZ138","v":0},{"$f":"MOS_Table_4!CE138","v":0},{"$f":"MOS_Table_4!BN138+MOS_Table_4!CH138+MOS_Table_4!CI138","v":0},0,null,null,null,null,null,null,null,null,null,null,null,null,null,null,null,null,null,null,null,null,null,null,null,null,null,null,null,null,null,null,null,null,null,null,null,null,null,null,null,null,null,null,null,null,null,null,"Senegal",130,null,null,null,null,null,0,null,null,null,null,null,null,null,null,null,null,null,null,null,null,null,null,null,null,null,null,null,null,0,0,null,null,"Senegal",130,null,null,null,null,null,0,null,null,null,null,null,null,null,null,null,null,null,null,null,null,null,null,null,null,null,null,null,null,0,0]
[null,null,null,null,null,null,null,null,null,null,null,null,null,null,null,null,null,null,null,null,null,null,null,null,null,null,null,null,null,null,null,null,null,null,null,null,null,null,null,null,"Serbia",131,{"$f":"MOS_Table_3!AP139","v":0},{"$f":"MOS_Table_3!AQ139","v":0},{"$f":"SUM(MOS_Table_3!AR139,MOS_Table_3!AS139,MOS_Table_3!AT139)","v":0},0,{"$f":"MOS_Table_3!AW139","v":0},{"$f":"MOS_Table_3!AX139","v":0},{"$f":"SUM(MOS_Table_3!BB139,MOS_Table_3!BC139,MOS_Table_3!AY139)","v":0},{"$f":"SUM(MOS_Table_3!BE139:BG139)","v":0},{"$f":"MOS_Table_3!BD139","v":0},{"$f":"MOS_Table_3!BJ139","v":0},{"$f":"MOS_Table_3!BH139","v":0},{"$f":"MOS_Table_3!BM139","v":0},{"$f":"SUM(MOS_Table_3!AV139,MOS_Table_3!BP139,MOS_Table_3!BQ139)","v":0},0,null,null,"Serbia",131,{"$f":"MOS_Table_4!BH139","v":0},{"$f":"MOS_Table_4!BI139","v":0},{"$f":"MOS_Table_4!BJ139+MOS_Table_4!BK139+MOS_Table_4!BL139","v":0},0,{"$f":"MOS_Table_4!BO139","v":0},{"$f":"MOS_Table_4!BP139","v":0},{"$f":"MOS_Table_4!BT139+MOS_Table_4!BU139+MOS_Table_4!BQ139","v":0},{"$f":"MOS_Table_4!BW139+MOS_Table_4!BX139+MOS_Table_4!BY139","v":0},{"$f":"MOS_Table_4!BV139","v":0},{"$f":"MOS_Table_4!CB139","v":0},{"$f":"MOS_Table_4!BZ139","v":0},{"$f":"MOS_Table_4!CE139","v":0},{"$f":"MOS_Table_4!BN139+MOS_Table_4!CH139+MOS_Table_4!CI139","v":0},0,null,null,null,null,null,null,null,null,null,null,null,null,null,null,null,null,null,null,null,null,null,null,null,null,null,null,null,null,null,null,null,null,null,null,null,null,null,null,null,null,null,null,null,null,null,null,"Serbia",131,null,null,null,null,null,0,null,null,null,null,null,null,null,null,null,null,null,null,null,null,null,null,null,null,null,null,null,null,0,0,null,null,"Serbia",131,null,null,null,null,null,0,null,null,null,null,null,null,null,null,null,null,null,null,null,null,null,null,null,null,null,null,null,null,0,0]
[null,null,null,null,null,null,null,null,null,null,null,null,null,null,null,null,null,null,null,null,null,null,null,null,null,null,null,null,null,null,null,null,null,null,null,null,null,null,null,null,"Sierra Leone",132,{"$f":"MOS_Table_3!AP140","v":0},{"$f":"MOS_Table_3!AQ140","v":0},{"$f":"SUM(MOS_Table_3!AR140,MOS_Table_3!AS140,MOS_Table_3!AT140)","v":0},0,{"$f":"MOS_Table_3!AW140","v":0},{"$f":"MOS_Table_3!AX140","v":0},{"$f":"SUM(MOS_Table_3!BB140,MOS_Table_3!BC140,MOS_Table_3!AY140)","v":0},{"$f":"SUM(MOS_Table_3!BE140:BG140)","v":0},{"$f":"MOS_Table_3!BD140","v":0},{"$f":"MOS_Table_3!BJ140","v":0},{"$f":"MOS_Table_3!BH140","v":0},{"$f":"MOS_Table_3!BM140","v":0},{"$f":"SUM(MOS_Table_3!AV140,MOS_Table_3!BP140,MOS_Table_3!BQ140)","v":0},0,null,null,"Sierra Leone",132,{"$f":"MOS_Table_4!BH140","v":0},{"$f":"MOS_Table_4!BI140","v":0},{"$f":"MOS_Table_4!BJ140+MOS_Table_4!BK140+MOS_Table_4!BL140","v":0},0,{"$f":"MOS_Table_4!BO140","v":0},{"$f":"MOS_Table_4!BP140","v":0},{"$f":"MOS_Table_4!BT140+MOS_Table_4!BU140+MOS_Table_4!BQ140","v":0},{"$f":"MOS_Table_4!BW140+MOS_Table_4!BX140+MOS_Table_4!BY140","v":0},{"$f":"MOS_Table_4!BV140","v":0},{"$f":"MOS_Table_4!CB140","v":0},{"$f":"MOS_Table_4!BZ140","v":0},{"$f":"MOS_Table_4!CE140","v":0},{"$f":"MOS_Table_4!BN140+MOS_Table_4!CH140+MOS_Table_4!CI140","v":0},0,null,null,null,null,null,null,null,null,null,null,null,null,null,null,null,null,null,null,null,null,null,null,null,null,null,null,null,null,null,null,null,null,null,null,null,null,null,null,null,null,null,null,null,null,null,null,"Sierra Leone",132,null,null,null,null,null,0,null,null,null,null,null,null,null,null,null,null,null,null,null,null,null,null,null,null,null,null,null,null,0,0,null,null,"Sierra Leone",132,null,null,null,null,null,0,null,null,null,null,null,null,null,null,null,null,null,null,null,null,null,null,null,null,null,null,null,null,0,0]
[null,null,null,null,null,null,null,null,null,null,null,null,null,null,null,null,null,null,null,null,null,null,null,null,null,null,null,null,null,null,null,null,null,null,null,null,null,null,null,null,"Singapore",133,{"$f":"MOS_Table_3!AP141","v":0},{"$f":"MOS_Table_3!AQ141","v":0},{"$f":"SUM(MOS_Table_3!AR141,MOS_Table_3!AS141,MOS_Table_3!AT141)","v":0},0,{"$f":"MOS_Table_3!AW141","v":0},{"$f":"MOS_Table_3!AX141","v":0},{"$f":"SUM(MOS_Table_3!BB141,MOS_Table_3!BC141,MOS_Table_3!AY141)","v":0},{"$f":"SUM(MOS_Table_3!BE141:BG141)","v":0},{"$f":"MOS_Table_3!BD141","v":0},{"$f":"MOS_Table_3!BJ141","v":0},{"$f":"MOS_Table_3!BH141","v":0},{"$f":"MOS_Table_3!BM141","v":0},{"$f":"SUM(MOS_Table_3!AV141,MOS_Table_3!BP141,MOS_Table_3!BQ141)","v":0},0,null,null,"Singapore",133,{"$f":"MOS_Table_4!BH141","v":0},{"$f":"MOS_Table_4!BI141","v":0},{"$f":"MOS_Table_4!BJ141+MOS_Table_4!BK141+MOS_Table_4!BL141","v":0},0,{"$f":"MOS_Table_4!BO141","v":0},{"$f":"MOS_Table_4!BP141","v":0},{"$f":"MOS_Table_4!BT141+MOS_Table_4!BU141+MOS_Table_4!BQ141","v":0},{"$f":"MOS_Table_4!BW141+MOS_Table_4!BX141+MOS_Table_4!BY141","v":0},{"$f":"MOS_Table_4!BV141","v":0},{"$f":"MOS_Table_4!CB141","v":0},{"$f":"MOS_Table_4!BZ141","v":0},{"$f":"MOS_Table_4!CE141","v":0},{"$f":"MOS_Table_4!BN141+MOS_Table_4!CH141+MOS_Table_4!CI141","v":0},0,null,null,null,null,null,null,null,null,null,null,null,null,null,null,null,null,null,null,null,null,null,null,null,null,null,null,null,null,null,null,null,null,null,null,null,null,null,null,null,null,null,null,null,null,null,null,"Singapore",133,null,null,null,null,null,0,null,null,null,null,null,null,null,null,null,null,null,null,null,null,null,null,null,null,null,null,null,null,0,0,null,null,"Singapore",133,null,null,null,null,null,0,null,null,null,null,null,null,null,null,null,null,null,null,null,null,null,null,null,null,null,null,null,null,0,0]
[null,null,null,null,null,null,null,null,null,null,null,null,null,null,null,null,null,null,null,null,null,null,null,null,null,null,null,null,null,null,null,null,null,null,null,null,null,null,null,null,"Slovak Republic",134,{"$f":"MOS_Table_3!AP142","v":0},{"$f":"MOS_Table_3!AQ142","v":0},{"$f":"SUM(MOS_Table_3!AR142,MOS_Table_3!AS142,MOS_Table_3!AT142)","v":0},0,{"$f":"MOS_Table_3!AW142","v":0},{"$f":"MOS_Table_3!AX142","v":0},{"$f":"SUM(MOS_Table_3!BB142,MOS_Table_3!BC142,MOS_Table_3!AY142)","v":0},{"$f":"SUM(MOS_Table_3!BE142:BG142)","v":0},{"$f":"MOS_Table_3!BD142","v":0},{"$f":"MOS_Table_3!BJ142","v":0},{"$f":"MOS_Table_3!BH142","v":0},{"$f":"MOS_Table_3!BM142","v":0},{"$f":"SUM(MOS_Table_3!AV142,MOS_Table_3!BP142,MOS_Table_3!BQ142)","v":0},0,null,null,"Slovak Republic",134,{"$f":"MOS_Table_4!BH142","v":0},{"$f":"MOS_Table_4!BI142","v":0},{"$f":"MOS_Table_4!BJ142+MOS_Table_4!BK142+MOS_Table_4!BL142","v":0},0,{"$f":"MOS_Table_4!BO142","v":0},{"$f":"MOS_Table_4!BP142","v":0},{"$f":"MOS_Table_4!BT142+MOS_Table_4!BU142+MOS_Table_4!BQ142","v":0},{"$f":"MOS_Table_4!BW142+MOS_Table_4!BX142+MOS_Table_4!BY142","v":0},{"$f":"MOS_Table_4!BV142","v":0},{"$f":"MOS_Table_4!CB142","v":0},{"$f":"MOS_Table_4!BZ142","v":0},{"$f":"MOS_Table_4!CE142","v":0},{"$f":"MOS_Table_4!BN142+MOS_Table_4!CH142+MOS_Table_4!CI142","v":0},0,null,null,null,null,null,null,null,null,null,null,null,null,null,null,null,null,null,null,null,null,null,null,null,null,null,null,null,null,null,null,null,null,null,null,null,null,null,null,null,null,null,null,null,null,null,null,"Slovak Republic",134,null,null,null,null,null,0,null,null,null,null,null,null,null,null,null,null,null,null,null,null,null,null,null,null,null,null,null,null,0,0,null,null,"Slovak Republic",134,null,null,null,null,null,0,null,null,null,null,null,null,null,null,null,null,null,null,null,null,null,null,null,null,null,null,null,null,0,0]
[null,null,null,null,null,null,null,null,null,null,null,null,null,null,null,null,null,null,null,null,null,null,null,null,null,null,null,null,null,null,null,null,null,null,null,null,null,null,null,null,"Slovenia",135,{"$f":"MOS_Table_3!AP143","v":0},{"$f":"MOS_Table_3!AQ143","v":0},{"$f":"SUM(MOS_Table_3!AR143,MOS_Table_3!AS143,MOS_Table_3!AT143)","v":0},0,{"$f":"MOS_Table_3!AW143","v":0},{"$f":"MOS_Table_3!AX143","v":0},{"$f":"SUM(MOS_Table_3!BB143,MOS_Table_3!BC143,MOS_Table_3!AY143)","v":0},{"$f":"SUM(MOS_Table_3!BE143:BG143)","v":0},{"$f":"MOS_Table_3!BD143","v":0},{"$f":"MOS_Table_3!BJ143","v":0},{"$f":"MOS_Table_3!BH143","v":0},{"$f":"MOS_Table_3!BM143","v":0},{"$f":"SUM(MOS_Table_3!AV143,MOS_Table_3!BP143,MOS_Table_3!BQ143)","v":0},0,null,null,"Slovenia",135,{"$f":"MOS_Table_4!BH143","v":0},{"$f":"MOS_Table_4!BI143","v":0},{"$f":"MOS_Table_4!BJ143+MOS_Table_4!BK143+MOS_Table_4!BL143","v":0},0,{"$f":"MOS_Table_4!BO143","v":0},{"$f":"MOS_Table_4!BP143","v":0},{"$f":"MOS_Table_4!BT143+MOS_Table_4!BU143+MOS_Table_4!BQ143","v":0},{"$f":"MOS_Table_4!BW143+MOS_Table_4!BX143+MOS_Table_4!BY143","v":0},{"$f":"MOS_Table_4!BV143","v":0},{"$f":"MOS_Table_4!CB143","v":0},{"$f":"MOS_Table_4!BZ143","v":0},{"$f":"MOS_Table_4!CE143","v":0},{"$f":"MOS_Table_4!BN143+MOS_Table_4!CH143+MOS_Table_4!CI143","v":0},0,null,null,null,null,null,null,null,null,null,null,null,null,null,null,null,null,null,null,null,null,null,null,null,null,null,null,null,null,null,null,null,null,null,null,null,null,null,null,null,null,null,null,null,null,null,null,"Slovenia",135,null,null,null,null,null,0,null,null,null,null,null,null,null,null,null,null,null,null,null,null,null,null,null,null,null,null,null,null,0,0,null,null,"Slovenia",135,null,null,null,null,null,0,null,null,null,null,null,null,null,null,null,null,null,null,null,null,null,null,null,null,null,null,null,null,0,0]
[null,null,null,null,null,null,null,null,null,null,null,null,null,null,null,null,null,null,null,null,null,null,null,null,null,null,null,null,null,null,null,null,null,null,null,null,null,null,null,null,"South Africa",136,{"$f":"MOS_Table_3!AP144","v":0},{"$f":"MOS_Table_3!AQ144","v":0},{"$f":"SUM(MOS_Table_3!AR144,MOS_Table_3!AS144,MOS_Table_3!AT144)","v":0},0,{"$f":"MOS_Table_3!AW144","v":0},{"$f":"MOS_Table_3!AX144","v":0},{"$f":"SUM(MOS_Table_3!BB144,MOS_Table_3!BC144,MOS_Table_3!AY144)","v":0},{"$f":"SUM(MOS_Table_3!BE144:BG144)","v":0},{"$f":"MOS_Table_3!BD144","v":0},{"$f":"MOS_Table_3!BJ144","v":0},{"$f":"MOS_Table_3!BH144","v":0},{"$f":"MOS_Table_3!BM144","v":0},{"$f":"SUM(MOS_Table_3!AV144,MOS_Table_3!BP144,MOS_Table_3!BQ144)","v":0},0,null,null,"South Africa",136,{"$f":"MOS_Table_4!BH144","v":0},{"$f":"MOS_Table_4!BI144","v":0},{"$f":"MOS_Table_4!BJ144+MOS_Table_4!BK144+MOS_Table_4!BL144","v":0},0,{"$f":"MOS_Table_4!BO144","v":0},{"$f":"MOS_Table_4!BP144","v":0},{"$f":"MOS_Table_4!BT144+MOS_Table_4!BU144+MOS_Table_4!BQ144","v":0},{"$f":"MOS_Table_4!BW144+MOS_Table_4!BX144+MOS_Table_4!BY144","v":0},{"$f":"MOS_Table_4!BV144","v":0},{"$f":"MOS_Table_4!CB144","v":0},{"$f":"MOS_Table_4!BZ144","v":0},{"$f":"MOS_Table_4!CE144","v":0},{"$f":"MOS_Table_4!BN144+MOS_Table_4!CH144+MOS_Table_4!CI144","v":0},0,null,null,null,null,null,null,null,null,null,null,null,null,null,null,null,null,null,null,null,null,null,null,null,null,null,null,null,null,null,null,null,null,null,null,null,null,null,null,null,null,null,null,null,null,null,null,"South Africa",136,null,null,null,null,null,0,null,null,null,null,null,null,null,null,null,null,null,null,null,null,null,null,null,null,null,null,null,null,0,0,null,null,"South Africa",136,null,null,null,null,null,0,null,null,null,null,null,null,null,null,null,null,null,null,null,null,null,null,null,null,null,null,null,null,0,0]
[null,null,null,null,null,null,null,null,null,null,null,null,null,null,null,null,null,null,null,null,null,null,null,null,null,null,null,null,null,null,null,null,null,null,null,null,null,null,null,null,"South Sudan",137,{"$f":"MOS_Table_3!AP145","v":0},{"$f":"MOS_Table_3!AQ145","v":0},{"$f":"SUM(MOS_Table_3!AR145,MOS_Table_3!AS145,MOS_Table_3!AT145)","v":0},0,{"$f":"MOS_Table_3!AW145","v":0},{"$f":"MOS_Table_3!AX145","v":0},{"$f":"SUM(MOS_Table_3!BB145,MOS_Table_3!BC145,MOS_Table_3!AY145)","v":0},{"$f":"SUM(MOS_Table_3!BE145:BG145)","v":0},{"$f":"MOS_Table_3!BD145","v":0},{"$f":"MOS_Table_3!BJ145","v":0},{"$f":"MOS_Table_3!BH145","v":0},{"$f":"MOS_Table_3!BM145","v":0},{"$f":"SUM(MOS_Table_3!AV145,MOS_Table_3!BP145,MOS_Table_3!BQ145)","v":0},0,null,null,"South Sudan",137,{"$f":"MOS_Table_4!BH145","v":0},{"$f":"MOS_Table_4!BI145","v":0},{"$f":"MOS_Table_4!BJ145+MOS_Table_4!BK145+MOS_Table_4!BL145","v":0},0,{"$f":"MOS_Table_4!BO145","v":0},{"$f":"MOS_Table_4!BP145","v":0},{"$f":"MOS_Table_4!BT145+MOS_Table_4!BU145+MOS_Table_4!BQ145","v":0},{"$f":"MOS_Table_4!BW145+MOS_Table_4!BX145+MOS_Table_4!BY145","v":0},{"$f":"MOS_Table_4!BV145","v":0},{"$f":"MOS_Table_4!CB145","v":0},{"$f":"MOS_Table_4!BZ145","v":0},{"$f":"MOS_Table_4!CE145","v":0},{"$f":"MOS_Table_4!BN145+MOS_Table_4!CH145+MOS_Table_4!CI145","v":0},0,null,null,null,null,null,null,null,null,null,null,null,null,null,null,null,null,null,null,null,null,null,null,null,null,null,null,null,null,null,null,null,null,null,null,null,null,null,null,null,null,null,null,null,null,null,null,"South Sudan",137,null,null,null,null,null,0,null,null,null,null,null,null,null,null,null,null,null,null,null,null,null,null,null,null,null,null,null,null,0,0,null,null,"South Sudan",137,null,null,null,null,null,0,null,null,null,null,null,null,null,null,null,null,null,null,null,null,null,null,null,null,null,null,null,null,0,0]
[null,null,null,null,null,null,null,null,null,null,null,null,null,null,null,null,null,null,null,null,null,null,null,null,null,null,null,null,null,null,null,null,null,null,null,null,null,null,null,null,"Spain",138,{"$f":"MOS_Table_3!AP146","v":0},{"$f":"MOS_Table_3!AQ146","v":0},{"$f":"SUM(MOS_Table_3!AR146,MOS_Table_3!AS146,MOS_Table_3!AT146)","v":0},0,{"$f":"MOS_Table_3!AW146","v":0},{"$f":"MOS_Table_3!AX146","v":0},{"$f":"SUM(MOS_Table_3!BB146,MOS_Table_3!BC146,MOS_Table_3!AY146)","v":0},{"$f":"SUM(MOS_Table_3!BE146:BG146)","v":0},{"$f":"MOS_Table_3!BD146","v":0},{"$f":"MOS_Table_3!BJ146","v":0},{"$f":"MOS_Table_3!BH146","v":0},{"$f":"MOS_Table_3!BM146","v":0},{"$f":"SUM(MOS_Table_3!AV146,MOS_Table_3!BP146,MOS_Table_3!BQ146)","v":0},0,null,null,"Spain",138,{"$f":"MOS_Table_4!BH146","v":0},{"$f":"MOS_Table_4!BI146","v":0},{"$f":"MOS_Table_4!BJ146+MOS_Table_4!BK146+MOS_Table_4!BL146","v":0},0,{"$f":"MOS_Table_4!BO146","v":0},{"$f":"MOS_Table_4!BP146","v":0},{"$f":"MOS_Table_4!BT146+MOS_Table_4!BU146+MOS_Table_4!BQ146","v":0},{"$f":"MOS_Table_4!BW146+MOS_Table_4!BX146+MOS_Table_4!BY146","v":0},{"$f":"MOS_Table_4!BV146","v":0},{"$f":"MOS_Table_4!CB146","v":0},{"$f":"MOS_Table_4!BZ146","v":0},{"$f":"MOS_Table_4!CE146","v":0},{"$f":"MOS_Table_4!BN146+MOS_Table_4!CH146+MOS_Table_4!CI146","v":0},0,null,null,null,null,null,null,null,null,null,null,null,null,null,null,null,null,null,null,null,null,null,null,null,null,null,null,null,null,null,null,null,null,null,null,null,null,null,null,null,null,null,null,null,null,null,null,"Spain",138,null,null,null,null,null,0,null,null,null,null,null,null,null,null,null,null,null,null,null,null,null,null,null,null,null,null,null,null,0,0,null,null,"Spain",138,null,null,null,null,null,0,null,null,null,null,null,null,null,null,null,null,null,null,null,null,null,null,null,null,null,null,null,null,0,0]
[null,null,null,null,null,null,null,null,null,null," ",null,null,null,null,null,null,null,null,null,null,null,null,null,null,null,null,null,null,null,null,null,null,null,null,null,null,null,null,null,"Sri Lanka",139,{"$f":"MOS_Table_3!AP147","v":0},{"$f":"MOS_Table_3!AQ147","v":0},{"$f":"SUM(MOS_Table_3!AR147,MOS_Table_3!AS147,MOS_Table_3!AT147)","v":0},0,{"$f":"MOS_Table_3!AW147","v":0},{"$f":"MOS_Table_3!AX147","v":0},{"$f":"SUM(MOS_Table_3!BB147,MOS_Table_3!BC147,MOS_Table_3!AY147)","v":0},{"$f":"SUM(MOS_Table_3!BE147:BG147)","v":0},{"$f":"MOS_Table_3!BD147","v":0},{"$f":"MOS_Table_3!BJ147","v":0},{"$f":"MOS_Table_3!BH147","v":0},{"$f":"MOS_Table_3!BM147","v":0},{"$f":"SUM(MOS_Table_3!AV147,MOS_Table_3!BP147,MOS_Table_3!BQ147)","v":0},0,null,null,"Sri Lanka",139,{"$f":"MOS_Table_4!BH147","v":0},{"$f":"MOS_Table_4!BI147","v":0},{"$f":"MOS_Table_4!BJ147+MOS_Table_4!BK147+MOS_Table_4!BL147","v":0},0,{"$f":"MOS_Table_4!BO147","v":0},{"$f":"MOS_Table_4!BP147","v":0},{"$f":"MOS_Table_4!BT147+MOS_Table_4!BU147+MOS_Table_4!BQ147","v":0},{"$f":"MOS_Table_4!BW147+MOS_Table_4!BX147+MOS_Table_4!BY147","v":0},{"$f":"MOS_Table_4!BV147","v":0},{"$f":"MOS_Table_4!CB147","v":0},{"$f":"MOS_Table_4!BZ147","v":0},{"$f":"MOS_Table_4!CE147","v":0},{"$f":"MOS_Table_4!BN147+MOS_Table_4!CH147+MOS_Table_4!CI147","v":0},0,null,null,null,null,null,null,null,null,null,null,null,null,null,null,null,null,null,null,null,null,null,null,null,null,null,null,null,null,null,null,null,null,null,null,null,null,null,null,null,null,null,null,null,null,null,null,"Sri Lanka",139,null,null,null,null,null,0,null,null,null,null,null,null,null,null,null,null,null,null,null,null,null,null,null,null,null,null,null,null,0,0,null,null,"Sri Lanka",139,null,null,null,null,null,0,null,null,null,null,null,null,null,null,null,null,null,null,null,null,null,null,null,null,null,null,null,null,0,0]
[null,null,null,null,null,null,null,null,null,null,"ê",null,null,null,null,null,null,null,null,null,null,null,null,null,null,null,null,null,null,null,null,null,null,null,null,null,null,null,null,null,"Sudan",140,{"$f":"MOS_Table_3!AP148","v":0},{"$f":"MOS_Table_3!AQ148","v":0},{"$f":"SUM(MOS_Table_3!AR148,MOS_Table_3!AS148,MOS_Table_3!AT148)","v":0},0,{"$f":"MOS_Table_3!AW148","v":0},{"$f":"MOS_Table_3!AX148","v":0},{"$f":"SUM(MOS_Table_3!BB148,MOS_Table_3!BC148,MOS_Table_3!AY148)","v":0},{"$f":"SUM(MOS_Table_3!BE148:BG148)","v":0},{"$f":"MOS_Table_3!BD148","v":0},{"$f":"MOS_Table_3!BJ148","v":0},{"$f":"MOS_Table_3!BH148","v":0},{"$f":"MOS_Table_3!BM148","v":0},{"$f":"SUM(MOS_Table_3!AV148,MOS_Table_3!BP148,MOS_Table_3!BQ148)","v":0},0,null,null,"Sudan",140,{"$f":"MOS_Table_4!BH148","v":0},{"$f":"MOS_Table_4!BI148","v":0},{"$f":"MOS_Table_4!BJ148+MOS_Table_4!BK148+MOS_Table_4!BL148","v":0},0,{"$f":"MOS_Table_4!BO148","v":0},{"$f":"MOS_Table_4!BP148","v":0},{"$f":"MOS_Table_4!BT148+MOS_Table_4!BU148+MOS_Table_4!BQ148","v":0},{"$f":"MOS_Table_4!BW148+MOS_Table_4!BX148+MOS_Table_4!BY148","v":0},{"$f":"MOS_Table_4!BV148","v":0},{"$f":"MOS_Table_4!CB148","v":0},{"$f":"MOS_Table_4!BZ148","v":0},{"$f":"MOS_Table_4!CE148","v":0},{"$f":"MOS_Table_4!BN148+MOS_Table_4!CH148+MOS_Table_4!CI148","v":0},0,null,null,null,null,null,null,null,null,null,null,null,null,null,null,null,null,null,null,null,null,null,null,null,null,null,null,null,null,null,null,null,null,null,null,null,null,null,null,null,null,null,null,null,null,null,null,"Sudan",140,null,null,null,null,null,0,null,null,null,null,null,null,null,null,null,null,null,null,null,null,null,null,null,null,null,null,null,null,0,0,null,null,"Sudan",140,null,null,null,null,null,0,null,null,null,null,null,null,null,null,null,null,null,null,null,null,null,null,null,null,null,null,null,null,0,0]
[null,null,null,null,null,null,null,null,null,null," ",null,null,null,null,null,null,null,null,null,null,null,null,null,null,null,null,null,null,null,null,null,null,null,null,null,null,null,null,null,"Sweden",141,{"$f":"MOS_Table_3!AP149","v":0},{"$f":"MOS_Table_3!AQ149","v":0},{"$f":"SUM(MOS_Table_3!AR149,MOS_Table_3!AS149,MOS_Table_3!AT149)","v":0},0,{"$f":"MOS_Table_3!AW149","v":0},{"$f":"MOS_Table_3!AX149","v":0},{"$f":"SUM(MOS_Table_3!BB149,MOS_Table_3!BC149,MOS_Table_3!AY149)","v":0},{"$f":"SUM(MOS_Table_3!BE149:BG149)","v":0},{"$f":"MOS_Table_3!BD149","v":0},{"$f":"MOS_Table_3!BJ149","v":0},{"$f":"MOS_Table_3!BH149","v":0},{"$f":"MOS_Table_3!BM149","v":0},{"$f":"SUM(MOS_Table_3!AV149,MOS_Table_3!BP149,MOS_Table_3!BQ149)","v":0},0,null,null,"Sweden",141,{"$f":"MOS_Table_4!BH149","v":0},{"$f":"MOS_Table_4!BI149","v":0},{"$f":"MOS_Table_4!BJ149+MOS_Table_4!BK149+MOS_Table_4!BL149","v":0},0,{"$f":"MOS_Table_4!BO149","v":0},{"$f":"MOS_Table_4!BP149","v":0},{"$f":"MOS_Table_4!BT149+MOS_Table_4!BU149+MOS_Table_4!BQ149","v":0},{"$f":"MOS_Table_4!BW149+MOS_Table_4!BX149+MOS_Table_4!BY149","v":0},{"$f":"MOS_Table_4!BV149","v":0},{"$f":"MOS_Table_4!CB149","v":0},{"$f":"MOS_Table_4!BZ149","v":0},{"$f":"MOS_Table_4!CE149","v":0},{"$f":"MOS_Table_4!BN149+MOS_Table_4!CH149+MOS_Table_4!CI149","v":0},0,null,null,null,null,null,null,null,null,null,null,null,null,null,null,null,null,null,null,null,null,null,null,null,null,null,null,null,null,null,null,null,null,null,null,null,null,null,null,null,null,null,null,null,null,null,null,"Sweden",141,null,null,null,null,null,0,null,null,null,null,null,null,null,null,null,null,null,null,null,null,null,null,null,null,null,null,null,null,0,0,null,null,"Sweden",141,null,null,null,null,null,0,null,null,null,null,null,null,null,null,null,null,null,null,null,null,null,null,null,null,null,null,null,null,0,0]
[null,null,null,null,null,null,null,null,null,null,"ê",null,null,null,null,null,null,null,null,null,null,null,null,null,null,null,null,null,null,null,null,null,null,null,null,null,null,null,null,null,"Switzerland",142,{"$f":"MOS_Table_3!AP150","v":0},{"$f":"MOS_Table_3!AQ150","v":0},{"$f":"SUM(MOS_Table_3!AR150,MOS_Table_3!AS150,MOS_Table_3!AT150)","v":0},0,{"$f":"MOS_Table_3!AW150","v":0},{"$f":"MOS_Table_3!AX150","v":0},{"$f":"SUM(MOS_Table_3!BB150,MOS_Table_3!BC150,MOS_Table_3!AY150)","v":0},{"$f":"SUM(MOS_Table_3!BE150:BG150)","v":0},{"$f":"MOS_Table_3!BD150","v":0},{"$f":"MOS_Table_3!BJ150","v":0},{"$f":"MOS_Table_3!BH150","v":0},{"$f":"MOS_Table_3!BM150","v":0},{"$f":"SUM(MOS_Table_3!AV150,MOS_Table_3!BP150,MOS_Table_3!BQ150)","v":0},0,null,null,"Switzerland",142,{"$f":"MOS_Table_4!BH150","v":0},{"$f":"MOS_Table_4!BI150","v":0},{"$f":"MOS_Table_4!BJ150+MOS_Table_4!BK150+MOS_Table_4!BL150","v":0},0,{"$f":"MOS_Table_4!BO150","v":0},{"$f":"MOS_Table_4!BP150","v":0},{"$f":"MOS_Table_4!BT150+MOS_Table_4!BU150+MOS_Table_4!BQ150","v":0},{"$f":"MOS_Table_4!BW150+MOS_Table_4!BX150+MOS_Table_4!BY150","v":0},{"$f":"MOS_Table_4!BV150","v":0},{"$f":"MOS_Table_4!CB150","v":0},{"$f":"MOS_Table_4!BZ150","v":0},{"$f":"MOS_Table_4!CE150","v":0},{"$f":"MOS_Table_4!BN150+MOS_Table_4!CH150+MOS_Table_4!CI150","v":0},0,null,null,null,null,null,null,null,null,null,null,null,null,null,null,null,null,null,null,null,null,null,null,null,null,null,null,null,null,null,null,null,null,null,null,null,null,null,null,null,null,null,null,null,null,null,null,"Switzerland",142,null,null,null,null,null,0,null,null,null,null,null,null,null,null,null,null,null,null,null,null,null,null,null,null,null,null,null,null,0,0,null,null,"Switzerland",142,null,null,null,null,null,0,null,null,null,null,null,null,null,null,null,null,null,null,null,null,null,null,null,null,null,null,null,null,0,0]
[null,null,null,null,null,null,null,null,null,null," ",null,null,null,null,null,null,null,null,null,null,null,null,null,null,null,null,null,null,null,null,null,null,null,null,null,null,null,null,null,"Syrian Arab Republic",143,{"$f":"MOS_Table_3!AP151","v":0},{"$f":"MOS_Table_3!AQ151","v":0},{"$f":"SUM(MOS_Table_3!AR151,MOS_Table_3!AS151,MOS_Table_3!AT151)","v":0},{"$f":"SUM(AQ154:AS154)","v":0},{"$f":"MOS_Table_3!AW151","v":0},{"$f":"MOS_Table_3!AX151","v":0},{"$f":"SUM(MOS_Table_3!BB151,MOS_Table_3!BC151,MOS_Table_3!AY151)","v":0},{"$f":"SUM(MOS_Table_3!BE151:BG151)","v":0},{"$f":"MOS_Table_3!BD151","v":0},{"$f":"MOS_Table_3!BJ151","v":0},{"$f":"MOS_Table_3!BH151","v":0},{"$f":"MOS_Table_3!BM151","v":0},{"$f":"SUM(MOS_Table_3!AV151,MOS_Table_3!BP151,MOS_Table_3!BQ151)","v":0},{"$f":"SUM(AU154:BC154)-AY154-BA154","v":0},null,null,"Syrian Arab Republic",143,{"$f":"MOS_Table_4!BH151","v":0},{"$f":"MOS_Table_4!BI151","v":0},{"$f":"MOS_Table_4!BJ151+MOS_Table_4!BK151+MOS_Table_4!BL151","v":0},{"$f":"SUM(BI154:BK154)","v":0},{"$f":"MOS_Table_4!BO151","v":0},{"$f":"MOS_Table_4!BP151","v":0},{"$f":"MOS_Table_4!BT151+MOS_Table_4!BU151+MOS_Table_4!BQ151","v":0},{"$f":"MOS_Table_4!BW151+MOS_Table_4!BX151+MOS_Table_4!BY151","v":0},{"$f":"MOS_Table_4!BV151","v":0},{"$f":"MOS_Table_4!CB151","v":0},{"$f":"MOS_Table_4!BZ151","v":0},{"$f":"MOS_Table_4!CE151","v":0},{"$f":"MOS_Table_4!BN151+MOS_Table_4!CH151+MOS_Table_4!CI151","v":0},{"$f":"+BM154+BN154+BO154+BP154+BR154+BT154+BU154","v":0},null,null,null,null,null,null,null,null,null,null,null,null,null,null,null,null,null,null,null,null,null,null,null,null,null,null,null,null,null,null,null,null,null,null,null,null,null,null,null,null,null,null,null,null,null,null,"Syrian Arab Republic",143,null,null,null,null,null,{"$f":"SUM(DS154:DW154)","v":0},null,null,null,null,null,null,null,null,null,null,null,null,null,null,null,null,null,null,null,null,null,null,{"$f":"SUM(DY154:EB154,EE154:EG154,EJ154,EM154,EP154,ES154:ET154)","v":0},{"$f":"SUM(DX154,EU154)","v":0},null,null,"Syrian Arab Republic",143,null,null,null,null,null,{"$f":"SUM(FA154:FE154)","v":0},null,null,null,null,null,null,null,null,null,null,null,null,null,null,null,null,null,null,null,null,null,null,{"$f":"SUM(FG154:FI154,FJ154,FM154:FO154,FR154,FU154,FX154,GA154:GB154)","v":0},{"$f":"SUM(FF154,GC154)","v":0}]
[null,null,null,null,null,null,null,null,null,null,"ê",null,null,null,null,null,null,null,null,null,null,null,null,null,null,null,null,null,null,null,null,null,null,null,null,null,null,null,null,null,"Taiwan / Chinese Taipei",144,{"$f":"MOS_Table_3!AP152","v":0},{"$f":"MOS_Table_3!AQ152","v":0},{"$f":"SUM(MOS_Table_3!AR152,MOS_Table_3!AS152,MOS_Table_3!AT152)","v":0},0,{"$f":"MOS_Table_3!AW152","v":0},{"$f":"MOS_Table_3!AX152","v":0},{"$f":"SUM(MOS_Table_3!BB152,MOS_Table_3!BC152,MOS_Table_3!AY152)","v":0},{"$f":"SUM(MOS_Table_3!BE152:BG152)","v":0},{"$f":"MOS_Table_3!BD152","v":0},{"$f":"MOS_Table_3!BJ152","v":0},{"$f":"MOS_Table_3!BH152","v":0},{"$f":"MOS_Table_3!BM152","v":0},{"$f":"SUM(MOS_Table_3!AV152,MOS_Table_3!BP152,MOS_Table_3!BQ152)","v":0},0,null,null,"Taiwan / Chinese Taipei",144,{"$f":"MOS_Table_4!BH152","v":0},{"$f":"MOS_Table_4!BI152","v":0},{"$f":"MOS_Table_4!BJ152+MOS_Table_4!BK152+MOS_Table_4!BL152","v":0},0,{"$f":"MOS_Table_4!BO152","v":0},{"$f":"MOS_Table_4!BP152","v":0},{"$f":"MOS_Table_4!BT152+MOS_Table_4!BU152+MOS_Table_4!BQ152","v":0},{"$f":"MOS_Table_4!BW152+MOS_Table_4!BX152+MOS_Table_4!BY152","v":0},{"$f":"MOS_Table_4!BV152","v":0},{"$f":"MOS_Table_4!CB152","v":0},{"$f":"MOS_Table_4!BZ152","v":0},{"$f":"MOS_Table_4!CE152","v":0},{"$f":"MOS_Table_4!BN152+MOS_Table_4!CH152+MOS_Table_4!CI152","v":0},0,null,null,null,null,null,null,null,null,null,null,null,null,null,null,null,null,null,null,null,null,null,null,null,null,null,null,null,null,null,null,null,null,null,null,null,null,null,null,null,null,null,null,null,null,null,null,"Taiwan / Chinese Taipei",144,null,null,null,null,null,0,null,null,null,null,null,null,null,null,null,null,null,null,null,null,null,null,null,null,null,null,null,null,0,0,null,null,"Taiwan / Chinese Taipei",144,null,null,null,null,null,0,null,null,null,null,null,null,null,null,null,null,null,null,null,null,null,null,null,null,null,null,null,null,0,0]
[null,null,null,null,null,null,null,null,null,null," ",null,null,null,null,null,null,null,null,null,null,null,null,null,null,null,null,null,null,null,null,null,null,null,null,null,null,null,null,null,"Tajikistan",145,{"$f":"MOS_Table_3!AP153","v":0},{"$f":"MOS_Table_3!AQ153","v":0},{"$f":"SUM(MOS_Table_3!AR153,MOS_Table_3!AS153,MOS_Table_3!AT153)","v":0},0,{"$f":"MOS_Table_3!AW153","v":0},{"$f":"MOS_Table_3!AX153","v":0},{"$f":"SUM(MOS_Table_3!BB153,MOS_Table_3!BC153,MOS_Table_3!AY153)","v":0},{"$f":"SUM(MOS_Table_3!BE153:BG153)","v":0},{"$f":"MOS_Table_3!BD153","v":0},{"$f":"MOS_Table_3!BJ153","v":0},{"$f":"MOS_Table_3!BH153","v":0},{"$f":"MOS_Table_3!BM153","v":0},{"$f":"SUM(MOS_Table_3!AV153,MOS_Table_3!BP153,MOS_Table_3!BQ153)","v":0},0,null,null,"Tajikistan",145,{"$f":"MOS_Table_4!BH153","v":0},{"$f":"MOS_Table_4!BI153","v":0},{"$f":"MOS_Table_4!BJ153+MOS_Table_4!BK153+MOS_Table_4!BL153","v":0},0,{"$f":"MOS_Table_4!BO153","v":0},{"$f":"MOS_Table_4!BP153","v":0},{"$f":"MOS_Table_4!BT153+MOS_Table_4!BU153+MOS_Table_4!BQ153","v":0},{"$f":"MOS_Table_4!BW153+MOS_Table_4!BX153+MOS_Table_4!BY153","v":0},{"$f":"MOS_Table_4!BV153","v":0},{"$f":"MOS_Table_4!CB153","v":0},{"$f":"MOS_Table_4!BZ153","v":0},{"$f":"MOS_Table_4!CE153","v":0},{"$f":"MOS_Table_4!BN153+MOS_Table_4!CH153+MOS_Table_4!CI153","v":0},0,null,null,null,null,null,null,null,null,null,null,null,null,null,null,null,null,null,null,null,null,null,null,null,null,null,null,null,null,null,null,null,null,null,null,null,null,null,null,null,null,null,null,null,null,null,null,"Tajikistan",145,null,null,null,null,null,0,null,null,null,null,null,null,null,null,null,null,null,null,null,null,null,null,null,null,null,null,null,null,0,0,null,null,"Tajikistan",145,null,null,null,null,null,0,null,null,null,null,null,null,null,null,null,null,null,null,null,null,null,null,null,null,null,null,null,null,0,0]
[null,null,null,null,null,null,null,null,null,null,"ê",null,null,null,null,null,null,null,null,null,null,null,null,null,null,null,null,null,null,null,null,null,null,null,null,null,null,null,null,null,"Tanzania, United Republic of",146,{"$f":"MOS_Table_3!AP154","v":0},{"$f":"MOS_Table_3!AQ154","v":0},{"$f":"SUM(MOS_Table_3!AR154,MOS_Table_3!AS154,MOS_Table_3!AT154)","v":0},0,{"$f":"MOS_Table_3!AW154","v":0},{"$f":"MOS_Table_3!AX154","v":0},{"$f":"SUM(MOS_Table_3!BB154,MOS_Table_3!BC154,MOS_Table_3!AY154)","v":0},{"$f":"SUM(MOS_Table_3!BE154:BG154)","v":0},{"$f":"MOS_Table_3!BD154","v":0},{"$f":"MOS_Table_3!BJ154","v":0},{"$f":"MOS_Table_3!BH154","v":0},{"$f":"MOS_Table_3!BM154","v":0},{"$f":"SUM(MOS_Table_3!AV154,MOS_Table_3!BP154,MOS_Table_3!BQ154)","v":0},0,null,null,"Tanzania, United Republic of",146,{"$f":"MOS_Table_4!BH154","v":0},{"$f":"MOS_Table_4!BI154","v":0},{"$f":"MOS_Table_4!BJ154+MOS_Table_4!BK154+MOS_Table_4!BL154","v":0},0,{"$f":"MOS_Table_4!BO154","v":0},{"$f":"MOS_Table_4!BP154","v":0},{"$f":"MOS_Table_4!BT154+MOS_Table_4!BU154+MOS_Table_4!BQ154","v":0},{"$f":"MOS_Table_4!BW154+MOS_Table_4!BX154+MOS_Table_4!BY154","v":0},{"$f":"MOS_Table_4!BV154","v":0},{"$f":"MOS_Table_4!CB154","v":0},{"$f":"MOS_Table_4!BZ154","v":0},{"$f":"MOS_Table_4!CE154","v":0},{"$f":"MOS_Table_4!BN154+MOS_Table_4!CH154+MOS_Table_4!CI154","v":0},0,null,null,null,null,null,null,null,null,null,null,null,null,null,null,null,null,null,null,null,null,null,null,null,null,null,null,null,null,null,null,null,null,null,null,null,null,null,null,null,null,null,null,null,null,null,null,"Tanzania, United Republic of",146,null,null,null,null,null,0,null,null,null,null,null,null,null,null,null,null,null,null,null,null,null,null,null,null,null,null,null,null,0,0,null,null,"Tanzania, United Republic of",146,null,null,null,null,null,0,null,null,null,null,null,null,null,null,null,null,null,null,null,null,null,null,null,null,null,null,null,null,0,0]
[null,null,null,null,null,null,null,null,null,null," ",null,null,null,null,null,null,null,null,null,null,null,null,null,null,null,null,null,null,null,null,null,null,null,null,null,null,null,null,null,"Thailand",147,{"$f":"MOS_Table_3!AP155","v":0},{"$f":"MOS_Table_3!AQ155","v":0},{"$f":"SUM(MOS_Table_3!AR155,MOS_Table_3!AS155,MOS_Table_3!AT155)","v":0},0,{"$f":"MOS_Table_3!AW155","v":0},{"$f":"MOS_Table_3!AX155","v":0},{"$f":"SUM(MOS_Table_3!BB155,MOS_Table_3!BC155,MOS_Table_3!AY155)","v":0},{"$f":"SUM(MOS_Table_3!BE155:BG155)","v":0},{"$f":"MOS_Table_3!BD155","v":0},{"$f":"MOS_Table_3!BJ155","v":0},{"$f":"MOS_Table_3!BH155","v":0},{"$f":"MOS_Table_3!BM155","v":0},{"$f":"SUM(MOS_Table_3!AV155,MOS_Table_3!BP155,MOS_Table_3!BQ155)","v":0},0,null,null,"Thailand",147,{"$f":"MOS_Table_4!BH155","v":0},{"$f":"MOS_Table_4!BI155","v":0},{"$f":"MOS_Table_4!BJ155+MOS_Table_4!BK155+MOS_Table_4!BL155","v":0},0,{"$f":"MOS_Table_4!BO155","v":0},{"$f":"MOS_Table_4!BP155","v":0},{"$f":"MOS_Table_4!BT155+MOS_Table_4!BU155+MOS_Table_4!BQ155","v":0},{"$f":"MOS_Table_4!BW155+MOS_Table_4!BX155+MOS_Table_4!BY155","v":0},{"$f":"MOS_Table_4!BV155","v":0},{"$f":"MOS_Table_4!CB155","v":0},{"$f":"MOS_Table_4!BZ155","v":0},{"$f":"MOS_Table_4!CE155","v":0},{"$f":"MOS_Table_4!BN155+MOS_Table_4!CH155+MOS_Table_4!CI155","v":0},0,null,null,null,null,null,null,null,null,null,null,null,null,null,null,null,null,null,null,null,null,null,null,null,null,null,null,null,null,null,null,null,null,null,null,null,null,null,null,null,null,null,null,null,null,null,null,"Thailand",147,null,null,null,null,null,0,null,null,null,null,null,null,null,null,null,null,null,null,null,null,null,null,null,null,null,null,null,null,0,0,null,null,"Thailand",147,null,null,null,null,null,0,null,null,null,null,null,null,null,null,null,null,null,null,null,null,null,null,null,null,null,null,null,null,0,0]
[null,null,null,null,null,null,null,null,null,null,"ê",null,null,null,null,null,null,null,null,null,null,null,null,null,null,null,null,null,null,null,null,null,null,null,null,null,null,null,null,null,"Timor-Leste",148,{"$f":"MOS_Table_3!AP156","v":0},{"$f":"MOS_Table_3!AQ156","v":0},{"$f":"SUM(MOS_Table_3!AR156,MOS_Table_3!AS156,MOS_Table_3!AT156)","v":0},0,{"$f":"MOS_Table_3!AW156","v":0},{"$f":"MOS_Table_3!AX156","v":0},{"$f":"SUM(MOS_Table_3!BB156,MOS_Table_3!BC156,MOS_Table_3!AY156)","v":0},{"$f":"SUM(MOS_Table_3!BE156:BG156)","v":0},{"$f":"MOS_Table_3!BD156","v":0},{"$f":"MOS_Table_3!BJ156","v":0},{"$f":"MOS_Table_3!BH156","v":0},{"$f":"MOS_Table_3!BM156","v":0},{"$f":"SUM(MOS_Table_3!AV156,MOS_Table_3!BP156,MOS_Table_3!BQ156)","v":0},0,null,null,"Timor-Leste",148,{"$f":"MOS_Table_4!BH156","v":0},{"$f":"MOS_Table_4!BI156","v":0},{"$f":"MOS_Table_4!BJ156+MOS_Table_4!BK156+MOS_Table_4!BL156","v":0},0,{"$f":"MOS_Table_4!BO156","v":0},{"$f":"MOS_Table_4!BP156","v":0},{"$f":"MOS_Table_4!BT156+MOS_Table_4!BU156+MOS_Table_4!BQ156","v":0},{"$f":"MOS_Table_4!BW156+MOS_Table_4!BX156+MOS_Table_4!BY156","v":0},{"$f":"MOS_Table_4!BV156","v":0},{"$f":"MOS_Table_4!CB156","v":0},{"$f":"MOS_Table_4!BZ156","v":0},{"$f":"MOS_Table_4!CE156","v":0},{"$f":"MOS_Table_4!BN156+MOS_Table_4!CH156+MOS_Table_4!CI156","v":0},0,null,null,null,null,null,null,null,null,null,null,null,null,null,null,null,null,null,null,null,null,null,null,null,null,null,null,null,null,null,null,null,null,null,null,null,null,null,null,null,null,null,null,null,null,null,null,"Timor-Leste",148,null,null,null,null,null,0,null,null,null,null,null,null,null,null,null,null,null,null,null,null,null,null,null,null,null,null,null,null,0,0,null,null,"Timor-Leste",148,null,null,null,null,null,0,null,null,null,null,null,null,null,null,null,null,null,null,null,null,null,null,null,null,null,null,null,null,0,0]
[null,null,null,null,null,null,null,null,null,null," ",null,null,null,null,null,null,null,null,null,null,null,null,null,null,null,null,null,null,null,null,null,null,null,null,null,null,null,null,null,"Togo",149,{"$f":"MOS_Table_3!AP157","v":0},{"$f":"MOS_Table_3!AQ157","v":0},{"$f":"SUM(MOS_Table_3!AR157,MOS_Table_3!AS157,MOS_Table_3!AT157)","v":0},0,{"$f":"MOS_Table_3!AW157","v":0},{"$f":"MOS_Table_3!AX157","v":0},{"$f":"SUM(MOS_Table_3!BB157,MOS_Table_3!BC157,MOS_Table_3!AY157)","v":0},{"$f":"SUM(MOS_Table_3!BE157:BG157)","v":0},{"$f":"MOS_Table_3!BD157","v":0},{"$f":"MOS_Table_3!BJ157","v":0},{"$f":"MOS_Table_3!BH157","v":0},{"$f":"MOS_Table_3!BM157","v":0},{"$f":"SUM(MOS_Table_3!AV157,MOS_Table_3!BP157,MOS_Table_3!BQ157)","v":0},0,null,null,"Togo",149,{"$f":"MOS_Table_4!BH157","v":0},{"$f":"MOS_Table_4!BI157","v":0},{"$f":"MOS_Table_4!BJ157+MOS_Table_4!BK157+MOS_Table_4!BL157","v":0},0,{"$f":"MOS_Table_4!BO157","v":0},{"$f":"MOS_Table_4!BP157","v":0},{"$f":"MOS_Table_4!BT157+MOS_Table_4!BU157+MOS_Table_4!BQ157","v":0},{"$f":"MOS_Table_4!BW157+MOS_Table_4!BX157+MOS_Table_4!BY157","v":0},{"$f":"MOS_Table_4!BV157","v":0},{"$f":"MOS_Table_4!CB157","v":0},{"$f":"MOS_Table_4!BZ157","v":0},{"$f":"MOS_Table_4!CE157","v":0},{"$f":"MOS_Table_4!BN157+MOS_Table_4!CH157+MOS_Table_4!CI157","v":0},0,null,null,null,null,null,null,null,null,null,null,null,null,null,null,null,null,null,null,null,null,null,null,null,null,null,null,null,null,null,null,null,null,null,null,null,null,null,null,null,null,null,null,null,null,null,null,"Togo",149,null,null,null,null,null,0,null,null,null,null,null,null,null,null,null,null,null,null,null,null,null,null,null,null,null,null,null,null,0,0,null,null,"Togo",149,null,null,null,null,null,0,null,null,null,null,null,null,null,null,null,null,null,null,null,null,null,null,null,null,null,null,null,null,0,0]
[null,null,null,null,null,null,null,null,null,null,"ê",null,null,null,null,null,null,null,null,null,null,null,null,null,null,null,null,null,null,null,null,null,null,null,null,null,null,null,null,null,"Trinidad and Tobago",150,{"$f":"MOS_Table_3!AP158","v":0},{"$f":"MOS_Table_3!AQ158","v":0},{"$f":"SUM(MOS_Table_3!AR158,MOS_Table_3!AS158,MOS_Table_3!AT158)","v":0},0,{"$f":"MOS_Table_3!AW158","v":0},{"$f":"MOS_Table_3!AX158","v":0},{"$f":"SUM(MOS_Table_3!BB158,MOS_Table_3!BC158,MOS_Table_3!AY158)","v":0},{"$f":"SUM(MOS_Table_3!BE158:BG158)","v":0},{"$f":"MOS_Table_3!BD158","v":0},{"$f":"MOS_Table_3!BJ158","v":0},{"$f":"MOS_Table_3!BH158","v":0},{"$f":"MOS_Table_3!BM158","v":0},{"$f":"SUM(MOS_Table_3!AV158,MOS_Table_3!BP158,MOS_Table_3!BQ158)","v":0},0,null,null,"Trinidad and Tobago",150,{"$f":"MOS_Table_4!BH158","v":0},{"$f":"MOS_Table_4!BI158","v":0},{"$f":"MOS_Table_4!BJ158+MOS_Table_4!BK158+MOS_Table_4!BL158","v":0},0,{"$f":"MOS_Table_4!BO158","v":0},{"$f":"MOS_Table_4!BP158","v":0},{"$f":"MOS_Table_4!BT158+MOS_Table_4!BU158+MOS_Table_4!BQ158","v":0},{"$f":"MOS_Table_4!BW158+MOS_Table_4!BX158+MOS_Table_4!BY158","v":0},{"$f":"MOS_Table_4!BV158","v":0},{"$f":"MOS_Table_4!CB158","v":0},{"$f":"MOS_Table_4!BZ158","v":0},{"$f":"MOS_Table_4!CE158","v":0},{"$f":"MOS_Table_4!BN158+MOS_Table_4!CH158+MOS_Table_4!CI158","v":0},0,null,null,null,null,null,null,null,null,null,null,null,null,null,null,null,null,null,null,null,null,null,null,null,null,null,null,null,null,null,null,null,null,null,null,null,null,null,null,null,null,null,null,null,null,null,null,"Trinidad and Tobago",150,null,null,null,null,null,0,null,null,null,null,null,null,null,null,null,null,null,null,null,null,null,null,null,null,null,null,null,null,0,0,null,null,"Trinidad and Tobago",150,null,null,null,null,null,0,null,null,null,null,null,null,null,null,null,null,null,null,null,null,null,null,null,null,null,null,null,null,0,0]
[null,null,null,null,null,null,null,null,null,null," ",null,null,null,null,null,null,null,null,null,null,null,null,null,null,null,null,null,null,null,null,null,null,null,null,null,null,null,null,null,"Tunisia",151,{"$f":"MOS_Table_3!AP159","v":0},{"$f":"MOS_Table_3!AQ159","v":0},{"$f":"SUM(MOS_Table_3!AR159,MOS_Table_3!AS159,MOS_Table_3!AT159)","v":0},0,{"$f":"MOS_Table_3!AW159","v":0},{"$f":"MOS_Table_3!AX159","v":0},{"$f":"SUM(MOS_Table_3!BB159,MOS_Table_3!BC159,MOS_Table_3!AY159)","v":0},{"$f":"SUM(MOS_Table_3!BE159:BG159)","v":0},{"$f":"MOS_Table_3!BD159","v":0},{"$f":"MOS_Table_3!BJ159","v":0},{"$f":"MOS_Table_3!BH159","v":0},{"$f":"MOS_Table_3!BM159","v":0},{"$f":"SUM(MOS_Table_3!AV159,MOS_Table_3!BP159,MOS_Table_3!BQ159)","v":0},0,null,null,"Tunisia",151,{"$f":"MOS_Table_4!BH159","v":0},{"$f":"MOS_Table_4!BI159","v":0},{"$f":"MOS_Table_4!BJ159+MOS_Table_4!BK159+MOS_Table_4!BL159","v":0},0,{"$f":"MOS_Table_4!BO159","v":0},{"$f":"MOS_Table_4!BP159","v":0},{"$f":"MOS_Table_4!BT159+MOS_Table_4!BU159+MOS_Table_4!BQ159","v":0},{"$f":"MOS_Table_4!BW159+MOS_Table_4!BX159+MOS_Table_4!BY159","v":0},{"$f":"MOS_Table_4!BV159","v":0},{"$f":"MOS_Table_4!CB159","v":0},{"$f":"MOS_Table_4!BZ159","v":0},{"$f":"MOS_Table_4!CE159","v":0},{"$f":"MOS_Table_4!BN159+MOS_Table_4!CH159+MOS_Table_4!CI159","v":0},0,null,null,null,null,null,null,null,null,null,null,null,null,null,null,null,null,null,null,null,null,null,null,null,null,null,null,null,null,null,null,null,null,null,null,null,null,null,null,null,null,null,null,null,null,null,null,"Tunisia",151,null,null,null,null,null,0,null,null,null,null,null,null,null,null,null,null,null,null,null,null,null,null,null,null,null,null,null,null,0,0,null,null,"Tunisia",151,null,null,null,null,null,0,null,null,null,null,null,null,null,null,null,null,null,null,null,null,null,null,null,null,null,null,null,null,0,0]
[null,null,null,null,null,null,null,null,null,null,"ê",null,null,null,null,null,null,null,null,null,null,null,null,null,null,null,null,null,null,null,null,null,null,null,null,null,null,null,null,null,"Turkey",152,{"$f":"MOS_Table_3!AP160","v":0},{"$f":"MOS_Table_3!AQ160","v":0},{"$f":"SUM(MOS_Table_3!AR160,MOS_Table_3!AS160,MOS_Table_3!AT160)","v":0},0,{"$f":"MOS_Table_3!AW160","v":0},{"$f":"MOS_Table_3!AX160","v":0},{"$f":"SUM(MOS_Table_3!BB160,MOS_Table_3!BC160,MOS_Table_3!AY160)","v":0},{"$f":"SUM(MOS_Table_3!BE160:BG160)","v":0},{"$f":"MOS_Table_3!BD160","v":0},{"$f":"MOS_Table_3!BJ160","v":0},{"$f":"MOS_Table_3!BH160","v":0},{"$f":"MOS_Table_3!BM160","v":0},{"$f":"SUM(MOS_Table_3!AV160,MOS_Table_3!BP160,MOS_Table_3!BQ160)","v":0},0,null,null,"Turkey",152,{"$f":"MOS_Table_4!BH160","v":0},{"$f":"MOS_Table_4!BI160","v":0},{"$f":"MOS_Table_4!BJ160+MOS_Table_4!BK160+MOS_Table_4!BL160","v":0},0,{"$f":"MOS_Table_4!BO160","v":0},{"$f":"MOS_Table_4!BP160","v":0},{"$f":"MOS_Table_4!BT160+MOS_Table_4!BU160+MOS_Table_4!BQ160","v":0},{"$f":"MOS_Table_4!BW160+MOS_Table_4!BX160+MOS_Table_4!BY160","v":0},{"$f":"MOS_Table_4!BV160","v":0},{"$f":"MOS_Table_4!CB160","v":0},{"$f":"MOS_Table_4!BZ160","v":0},{"$f":"MOS_Table_4!CE160","v":0},{"$f":"MOS_Table_4!BN160+MOS_Table_4!CH160+MOS_Table_4!CI160","v":0},0,null,null,null,null,null,null,null,null,null,null,null,null,null,null,null,null,null,null,null,null,null,null,null,null,null,null,null,null,null,null,null,null,null,null,null,null,null,null,null,null,null,null,null,null,null,null,"Turkey",152,null,null,null,null,null,0,null,null,null,null,null,null,null,null,null,null,null,null,null,null,null,null,null,null,null,null,null,null,0,0,null,null,"Turkey",152,null,null,null,null,null,0,null,null,null,null,null,null,null,null,null,null,null,null,null,null,null,null,null,null,null,null,null,null,0,0]
[null,null,null,null,null,null,null,null,null,null," ",null,null,null,null,null,null,null,null,null,null,null,null,null,null,null,null,null,null,null,null,null,null,null,null,null,null,null,null,null,"Turkmenistan",153,{"$f":"MOS_Table_3!AP161","v":0},{"$f":"MOS_Table_3!AQ161","v":0},{"$f":"SUM(MOS_Table_3!AR161,MOS_Table_3!AS161,MOS_Table_3!AT161)","v":0},0,{"$f":"MOS_Table_3!AW161","v":0},{"$f":"MOS_Table_3!AX161","v":0},{"$f":"SUM(MOS_Table_3!BB161,MOS_Table_3!BC161,MOS_Table_3!AY161)","v":0},{"$f":"SUM(MOS_Table_3!BE161:BG161)","v":0},{"$f":"MOS_Table_3!BD161","v":0},{"$f":"MOS_Table_3!BJ161","v":0},{"$f":"MOS_Table_3!BH161","v":0},{"$f":"MOS_Table_3!BM161","v":0},{"$f":"SUM(MOS_Table_3!AV161,MOS_Table_3!BP161,MOS_Table_3!BQ161)","v":0},0,null,null,"Turkmenistan",153,{"$f":"MOS_Table_4!BH161","v":0},{"$f":"MOS_Table_4!BI161","v":0},{"$f":"MOS_Table_4!BJ161+MOS_Table_4!BK161+MOS_Table_4!BL161","v":0},0,{"$f":"MOS_Table_4!BO161","v":0},{"$f":"MOS_Table_4!BP161","v":0},{"$f":"MOS_Table_4!BT161+MOS_Table_4!BU161+MOS_Table_4!BQ161","v":0},{"$f":"MOS_Table_4!BW161+MOS_Table_4!BX161+MOS_Table_4!BY161","v":0},{"$f":"MOS_Table_4!BV161","v":0},{"$f":"MOS_Table_4!CB161","v":0},{"$f":"MOS_Table_4!BZ161","v":0},{"$f":"MOS_Table_4!CE161","v":0},{"$f":"MOS_Table_4!BN161+MOS_Table_4!CH161+MOS_Table_4!CI161","v":0},0,null,null,null,null,null,null,null,null,null,null,null,null,null,null,null,null,null,null,null,null,null,null,null,null,null,null,null,null,null,null,null,null,null,null,null,null,null,null,null,null,null,null,null,null,null,null,"Turkmenistan",153,null,null,null,null,null,0,null,null,null,null,null,null,null,null,null,null,null,null,null,null,null,null,null,null,null,null,null,null,0,0,null,null,"Turkmenistan",153,null,null,null,null,null,0,null,null,null,null,null,null,null,null,null,null,null,null,null,null,null,null,null,null,null,null,null,null,0,0]
[null,null,null,null,null,null,null,null,null,null,"ê",null,null,null,null,null,null,null,null,null,null,null,null,null,null,null,null,null,null,null,null,null,null,null,null,null,null,null,null,null,"Uganda",154,{"$f":"MOS_Table_3!AP162","v":0},{"$f":"MOS_Table_3!AQ162","v":0},{"$f":"SUM(MOS_Table_3!AR162,MOS_Table_3!AS162,MOS_Table_3!AT162)","v":0},0,{"$f":"MOS_Table_3!AW162","v":0},{"$f":"MOS_Table_3!AX162","v":0},{"$f":"SUM(MOS_Table_3!BB162,MOS_Table_3!BC162,MOS_Table_3!AY162)","v":0},{"$f":"SUM(MOS_Table_3!BE162:BG162)","v":0},{"$f":"MOS_Table_3!BD162","v":0},{"$f":"MOS_Table_3!BJ162","v":0},{"$f":"MOS_Table_3!BH162","v":0},{"$f":"MOS_Table_3!BM162","v":0},{"$f":"SUM(MOS_Table_3!AV162,MOS_Table_3!BP162,MOS_Table_3!BQ162)","v":0},0,null,null,"Uganda",154,{"$f":"MOS_Table_4!BH162","v":0},{"$f":"MOS_Table_4!BI162","v":0},{"$f":"MOS_Table_4!BJ162+MOS_Table_4!BK162+MOS_Table_4!BL162","v":0},0,{"$f":"MOS_Table_4!BO162","v":0},{"$f":"MOS_Table_4!BP162","v":0},{"$f":"MOS_Table_4!BT162+MOS_Table_4!BU162+MOS_Table_4!BQ162","v":0},{"$f":"MOS_Table_4!BW162+MOS_Table_4!BX162+MOS_Table_4!BY162","v":0},{"$f":"MOS_Table_4!BV162","v":0},{"$f":"MOS_Table_4!CB162","v":0},{"$f":"MOS_Table_4!BZ162","v":0},{"$f":"MOS_Table_4!CE162","v":0},{"$f":"MOS_Table_4!BN162+MOS_Table_4!CH162+MOS_Table_4!CI162","v":0},0,null,null,null,null,null,null,null,null,null,null,null,null,null,null,null,null,null,null,null,null,null,null,null,null,null,null,null,null,null,null,null,null,null,null,null,null,null,null,null,null,null,null,null,null,null,null,"Uganda",154,null,null,null,null,null,0,null,null,null,null,null,null,null,null,null,null,null,null,null,null,null,null,null,null,null,null,null,null,0,0,null,null,"Uganda",154,null,null,null,null,null,0,null,null,null,null,null,null,null,null,null,null,null,null,null,null,null,null,null,null,null,null,null,null,0,0]
[null,null,null,null,null,null,null,null,null,null," ",null,null,null,null,null,null,null,null,null,null,null,null,null,null,null,null,null,null,null,null,null,null,null,null,null,null,null,null,null,"Ukraine",155,{"$f":"MOS_Table_3!AP163","v":0},{"$f":"MOS_Table_3!AQ163","v":0},{"$f":"SUM(MOS_Table_3!AR163,MOS_Table_3!AS163,MOS_Table_3!AT163)","v":0},0,{"$f":"MOS_Table_3!AW163","v":0},{"$f":"MOS_Table_3!AX163","v":0},{"$f":"SUM(MOS_Table_3!BB163,MOS_Table_3!BC163,MOS_Table_3!AY163)","v":0},{"$f":"SUM(MOS_Table_3!BE163:BG163)","v":0},{"$f":"MOS_Table_3!BD163","v":0},{"$f":"MOS_Table_3!BJ163","v":0},{"$f":"MOS_Table_3!BH163","v":0},{"$f":"MOS_Table_3!BM163","v":0},{"$f":"SUM(MOS_Table_3!AV163,MOS_Table_3!BP163,MOS_Table_3!BQ163)","v":0},0,null,null,"Ukraine",155,{"$f":"MOS_Table_4!BH163","v":0},{"$f":"MOS_Table_4!BI163","v":0},{"$f":"MOS_Table_4!BJ163+MOS_Table_4!BK163+MOS_Table_4!BL163","v":0},0,{"$f":"MOS_Table_4!BO163","v":0},{"$f":"MOS_Table_4!BP163","v":0},{"$f":"MOS_Table_4!BT163+MOS_Table_4!BU163+MOS_Table_4!BQ163","v":0},{"$f":"MOS_Table_4!BW163+MOS_Table_4!BX163+MOS_Table_4!BY163","v":0},{"$f":"MOS_Table_4!BV163","v":0},{"$f":"MOS_Table_4!CB163","v":0},{"$f":"MOS_Table_4!BZ163","v":0},{"$f":"MOS_Table_4!CE163","v":0},{"$f":"MOS_Table_4!BN163+MOS_Table_4!CH163+MOS_Table_4!CI163","v":0},0,null,null,null,null,null,null,null,null,null,null,null,null,null,null,null,null,null,null,null,null,null,null,null,null,null,null,null,null,null,null,null,null,null,null,null,null,null,null,null,null,null,null,null,null,null,null,"Ukraine",155,null,null,null,null,null,0,null,null,null,null,null,null,null,null,null,null,null,null,null,null,null,null,null,null,null,null,null,null,0,0,null,null,"Ukraine",155,null,null,null,null,null,0,null,null,null,null,null,null,null,null,null,null,null,null,null,null,null,null,null,null,null,null,null,null,0,0]
[null,null,null,null,null,null,null,null,null,null,"ê",null,null,null,null,null,null,null,null,null,null,null,null,null,null,null,null,null,null,null,null,null,null,null,null,null,null,null,null,null,"United Arab Emirates",156,{"$f":"MOS_Table_3!AP164","v":0},{"$f":"MOS_Table_3!AQ164","v":0},{"$f":"SUM(MOS_Table_3!AR164,MOS_Table_3!AS164,MOS_Table_3!AT164)","v":0},0,{"$f":"MOS_Table_3!AW164","v":0},{"$f":"MOS_Table_3!AX164","v":0},{"$f":"SUM(MOS_Table_3!BB164,MOS_Table_3!BC164,MOS_Table_3!AY164)","v":0},{"$f":"SUM(MOS_Table_3!BE164:BG164)","v":0},{"$f":"MOS_Table_3!BD164","v":0},{"$f":"MOS_Table_3!BJ164","v":0},{"$f":"MOS_Table_3!BH164","v":0},{"$f":"MOS_Table_3!BM164","v":0},{"$f":"SUM(MOS_Table_3!AV164,MOS_Table_3!BP164,MOS_Table_3!BQ164)","v":0},0,null,null,"United Arab Emirates",156,{"$f":"MOS_Table_4!BH164","v":0},{"$f":"MOS_Table_4!BI164","v":0},{"$f":"MOS_Table_4!BJ164+MOS_Table_4!BK164+MOS_Table_4!BL164","v":0},0,{"$f":"MOS_Table_4!BO164","v":0},{"$f":"MOS_Table_4!BP164","v":0},{"$f":"MOS_Table_4!BT164+MOS_Table_4!BU164+MOS_Table_4!BQ164","v":0},{"$f":"MOS_Table_4!BW164+MOS_Table_4!BX164+MOS_Table_4!BY164","v":0},{"$f":"MOS_Table_4!BV164","v":0},{"$f":"MOS_Table_4!CB164","v":0},{"$f":"MOS_Table_4!BZ164","v":0},{"$f":"MOS_Table_4!CE164","v":0},{"$f":"MOS_Table_4!BN164+MOS_Table_4!CH164+MOS_Table_4!CI164","v":0},0,null,null,null,null,null,null,null,null,null,null,null,null,null,null,null,null,null,null,null,null,null,null,null,null,null,null,null,null,null,null,null,null,null,null,null,null,null,null,null,null,null,null,null,null,null,null,"United Arab Emirates",156,null,null,null,null,null,0,null,null,null,null,null,null,null,null,null,null,null,null,null,null,null,null,null,null,null,null,null,null,0,0,null,null,"United Arab Emirates",156,null,null,null,null,null,0,null,null,null,null,null,null,null,null,null,null,null,null,null,null,null,null,null,null,null,null,null,null,0,0]
[null,null,null,null,null,null,null,null,null,null," ",null,null,null,null,null,null,null,null,null,null,null,null,null,null,null,null,null,null,null,null,null,null,null,null,null,null,null,null,null,"United Kingdom",157,{"$f":"MOS_Table_3!AP165","v":0},{"$f":"MOS_Table_3!AQ165","v":0},{"$f":"SUM(MOS_Table_3!AR165,MOS_Table_3!AS165,MOS_Table_3!AT165)","v":0},0,{"$f":"MOS_Table_3!AW165","v":0},{"$f":"MOS_Table_3!AX165","v":0},{"$f":"SUM(MOS_Table_3!BB165,MOS_Table_3!BC165,MOS_Table_3!AY165)","v":0},{"$f":"SUM(MOS_Table_3!BE165:BG165)","v":0},{"$f":"MOS_Table_3!BD165","v":0},{"$f":"MOS_Table_3!BJ165","v":0},{"$f":"MOS_Table_3!BH165","v":0},{"$f":"MOS_Table_3!BM165","v":0},{"$f":"SUM(MOS_Table_3!AV165,MOS_Table_3!BP165,MOS_Table_3!BQ165)","v":0},0,null,null,"United Kingdom",157,{"$f":"MOS_Table_4!BH165","v":0},{"$f":"MOS_Table_4!BI165","v":0},{"$f":"MOS_Table_4!BJ165+MOS_Table_4!BK165+MOS_Table_4!BL165","v":0},0,{"$f":"MOS_Table_4!BO165","v":0},{"$f":"MOS_Table_4!BP165","v":0},{"$f":"MOS_Table_4!BT165+MOS_Table_4!BU165+MOS_Table_4!BQ165","v":0},{"$f":"MOS_Table_4!BW165+MOS_Table_4!BX165+MOS_Table_4!BY165","v":0},{"$f":"MOS_Table_4!BV165","v":0},{"$f":"MOS_Table_4!CB165","v":0},{"$f":"MOS_Table_4!BZ165","v":0},{"$f":"MOS_Table_4!CE165","v":0},{"$f":"MOS_Table_4!BN165+MOS_Table_4!CH165+MOS_Table_4!CI165","v":0},0,null,null,null,null,null,null,null,null,null,null,null,null,null,null,null,null,null,null,null,null,null,null,null,null,null,null,null,null,null,null,null,null,null,null,null,null,null,null,null,null,null,null,null,null,null,null,"United Kingdom",157,null,null,null,null,null,0,null,null,null,null,null,null,null,null,null,null,null,null,null,null,null,null,null,null,null,null,null,null,0,0,null,null,"United Kingdom",157,null,null,null,null,null,0,null,null,null,null,null,null,null,null,null,null,null,null,null,null,null,null,null,null,null,null,null,null,0,0]
[null,null,null,null,null,null,null,null,null,null,"ê",null,null,null,null,null,null,null,null,null,null,null,null,null,null,null,null,null,null,null,null,null,null,null,null,null,null,null,null,null,"United States",158,{"$f":"MOS_Table_3!AP166","v":0},{"$f":"MOS_Table_3!AQ166","v":0},{"$f":"SUM(MOS_Table_3!AR166,MOS_Table_3!AS166,MOS_Table_3!AT166)","v":0},0,{"$f":"MOS_Table_3!AW166","v":0},{"$f":"MOS_Table_3!AX166","v":0},{"$f":"SUM(MOS_Table_3!BB166,MOS_Table_3!BC166,MOS_Table_3!AY166)","v":0},{"$f":"SUM(MOS_Table_3!BE166:BG166)","v":0},{"$f":"MOS_Table_3!BD166","v":0},{"$f":"MOS_Table_3!BJ166","v":0},{"$f":"MOS_Table_3!BH166","v":0},{"$f":"MOS_Table_3!BM166","v":0},{"$f":"SUM(MOS_Table_3!AV166,MOS_Table_3!BP166,MOS_Table_3!BQ166)","v":0},0,null,null,"United States",158,{"$f":"MOS_Table_4!BH166","v":0},{"$f":"MOS_Table_4!BI166","v":0},{"$f":"MOS_Table_4!BJ166+MOS_Table_4!BK166+MOS_Table_4!BL166","v":0},0,{"$f":"MOS_Table_4!BO166","v":0},{"$f":"MOS_Table_4!BP166","v":0},{"$f":"MOS_Table_4!BT166+MOS_Table_4!BU166+MOS_Table_4!BQ166","v":0},{"$f":"MOS_Table_4!BW166+MOS_Table_4!BX166+MOS_Table_4!BY166","v":0},{"$f":"MOS_Table_4!BV166","v":0},{"$f":"MOS_Table_4!CB166","v":0},{"$f":"MOS_Table_4!BZ166","v":0},{"$f":"MOS_Table_4!CE166","v":0},{"$f":"MOS_Table_4!BN166+MOS_Table_4!CH166+MOS_Table_4!CI166","v":0},0,null,null,null,null,null,null,null,null,null,null,null,null,null,null,null,null,null,null,null,null,null,null,null,null,null,null,null,null,null,null,null,null,null,null,null,null,null,null,null,null,null,null,null,null,null,null,"United States",158,null,null,null,null,null,0,null,null,null,null,null,null,null,null,null,null,null,null,null,null,null,null,null,null,null,null,null,null,0,0,null,null,"United States",158,null,null,null,null,null,0,null,null,null,null,null,null,null,null,null,null,null,null,null,null,null,null,null,null,null,null,null,null,0,0]
[null,null,null,null,null,null,null,null,null,null," ",null,null,null,null,null,null,null,null,null,null,null,null,null,null,null,null,null,null,null,null,null,null,null,null,null,null,null,null,null,"Uruguay",159,{"$f":"MOS_Table_3!AP167","v":0},{"$f":"MOS_Table_3!AQ167","v":0},{"$f":"SUM(MOS_Table_3!AR167,MOS_Table_3!AS167,MOS_Table_3!AT167)","v":0},0,{"$f":"MOS_Table_3!AW167","v":0},{"$f":"MOS_Table_3!AX167","v":0},{"$f":"SUM(MOS_Table_3!BB167,MOS_Table_3!BC167,MOS_Table_3!AY167)","v":0},{"$f":"SUM(MOS_Table_3!BE167:BG167)","v":0},{"$f":"MOS_Table_3!BD167","v":0},{"$f":"MOS_Table_3!BJ167","v":0},{"$f":"MOS_Table_3!BH167","v":0},{"$f":"MOS_Table_3!BM167","v":0},{"$f":"SUM(MOS_Table_3!AV167,MOS_Table_3!BP167,MOS_Table_3!BQ167)","v":0},0,null,null,"Uruguay",159,{"$f":"MOS_Table_4!BH167","v":0},{"$f":"MOS_Table_4!BI167","v":0},{"$f":"MOS_Table_4!BJ167+MOS_Table_4!BK167+MOS_Table_4!BL167","v":0},0,{"$f":"MOS_Table_4!BO167","v":0},{"$f":"MOS_Table_4!BP167","v":0},{"$f":"MOS_Table_4!BT167+MOS_Table_4!BU167+MOS_Table_4!BQ167","v":0},{"$f":"MOS_Table_4!BW167+MOS_Table_4!BX167+MOS_Table_4!BY167","v":0},{"$f":"MOS_Table_4!BV167","v":0},{"$f":"MOS_Table_4!CB167","v":0},{"$f":"MOS_Table_4!BZ167","v":0},{"$f":"MOS_Table_4!CE167","v":0},{"$f":"MOS_Table_4!BN167+MOS_Table_4!CH167+MOS_Table_4!CI167","v":0},0,null,null,null,null,null,null,null,null,null,null,null,null,null,null,null,null,null,null,null,null,null,null,null,null,null,null,null,null,null,null,null,null,null,null,null,null,null,null,null,null,null,null,null,null,null,null,"Uruguay",159,null,null,null,null,null,0,null,null,null,null,null,null,null,null,null,null,null,null,null,null,null,null,null,null,null,null,null,null,0,0,null,null,"Uruguay",159,null,null,null,null,null,0,null,null,null,null,null,null,null,null,null,null,null,null,null,null,null,null,null,null,null,null,null,null,0,0]
[null,null,null,null,null,null,null,null,null,null,"ê",null,null,null,null,null,null,null,null,null,null,null,null,null,null,null,null,null,null,null,null,null,null,null,null,null,null,null,null,null,"Uzbekistan",160,{"$f":"MOS_Table_3!AP168","v":0},{"$f":"MOS_Table_3!AQ168","v":0},{"$f":"SUM(MOS_Table_3!AR168,MOS_Table_3!AS168,MOS_Table_3!AT168)","v":0},0,{"$f":"MOS_Table_3!AW168","v":0},{"$f":"MOS_Table_3!AX168","v":0},{"$f":"SUM(MOS_Table_3!BB168,MOS_Table_3!BC168,MOS_Table_3!AY168)","v":0},{"$f":"SUM(MOS_Table_3!BE168:BG168)","v":0},{"$f":"MOS_Table_3!BD168","v":0},{"$f":"MOS_Table_3!BJ168","v":0},{"$f":"MOS_Table_3!BH168","v":0},{"$f":"MOS_Table_3!BM168","v":0},{"$f":"SUM(MOS_Table_3!AV168,MOS_Table_3!BP168,MOS_Table_3!BQ168)","v":0},0,null,null,"Uzbekistan",160,{"$f":"MOS_Table_4!BH168","v":0},{"$f":"MOS_Table_4!BI168","v":0},{"$f":"MOS_Table_4!BJ168+MOS_Table_4!BK168+MOS_Table_4!BL168","v":0},0,{"$f":"MOS_Table_4!BO168","v":0},{"$f":"MOS_Table_4!BP168","v":0},{"$f":"MOS_Table_4!BT168+MOS_Table_4!BU168+MOS_Table_4!BQ168","v":0},{"$f":"MOS_Table_4!BW168+MOS_Table_4!BX168+MOS_Table_4!BY168","v":0},{"$f":"MOS_Table_4!BV168","v":0},{"$f":"MOS_Table_4!CB168","v":0},{"$f":"MOS_Table_4!BZ168","v":0},{"$f":"MOS_Table_4!CE168","v":0},{"$f":"MOS_Table_4!BN168+MOS_Table_4!CH168+MOS_Table_4!CI168","v":0},0,null,null,null,null,null,null,null,null,null,null,null,null,null,null,null,null,null,null,null,null,null,null,null,null,null,null,null,null,null,null,null,null,null,null,null,null,null,null,null,null,null,null,null,null,null,null,"Uzbekistan",160,null,null,null,null,null,0,null,null,null,null,null,null,null,null,null,null,null,null,null,null,null,null,null,null,null,null,null,null,0,0,null,null,"Uzbekistan",160,null,null,null,null,null,0,null,null,null,null,null,null,null,null,null,null,null,null,null,null,null,null,null,null,null,null,null,null,0,0]
[null,null,null,null,null,null,null,null,null,null," ",null,null,null,null,null,null,null,null,null,null,null,null,null,null,null,null,null,null,null,null,null,null,null,null,null,null,null,null,null,"Venezuela, Bolivarian Republic",161,{"$f":"MOS_Table_3!AP169","v":0},{"$f":"MOS_Table_3!AQ169","v":0},{"$f":"SUM(MOS_Table_3!AR169,MOS_Table_3!AS169,MOS_Table_3!AT169)","v":0},0,{"$f":"MOS_Table_3!AW169","v":0},{"$f":"MOS_Table_3!AX169","v":0},{"$f":"SUM(MOS_Table_3!BB169,MOS_Table_3!BC169,MOS_Table_3!AY169)","v":0},{"$f":"SUM(MOS_Table_3!BE169:BG169)","v":0},{"$f":"MOS_Table_3!BD169","v":0},{"$f":"MOS_Table_3!BJ169","v":0},{"$f":"MOS_Table_3!BH169","v":0},{"$f":"MOS_Table_3!BM169","v":0},{"$f":"SUM(MOS_Table_3!AV169,MOS_Table_3!BP169,MOS_Table_3!BQ169)","v":0},0,null,null,"Venezuela, Bolivarian Republic",161,{"$f":"MOS_Table_4!BH169","v":0},{"$f":"MOS_Table_4!BI169","v":0},{"$f":"MOS_Table_4!BJ169+MOS_Table_4!BK169+MOS_Table_4!BL169","v":0},0,{"$f":"MOS_Table_4!BO169","v":0},{"$f":"MOS_Table_4!BP169","v":0},{"$f":"MOS_Table_4!BT169+MOS_Table_4!BU169+MOS_Table_4!BQ169","v":0},{"$f":"MOS_Table_4!BW169+MOS_Table_4!BX169+MOS_Table_4!BY169","v":0},{"$f":"MOS_Table_4!BV169","v":0},{"$f":"MOS_Table_4!CB169","v":0},{"$f":"MOS_Table_4!BZ169","v":0},{"$f":"MOS_Table_4!CE169","v":0},{"$f":"MOS_Table_4!BN169+MOS_Table_4!CH169+MOS_Table_4!CI169","v":0},0,null,null,null,null,null,null,null,null,null,null,null,null,null,null,null,null,null,null,null,null,null,null,null,null,null,null,null,null,null,null,null,null,null,null,null,null,null,null,null,null,null,null,null,null,null,null,"Venezuela, Bolivarian Republic",161,null,null,null,null,null,0,null,null,null,null,null,null,null,null,null,null,null,null,null,null,null,null,null,null,null,null,null,null,0,0,null,null,"Venezuela, Bolivarian Republic",161,null,null,null,null,null,0,null,null,null,null,null,null,null,null,null,null,null,null,null,null,null,null,null,null,null,null,null,null,0,0]
[null,null,null,null,null,null,null,null,null,null,"ê",null,null,null,null,null,null,null,null,null,null,null,null,null,null,null,null,null,null,null,null,null,null,null,null,null,null,null,null,null,"Viet Nam",162,{"$f":"MOS_Table_3!AP170","v":0},{"$f":"MOS_Table_3!AQ170","v":0},{"$f":"SUM(MOS_Table_3!AR170,MOS_Table_3!AS170,MOS_Table_3!AT170)","v":0},0,{"$f":"MOS_Table_3!AW170","v":0},{"$f":"MOS_Table_3!AX170","v":0},{"$f":"SUM(MOS_Table_3!BB170,MOS_Table_3!BC170,MOS_Table_3!AY170)","v":0},{"$f":"SUM(MOS_Table_3!BE170:BG170)","v":0},{"$f":"MOS_Table_3!BD170","v":0},{"$f":"MOS_Table_3!BJ170","v":0},{"$f":"MOS_Table_3!BH170","v":0},{"$f":"MOS_Table_3!BM170","v":0},{"$f":"SUM(MOS_Table_3!AV170,MOS_Table_3!BP170,MOS_Table_3!BQ170)","v":0},0,null,null,"Viet Nam",162,{"$f":"MOS_Table_4!BH170","v":0},{"$f":"MOS_Table_4!BI170","v":0},{"$f":"MOS_Table_4!BJ170+MOS_Table_4!BK170+MOS_Table_4!BL170","v":0},0,{"$f":"MOS_Table_4!BO170","v":0},{"$f":"MOS_Table_4!BP170","v":0},{"$f":"MOS_Table_4!BT170+MOS_Table_4!BU170+MOS_Table_4!BQ170","v":0},{"$f":"MOS_Table_4!BW170+MOS_Table_4!BX170+MOS_Table_4!BY170","v":0},{"$f":"MOS_Table_4!BV170","v":0},{"$f":"MOS_Table_4!CB170","v":0},{"$f":"MOS_Table_4!BZ170","v":0},{"$f":"MOS_Table_4!CE170","v":0},{"$f":"MOS_Table_4!BN170+MOS_Table_4!CH170+MOS_Table_4!CI170","v":0},0,null,null,null,null,null,null,null,null,null,null,null,null,null,null,null,null,null,null,null,null,null,null,null,null,null,null,null,null,null,null,null,null,null,null,null,null,null,null,null,null,null,null,null,null,null,null,"Viet Nam",162,null,null,null,null,null,0,null,null,null,null,null,null,null,null,null,null,null,null,null,null,null,null,null,null,null,null,null,null,0,0,null,null,"Viet Nam",162,null,null,null,null,null,0,null,null,null,null,null,null,null,null,null,null,null,null,null,null,null,null,null,null,null,null,null,null,0,0]
[null,null,null,null,null,null,null,null,null,null," ",null,null,null,null,null,null,null,null,null,null,null,null,null,null,null,null,null,null,null,null,null,null,null,null,null,null,null,null,null,"Yemen",163,{"$f":"MOS_Table_3!AP171","v":0},{"$f":"MOS_Table_3!AQ171","v":0},{"$f":"SUM(MOS_Table_3!AR171,MOS_Table_3!AS171,MOS_Table_3!AT171)","v":0},0,{"$f":"MOS_Table_3!AW171","v":0},{"$f":"MOS_Table_3!AX171","v":0},{"$f":"SUM(MOS_Table_3!BB171,MOS_Table_3!BC171,MOS_Table_3!AY171)","v":0},{"$f":"SUM(MOS_Table_3!BE171:BG171)","v":0},{"$f":"MOS_Table_3!BD171","v":0},{"$f":"MOS_Table_3!BJ171","v":0},{"$f":"MOS_Table_3!BH171","v":0},{"$f":"MOS_Table_3!BM171","v":0},{"$f":"SUM(MOS_Table_3!AV171,MOS_Table_3!BP171,MOS_Table_3!BQ171)","v":0},0,null,null,"Yemen",163,{"$f":"MOS_Table_4!BH171","v":0},{"$f":"MOS_Table_4!BI171","v":0},{"$f":"MOS_Table_4!BJ171+MOS_Table_4!BK171+MOS_Table_4!BL171","v":0},0,{"$f":"MOS_Table_4!BO171","v":0},{"$f":"MOS_Table_4!BP171","v":0},{"$f":"MOS_Table_4!BT171+MOS_Table_4!BU171+MOS_Table_4!BQ171","v":0},{"$f":"MOS_Table_4!BW171+MOS_Table_4!BX171+MOS_Table_4!BY171","v":0},{"$f":"MOS_Table_4!BV171","v":0},{"$f":"MOS_Table_4!CB171","v":0},{"$f":"MOS_Table_4!BZ171","v":0},{"$f":"MOS_Table_4!CE171","v":0},{"$f":"MOS_Table_4!BN171+MOS_Table_4!CH171+MOS_Table_4!CI171","v":0},0,null,null,null,null,null,null,null,null,null,null,null,null,null,null,null,null,null,null,null,null,null,null,null,null,null,null,null,null,null,null,null,null,null,null,null,null,null,null,null,null,null,null,null,null,null,null,"Yemen",163,null,null,null,null,null,0,null,null,null,null,null,null,null,null,null,null,null,null,null,null,null,null,null,null,null,null,null,null,0,0,null,null,"Yemen",163,null,null,null,null,null,0,null,null,null,null,null,null,null,null,null,null,null,null,null,null,null,null,null,null,null,null,null,null,0,0]
[null,null,null,null,null,null,null,null,null,null," ",null,null,null,null,null,null,null,null,null,null,null,null,null,null,null,null,null,null,null,null,null,null,null,null,null,null,null,null,null,"Not elsewhere specified",164,{"$f":"MOS_Table_3!AP172","v":0},{"$f":"MOS_Table_3!AQ172","v":0},{"$f":"SUM(MOS_Table_3!AR172,MOS_Table_3!AS172,MOS_Table_3!AT172)","v":0},0,{"$f":"MOS_Table_3!AW172","v":0},{"$f":"MOS_Table_3!AX172","v":0},{"$f":"SUM(MOS_Table_3!BB172,MOS_Table_3!BC172,MOS_Table_3!AY172)","v":0},{"$f":"SUM(MOS_Table_3!BE172:BG172)","v":0},{"$f":"MOS_Table_3!BD172","v":0},{"$f":"MOS_Table_3!BJ172","v":0},{"$f":"MOS_Table_3!BH172","v":0},{"$f":"MOS_Table_3!BM172","v":0},{"$f":"SUM(MOS_Table_3!AV172,MOS_Table_3!BP172,MOS_Table_3!BQ172)","v":0},0,null,null,"Not elsewhere specified",164,{"$f":"MOS_Table_4!BH172","v":0},{"$f":"MOS_Table_4!BI172","v":0},{"$f":"MOS_Table_4!BJ172+MOS_Table_4!BK172+MOS_Table_4!BL172","v":0},0,{"$f":"MOS_Table_4!BO172","v":0},{"$f":"MOS_Table_4!BP172","v":0},{"$f":"MOS_Table_4!BT172+MOS_Table_4!BU172+MOS_Table_4!BQ172","v":0},{"$f":"MOS_Table_4!BW172+MOS_Table_4!BX172+MOS_Table_4!BY172","v":0},{"$f":"MOS_Table_4!BV172","v":0},{"$f":"MOS_Table_4!CB172","v":0},{"$f":"MOS_Table_4!BZ172","v":0},{"$f":"MOS_Table_4!CE172","v":0},{"$f":"MOS_Table_4!BN172+MOS_Table_4!CH172+MOS_Table_4!CI172","v":0},0,null,null,null,null,null,null,null,null,null,null,null,null,null,null,null,null,null,null,null,null,null,null,null,null,null,null,null,null,null,null,null,null,null,null,null,null,null,null,null,null,null,null,null,null,null,null,"Not elsewhere specified",164,null,null,null,null,null,0,null,null,null,null,null,null,null,null,null,null,null,null,null,null,null,null,null,null,null,null,null,null,0,0,null,null,"Not elsewhere specified",164,null,null,null,null,null,0,null,null,null,null,null,null,null,null,null,null,null,null,null,null,null,null,null,null,null,null,null,null,0,0]
[null,null,null,null,null,null,null,null,null,null,null,null,null,null,null,null,null,null,null,null,null,null,null,null,null,null,null,null,null,null,null,null,null,null,null,null,null,null,null,null,"Total Imports",165,{"$f":"SUM(AQ12:AQ175)","v":0},{"$f":"SUM(AR12:AR175)","v":0},{"$f":"SUM(AS12:AS175)","v":0},0,{"$f":"SUM(AU12:AU175)","v":0},0,0,0,0,0,0,0,0,0,null,null,"Total Exports",165,{"$f":"SUM(BI12:BI175)","v":0},{"$f":"SUM(BJ12:BJ175)","v":0},{"$f":"SUM(BK12:BK175)","v":0},0,{"$f":"SUM(BM12:BM175)","v":0},0,0,0,0,0,0,0,0,0,null,null,null,null,null,null,null,null,null,null,null,null,null,null,null,null,null,null,null,null,null,null,null,null,null,null,null,null,null,null,null,null,null,null,null,null,null,null,null,null,null,null,null,null,null,null,"Total Imports1 2",165,{"$f":"SUM(DS12:DS175)","v":0},0,0,0,0,0,0,0,0,0,0,0,0,0,0,0,0,0,0,0,0,0,0,0,0,0,0,0,{"$f":"SUM(EU12:EU175)","v":0},0,null,null,"Total Exports1 2",165,{"$f":"SUM(FA12:FA175)","v":0},0,0,0,0,0,0,0,0,0,0,0,0,0,0,0,0,0,0,0,0,0,0,0,0,0,0,0,0,0]
[null,"Formulas backup for QuE forms WITHOUT MOS"]
[]
[null,null,null,null,null,null,null,null,null,null,null,null,null,null,null,null,null,null,null,null,null,null,null,null,null,null,null,null,null,null,null,null,null,null,null,null,null,null,null,null,"Crude Imports",null,null,null,null,null,"Product Imports",null,null,null,null,null,null,null,null,null,null,null,"Crude Exports",null,null,null,null,null,"Product Exports"]
[null,"Crude, NGL and Other Balance",null,null,null,null,null,null,"Product Balance",null,null,null,null,null,null,null,null,null,null,null,null,null,"Crude, NGL and Other Stocks",null,null,null,null,null,"Product Closing stocks",null,null,null,null,null,null,null,null,null,null,null,null,null,null,null,null,"Thousand Metric Tons",null,null,null,null,null,null,null,"Thousand Metric Tons",null,null,null,null,null,null,null,null,null,"Thousand Metric Tons",null,null,null,null,null,null,null,"Thousand Metric Tons"]
[null,null,null,null,null,null,"Thousand Metric Tons",null,null,null,null,null,null,null,null,null,null,"Thousand Metric Tons",null,null,null,null,null,null,null,null,null,"Thousand Metric Tons",null,null,null,null,null,null,null,null,null,"Thousand Metric Tons"]
[null,null,null,null,null,null,null,null,null,null,"Petroleum Products",null,null,null,null,null,null,null,null,null,null,null,null,null,null,null,null,null,"Petroleum Products",null,null,null,null,null,null,null,null,null,null,null,null,null,"Crude Oil","NGL","Other","Total\n(1)+(2)+(3)","LPG","Naphtha","Gasoline","Total Kerosene","Of which: Jet\nKerosene","Gas/ Diesel Oil","Of which: road diesel","Fuel Oil","Other\nProducts","Total Products (5)+(6)+(7)+ (8)+(10)+(12)+(13)",null,null,null,null,"Crude Oil","NGL","Other","Total\n(1)+(2)+(3)","LPG","Naphtha","Gasoline","Total Kerosene","Of which: Jet\nKerosene","Gas/ Diesel Oil","Of which: road diesel","Fuel Oil","Other\nProducts","Total Products (5)+(6)+(7)+ (8)+(10)+(12)+(13)"]
[null,null,null,"Crude Oil","NGL","Other","Total\n(1)+(2)+(3)",null,null,null,"LPG","Naphtha","Gasoline","Total Kerosene","Of which: Jet\nKerosene","Gas/ Diesel Oil","Of which: Transport Diesel","Fuel Oil","Other\nProducts","Total Products \n(5)+(6)+(7)+(8) +(10)+(12)+(13)",null,null,null,null,"Crude Oil","NGL","Other","Total\n(1)+(2)+(3)","LPG","Naphtha","Gasoline","Total Kerosene","Of which: Jet\nKerosene","Gas/ Diesel Oil","Of which: Road Diesel","Fuel Oil","Other\nProducts","Total Products (5)+(6)+(7)+(8) +(10)+(12)+(13)",null,null,null,null,"(1)","(2)","(3)","(4)","(5)","(6)","(7)","(8)","(9)","(10)","(11)","(12)","(13)","(14)",null,null,null,null,"(1)","(2)","(3)","(4)","(5)","(6)","(7)","(8)","(9)","(10)","(11)","(12)","(13)","(14)"]
[null,null,null,"(1)","(2)","(3)","(4)",null,null,null,"(5)","(6)","(7)","(8)","(9)","(10)","(11)","(12)","(13)","(14)",null,null,null,null,"(1)","(2)","(3)","(4)","(5)","(6)","(7)","(8)","(9)","(10)","(11)","(12)","(13)","(14)",null,null,"Albania",1,null,null,null,{"$f":"SUM(AQ184:AS184)","v":0},null,null,null,null,null,null,null,null,null,{"$f":"SUM(AU184:BC184)-AY184-BA184","v":0},null,null,"Albania",1,null,null,null,{"$f":"SUM(BI184:BK184)","v":0},null,null,null,null,null,null,null,null,null,{"$f":"+BM184+BN184+BO184+BP184+BR184+BT184+BU184","v":0}]
[null,"+","Production",null,null,null,{"$f":"SUM(D185:F185)","v":0},null,"+","Refinery Output",null,null,null,null,null,null,null,null,null,{"$f":"K185+L185+M185+N185+P185+R185+S185","v":0},null,null,"Closing stocks on National Territory",null,{"$f":"Y186+Y188+Y189+Y190","v":0},0,0,0,0,0,0,0,0,0,0,0,0,0,null,null,"Algeria",2,null,null,null,{"$f":"SUM(AQ185:AS185)","v":0},null,null,null,null,null,null,null,null,null,{"$f":"SUM(AU185:BC185)-AY185-BA185","v":0},null,null,"Algeria",2,null,null,null,{"$f":"SUM(BI185:BK185)","v":0},null,null,null,null,null,null,null,null,null,{"$f":"+BM185+BN185+BO185+BP185+BR185+BT185+BU185","v":0}]
[null,"+","From Other sources",null,null,null,{"$f":"F186","v":0},null,"+","Receipts",null,null,null,null,null,null,null,null,null,{"$f":"K186+L186+M186+N186+P186+R186+S186","v":0},null,null,null,"Industry",null,null,null,{"$f":"SUM(Y186:AA186)","v":0},null,null,null,null,null,null,null,null,null,{"$f":"AC186+AD186+AE186+AF186+AH186+AJ186+AK186","v":0},null,null,"Andorra",3,null,null,null,0,null,null,null,null,null,null,null,null,null,0,null,null,"Andorra",3,null,null,null,0,null,null,null,null,null,null,null,null,null,0]
[null,"+","Imports",null,null,null,{"$f":"SUM(D187:F187)","v":0},null,"+","Imports",null,null,null,null,null,null,null,null,null,0,null,null,null,"Of which: obligated industry stocks",null,null,null,{"$f":"SUM(Y187:AA187)","v":0},null,null,null,null,null,null,null,null,null,{"$f":"AC187+AD187+AE187+AF187+AH187+AJ187+AK187","v":0},null,null,"Angola",4,null,null,null,0,null,null,null,null,null,null,null,null,null,0,null,null,"Angola",4,null,null,null,0,null,null,null,null,null,null,null,null,null,0]
[null,"-","Exports",null,null,null,{"$f":"SUM(D188:F188)","v":0},null,"-","Exports",null,null,null,null,null,null,null,null,null,0,null,null,null,"Agency",null,null,null,{"$f":"SUM(Y188:AA188)","v":0},null,null,null,null,null,null,null,null,null,{"$f":"AC188+AD188+AE188+AF188+AH188+AJ188+AK188","v":0},null,null,"Argentina",5,null,null,null,0,null,null,null,null,null,null,null,null,null,0,null,null,"Argentina",5,null,null,null,0,null,null,null,null,null,null,null,null,null,0]
[null,"+","Products Transferred\n/Backflows",null,null,null,{"$f":"F189","v":0},null,"-","Products Transferred",null,null,null,null,null,null,null,null,null,0,null,null,null,"Government",null,null,null,{"$f":"SUM(Y189:AA189)","v":0},null,null,null,null,null,null,null,null,null,0,null,null,"Armenia",6,null,null,null,0,null,null,null,null,null,null,null,null,null,0,null,null,"Armenia",6,null,null,null,0,null,null,null,null,null,null,null,null,null,0]
[null,"-","Direct Use",null,null,null,{"$f":"SUM(D190:F190)","v":0},null,"+","Interproduct Transfers",null,null,null,null,null,null,null,null,null,0,null,null,"Closing stocks on National Territory with foreign claim",null,{"$f":"Y191+Y192+Y193","v":0},{"$f":"Z191+Z192+Z193","v":0},{"$f":"AA191+AA192+AA193","v":0},{"$f":"AB191+AB192+AB193","v":0},{"$f":"+AC191+AC192+AC193","v":0},0,0,0,0,0,0,0,0,0,null,null,"Aruba",7,null,null,null,0,null,null,null,null,null,null,null,null,null,0,null,null,"Aruba",7,null,null,null,0,null,null,null,null,null,null,null,null,null,0]
[null,"-","Stock Change",null,null,null,{"$f":"SUM(D191:F191)","v":0},null,"-","Stock Change",null,null,null,null,null,null,null,null,null,0,null,null,null,"Industry",null,null,null,{"$f":"SUM(Y191:AA191)","v":0},null,null,null,null,null,null,null,null,null,0,null,null,"Australia",8,null,null,null,0,null,null,null,null,null,null,null,null,null,0,null,null,"Australia",8,null,null,null,0,null,null,null,null,null,null,null,null,null,0]
[null,"-","Statistical Difference",{"$f":"D185+D187-D188-D190-D191-D193","v":0},{"$f":"E185+E187-E188-E190-E191-E193","v":0},{"$f":"F185+F186+F187-F188+F189-F190-F191-F193","v":0},{"$f":"G185+G186+G187-G188+G189-G190-G191-G193","v":0},null,"-","Statistical Difference",{"$f":"K185+K186+K187-K188-K189+K190-K191-K193","v":0},{"$f":"L185+L186+L187-L188-L189+L190-L191-L193","v":0},0,0,0,0,0,0,0,0,null,null,null,"Agency",null,null,null,{"$f":"SUM(Y192:AA192)","v":0},null,null,null,null,null,null,null,null,null,0,null,null,"Austria",9,null,null,null,0,null,null,null,null,null,null,null,null,null,0,null,null,"Austria",9,null,null,null,0,null,null,null,null,null,null,null,null,null,0]
[null,"=","Refinery Intake",null,null,null,{"$f":"SUM(D193:F193)","v":0},null,"="," Demand",null,null,null,null,null,null,null,null,null,0,null,null,null,"Government",null,null,null,{"$f":"SUM(Y193:AA193)","v":0},null,null,null,null,null,null,null,null,null,0,null,null,"Azerbaijan",10,null,null,null,0,null,null,null,null,null,null,null,null,null,0,null,null,"Azerbaijan",10,null,null,null,0,null,null,null,null,null,null,null,null,null,0]
[null,null,null,null,null,null,null,null,null,null,null,null,null,null,null,null,null,null,null,null,null,null,null,null,null,null,null,null,null,null,null,null,null,null,null,null,null,null,null,null,"Bahamas",11,null,null,null,0,null,null,null,null,null,null,null,null,null,0,null,null,"Bahamas",11,null,null,null,0,null,null,null,null,null,null,null,null,null,0]
[null,null,null,null,null,null,null,null,null,null,null,null,null,null,null,null,null,null,null,null,null,null,null,null,null,null,null,null,null,null,null,null,null,null,null,null,null,null,null,null,"Bahrain",12,null,null,null,0,null,null,null,null,null,null,null,null,null,0,null,null,"Bahrain",12,null,null,null,0,null,null,null,null,null,null,null,null,null,0]
[null,null,null,null,null,null,null,null,null,null,null,null,null,null,null,null,null,null,null,null,null,null,"Stocks held abroad",null,{"$f":"Y197+Y199+Y200","v":0},0,0,0,0,0,0,0,0,0,0,0,0,0,null,null,"Bangladesh",13,null,null,null,0,null,null,null,null,null,null,null,null,null,0,null,null,"Bangladesh",13,null,null,null,0,null,null,null,null,null,null,null,null,null,0]
[null,null,null,null,null,null,null,null,null,null,null,null,null,null,null,null,null,null,null,null,null,null,null,"Industry",null,null,null,{"$f":"SUM(Y197:AA197)","v":0},null,null,null,null,null,null,null,null,null,{"$f":"AC197+AD197+AE197+AF197+AH197+AJ197+AK197","v":0},null,null,"Barbados",14,null,null,null,0,null,null,null,null,null,null,null,null,null,0,null,null,"Barbados",14,null,null,null,0,null,null,null,null,null,null,null,null,null,0]
[null,null,null,null,null,null,null,null,null,null,null,null,null,null,null,null,null,null,null,null,null,null,null,"Of which: obligated industry stocks",null,null,null,{"$f":"SUM(Y198:AA198)","v":0},null,null,null,null,null,null,null,null,null,{"$f":"AC198+AD198+AE198+AF198+AH198+AJ198+AK198","v":0},null,null,"Belarus",15,null,null,null,0,null,null,null,null,null,null,null,null,null,0,null,null,"Belarus",15,null,null,null,0,null,null,null,null,null,null,null,null,null,0]
[null,null,null,null,null,null,null,null,null,null,null,null,null,null,null,null,null,null,null,null,null,null,null,"Agency",null,null,null,{"$f":"SUM(Y199:AA199)","v":0},null,null,null,null,null,null,null,null,null,{"$f":"AC199+AD199+AE199+AF199+AH199+AJ199+AK199","v":0},null,null,"Belgium",16,null,null,null,0,null,null,null,null,null,null,null,null,null,0,null,null,"Belgium",16,null,null,null,0,null,null,null,null,null,null,null,null,null,0]
[null,null,null,null,null,null,null,null,null,null,null,null,null,null,null,null,null,null,null,null,null,null,null,"Government",null,null,null,{"$f":"SUM(Y200:AA200)","v":0},null,null,null,null,null,null,null,null,null,{"$f":"AC200+AD200+AE200+AF200+AH200+AJ200+AK200","v":0},null,null,"Belize",17,null,null,null,0,null,null,null,null,null,null,null,null,null,0,null,null,"Belize",17,null,null,null,0,null,null,null,null,null,null,null,null,null,0]
[null,null,null,null,null,null,null,null,null,null,null,null,null,null,null,null,null,null,null,null,null,null,null,null,null,null,null,null,null,null,null,null,null,null,null,null,null,null,null,null,"Benin",18,null,null,null,0,null,null,null,null,null,null,null,null,null,0,null,null,"Benin",18,null,null,null,0,null,null,null,null,null,null,null,null,null,0]
[null,null,null,null,null,null,null,null,null,null,null,null,null,null,null,null,null,null,null,null,null,null,null,null,null,null,null,null,null,null,null,null,null,null,null,null,null,null,null,null,"Bolivia",19,null,null,null,0,null,null,null,null,null,null,null,null,null,0,null,null,"Bolivia",19,null,null,null,0,null,null,null,null,null,null,null,null,null,0]
[null,null,null,null,null,null,null,null,null,null,null,null,null,null,null,null,null,null,null,null,null,null,null,null,null,null,null,null,null,null,null,null,null,null,null,null,null,null,null,null,"Bosnia and Herzegovina",20,null,null,null,0,null,null,null,null,null,null,null,null,null,0,null,null,"Bosnia and Herzegovina",20,null,null,null,0,null,null,null,null,null,null,null,null,null,0]
[null,null,null,null,null,null,null,null,null,null,null,null,null,null,null,null,null,null,null,null,null,null,null,null,null,null,null,null,null,null,null,null,null,null,null,null,null,null,null,null,"Brazil",21,null,null,null,0,null,null,null,null,null,null,null,null,null,0,null,null,"Brazil",21,null,null,null,0,null,null,null,null,null,null,null,null,null,0]
[null,null,null,null,null,null,null,null,null,null,null,null,null,null,null,null,null,null,null,null,null,null,null,null,null,null,null,null,null,null,null,null,null,null,null,null,null,null,null,null,"British Virgin Islands",22,null,null,null,0,null,null,null,null,null,null,null,null,null,0,null,null,"British Virgin Islands",22,null,null,null,0,null,null,null,null,null,null,null,null,null,0]
[null,null,null,null,null,null,null,null,null,null,null,null,null,null,null,null,null,null,null,null,null,null,null,null,null,null,null,null,null,null,null,null,null,null,null,null,null,null,null,null,"Brunei Darussalam",23,null,null,null,0,null,null,null,null,null,null,null,null,null,0,null,null,"Brunei Darussalam",23,null,null,null,0,null,null,null,null,null,null,null,null,null,0]
[null,null,null,null,null,null,null,null,null,null,null,null,null,null,null,null,null,null,null,null,null,null,null,null,null,null,null,null,null,null,null,null,null,null,null,null,null,null,null,null,"Bulgaria",24,null,null,null,0,null,null,null,null,null,null,null,null,null,0,null,null,"Bulgaria",24,null,null,null,0,null,null,null,null,null,null,null,null,null,0]
[null,null,null,null,null,null,null,null,null,null,null,null,null,null,null,null,null,null,null,null,null,null,null,null,null,null,null,null,null,null,null,null,null,null,null,null,null,null,null,null,"Cambodia",25,null,null,null,0,null,null,null,null,null,null,null,null,null,0,null,null,"Cambodia",25,null,null,null,0,null,null,null,null,null,null,null,null,null,0]
[null,null,null,null,null,null,null,null,null,null,null,null,null,null,null,null,null,null,null,null,null,null,null,null,null,null,null,null,null,null,null,null,null,null,null,null,null,null,null,null,"Cameroon",26,null,null,null,0,null,null,null,null,null,null,null,null,null,0,null,null,"Cameroon",26,null,null,null,0,null,null,null,null,null,null,null,null,null,0]
[null,null,null,null,null,null,null,null,null,null,null,null,null,null,null,null,null,null,null,null,null,null,null,null,null,null,null,null,null,null,null,null,null,null,null,null,null,null,null,null,"Canada",27,null,null,null,0,null,null,null,null,null,null,null,null,null,0,null,null,"Canada",27,null,null,null,0,null,null,null,null,null,null,null,null,null,0]
[null,null,null,null,null,null,null,null,null,null,null,null,null,null,null,null,null,null,null,null,null,null,null,null,null,null,null,null,null,null,null,null,null,null,null,null,null,null,null,null,"Cape Verde / Cabo Verde",28,null,null,null,0,null,null,null,null,null,null,null,null,null,0,null,null,"Cape Verde / Cabo Verde",28,null,null,null,0,null,null,null,null,null,null,null,null,null,0]
[null,null,null,null,null,null,null,null,null,null,null,null,null,null,null,null,null,null,null,null,null,null,null,null,null,null,null,null,null,null,null,null,null,null,null,null,null,null,null,null,"Chile",29,null,null,null,0,null,null,null,null,null,null,null,null,null,0,null,null,"Chile",29,null,null,null,0,null,null,null,null,null,null,null,null,null,0]
[null,null,null,null,null,null,null,null,null,null,null,null,null,null,null,null,null,null,null,null,null,null,null,null,null,null,null,null,null,null,null,null,null,null,null,null,null,null,null,null,"China, People's Republic of",30,null,null,null,0,null,null,null,null,null,null,null,null,null,0,null,null,"China, People's Republic of",30,null,null,null,0,null,null,null,null,null,null,null,null,null,0]
[null,null,null,null,null,null,null,null,null,null,null,null,null,null,null,null,null,null,null,null,null,null,null,null,null,null,null,null,null,null,null,null,null,null,null,null,null,null,null,null,"Colombia",31,null,null,null,0,null,null,null,null,null,null,null,null,null,0,null,null,"Colombia",31,null,null,null,0,null,null,null,null,null,null,null,null,null,0]
[null,null,null,null,null,null,null,null,null,null,null,null,null,null,null,null,null,null,null,null,null,null,null,null,null,null,null,null,null,null,null,null,null,null,null,null,null,null,null,null,"Congo",32,null,null,null,0,null,null,null,null,null,null,null,null,null,0,null,null,"Congo",32,null,null,null,0,null,null,null,null,null,null,null,null,null,0]
[null,null,null,null,null,null,null,null,null,null,null,null,null,null,null,null,null,null,null,null,null,null,null,null,null,null,null,null,null,null,null,null,null,null,null,null,null,null,null,null,"Costa Rica",33,null,null,null,0,null,null,null,null,null,null,null,null,null,0,null,null,"Costa Rica",33,null,null,null,0,null,null,null,null,null,null,null,null,null,0]
[null,null,null,null,null,null,null,null,null,null,null,null,null,null,null,null,null,null,null,null,null,null,null,null,null,null,null,null,null,null,null,null,null,null,null,null,null,null,null,null,"Côte d’Ivoire",34,null,null,null,0,null,null,null,null,null,null,null,null,null,0,null,null,"Côte d’Ivoire",34,null,null,null,0,null,null,null,null,null,null,null,null,null,0]
[null,null,null,null,null,null,null,null,null,null,null,null,null,null,null,null,null,null,null,null,null,null,null,null,null,null,null,null,null,null,null,null,null,null,null,null,null,null,null,null,"Croatia",35,null,null,null,0,null,null,null,null,null,null,null,null,null,0,null,null,"Croatia",35,null,null,null,0,null,null,null,null,null,null,null,null,null,0]
[null,null,null,null,null,null,null,null,null,null,null,null,null,null,null,null,null,null,null,null,null,null,null,null,null,null,null,null,null,null,null,null,null,null,null,null,null,null,null,null,"Cuba",36,null,null,null,0,null,null,null,null,null,null,null,null,null,0,null,null,"Cuba",36,null,null,null,0,null,null,null,null,null,null,null,null,null,0]
[null,null,null,null,null,null,null,null,null,null,null,null,null,null,null,null,null,null,null,null,null,null,null,null,null,null,null,null,null,null,null,null,null,null,null,null,null,null,null,null,"Curaçao",37,null,null,null,0,null,null,null,null,null,null,null,null,null,0,null,null,"Curaçao",37,null,null,null,0,null,null,null,null,null,null,null,null,null,0]
[null,null,null,null,null,null,null,null,null,null,null,null,null,null,null,null,null,null,null,null,null,null,null,null,null,null,null,null,null,null,null,null,null,null,null,null,null,null,null,null,"Cyprus",38,null,null,null,0,null,null,null,null,null,null,null,null,null,0,null,null,"Cyprus",38,null,null,null,0,null,null,null,null,null,null,null,null,null,0]
[null,null,null,null,null,null,null,null,null,null,null,null,null,null,null,null,null,null,null,null,null,null,null,null,null,null,null,null,null,null,null,null,null,null,null,null,null,null,null,null,"Czech Republic",39,null,null,null,0,null,null,null,null,null,null,null,null,null,0,null,null,"Czech Republic",39,null,null,null,0,null,null,null,null,null,null,null,null,null,0]
[null,null,null,null,null,null,null,null,null,null,null,null,null,null,null,null,null,null,null,null,null,null,null,null,null,null,null,null,null,null,null,null,null,null,null,null,null,null,null,null,"Korea, Democratic People's Republic of",40,null,null,null,0,null,null,null,null,null,null,null,null,null,0,null,null,"Korea, Democratic People's Republic of",40,null,null,null,0,null,null,null,null,null,null,null,null,null,0]
[null,null,null,null,null,null,null,null,null,null,null,null,null,null,null,null,null,null,null,null,null,null,null,null,null,null,null,null,null,null,null,null,null,null,null,null,null,null,null,null,"Congo, Democratic Republic of the",41,null,null,null,0,null,null,null,null,null,null,null,null,null,0,null,null,"Congo, Democratic Republic of the",41,null,null,null,0,null,null,null,null,null,null,null,null,null,0]
[null,null,null,null,null,null,null,null,null,null,null,null,null,null,null,null,null,null,null,null,null,null,null,null,null,null,null,null,null,null,null,null,null,null,null,null,null,null,null,null,"Denmark",42,null,null,null,0,null,null,null,null,null,null,null,null,null,0,null,null,"Denmark",42,null,null,null,0,null,null,null,null,null,null,null,null,null,0]
[null,null,null,null,null,null,null,null,null,null,null,null,null,null,null,null,null,null,null,null,null,null,null,null,null,null,null,null,null,null,null,null,null,null,null,null,null,null,null,null,"Djibouti",43,null,null,null,0,null,null,null,null,null,null,null,null,null,0,null,null,"Djibouti",43,null,null,null,0,null,null,null,null,null,null,null,null,null,0]
[null,null,null,null,null,null,null,null,null,null,null,null,null,null,null,null,null,null,null,null,null,null,null,null,null,null,null,null,null,null,null,null,null,null,null,null,null,null,null,null,"Dominican Republic",44,null,null,null,0,null,null,null,null,null,null,null,null,null,0,null,null,"Dominican Republic",44,null,null,null,0,null,null,null,null,null,null,null,null,null,0]
[null,null,null,null,null,null,null,null,null,null,null,null,null,null,null,null,null,null,null,null,null,null,null,null,null,null,null,null,null,null,null,null,null,null,null,null,null,null,null,null,"Ecuador",45,null,null,null,0,null,null,null,null,null,null,null,null,null,0,null,null,"Ecuador",45,null,null,null,0,null,null,null,null,null,null,null,null,null,0]
[null,null,null,null,null,null,null,null,null,null,null,null,null,null,null,null,null,null,null,null,null,null,null,null,null,null,null,null,null,null,null,null,null,null,null,null,null,null,null,null,"Egypt",46,null,null,null,0,null,null,null,null,null,null,null,null,null,0,null,null,"Egypt",46,null,null,null,0,null,null,null,null,null,null,null,null,null,0]
[null,null,null,null,null,null,null,null,null,null,null,null,null,null,null,null,null,null,null,null,null,null,null,null,null,null,null,null,null,null,null,null,null,null,null,null,null,null,null,null,"Equatorial Guinea",47,null,null,null,0,null,null,null,null,null,null,null,null,null,0,null,null,"Equatorial Guinea",47,null,null,null,0,null,null,null,null,null,null,null,null,null,0]
[null,null,null,null,null,null,null,null,null,null,null,null,null,null,null,null,null,null,null,null,null,null,null,null,null,null,null,null,null,null,null,null,null,null,null,null,null,null,null,null,"Eritrea",48,null,null,null,0,null,null,null,null,null,null,null,null,null,0,null,null,"Eritrea",48,null,null,null,0,null,null,null,null,null,null,null,null,null,0]
[null,null,null,null,null,null,null,null,null,null,null,null,null,null,null,null,null,null,null,null,null,null,null,null,null,null,null,null,null,null,null,null,null,null,null,null,null,null,null,null,"Estonia",49,null,null,null,0,null,null,null,null,null,null,null,null,null,0,null,null,"Estonia",49,null,null,null,0,null,null,null,null,null,null,null,null,null,0]
[null,null,null,null,null,null,null,null,null,null,null,null,null,null,null,null,null,null,null,null,null,null,null,null,null,null,null,null,null,null,null,null,null,null,null,null,null,null,null,null,"Ethiopia",50,null,null,null,0,null,null,null,null,null,null,null,null,null,0,null,null,"Ethiopia",50,null,null,null,0,null,null,null,null,null,null,null,null,null,0]
[null,null,null,null,null,null,null,null,null,null,null,null,null,null,null,null,null,null,null,null,null,null,null,null,null,null,null,null,null,null,null,null,null,null,null,null,null,null,null,null,"Finland",51,null,null,null,0,null,null,null,null,null,null,null,null,null,0,null,null,"Finland",51,null,null,null,0,null,null,null,null,null,null,null,null,null,0]
[null,null,null,null,null,null,null,null,null,null,null,null,null,null,null,null,null,null,null,null,null,null,null,null,null,null,null,null,null,null,null,null,null,null,null,null,null,null,null,null,"France",52,null,null,null,0,null,null,null,null,null,null,null,null,null,0,null,null,"France",52,null,null,null,0,null,null,null,null,null,null,null,null,null,0]
[null,null,null,null,null,null,null,null,null,null,null,null,null,null,null,null,null,null,null,null,null,null,null,null,null,null,null,null,null,null,null,null,null,null,null,null,null,null,null,null,"Gabon",53,null,null,null,0,null,null,null,null,null,null,null,null,null,0,null,null,"Gabon",53,null,null,null,0,null,null,null,null,null,null,null,null,null,0]
[null,null,null,null,null,null,null,null,null,null,null,null,null,null,null,null,null,null,null,null,null,null,null,null,null,null,null,null,null,null,null,null,null,null,null,null,null,null,null,null,"Georgia",54,null,null,null,0,null,null,null,null,null,null,null,null,null,0,null,null,"Georgia",54,null,null,null,0,null,null,null,null,null,null,null,null,null,0]
[null,null,null,null,null,null,null,null,null,null,null,null,null,null,null,null,null,null,null,null,null,null,null,null,null,null,null,null,null,null,null,null,null,null,null,null,null,null,null,null,"Germany",55,null,null,null,0,null,null,null,null,null,null,null,null,null,0,null,null,"Germany",55,null,null,null,0,null,null,null,null,null,null,null,null,null,0]
[null,null,null,null,null,null,null,null,null,null,null,null,null,null,null,null,null,null,null,null,null,null,null,null,null,null,null,null,null,null,null,null,null,null,null,null,null,null,null,null,"Ghana",56,null,null,null,0,null,null,null,null,null,null,null,null,null,0,null,null,"Ghana",56,null,null,null,0,null,null,null,null,null,null,null,null,null,0]
[null,null,null,null,null,null,null,null,null,null,null,null,null,null,null,null,null,null,null,null,null,null,null,null,null,null,null,null,null,null,null,null,null,null,null,null,null,null,null,null,"Gibraltar",57,null,null,null,0,null,null,null,null,null,null,null,null,null,0,null,null,"Gibraltar",57,null,null,null,0,null,null,null,null,null,null,null,null,null,0]
[null,null,null,null,null,null,null,null,null,null,null,null,null,null,null,null,null,null,null,null,null,null,null,null,null,null,null,null,null,null,null,null,null,null,null,null,null,null,null,null,"Greece",58,null,null,null,0,null,null,null,null,null,null,null,null,null,0,null,null,"Greece",58,null,null,null,0,null,null,null,null,null,null,null,null,null,0]
[null,null,null,null,null,null,null,null,null,null,null,null,null,null,null,null,null,null,null,null,null,null,null,null,null,null,null,null,null,null,null,null,null,null,null,null,null,null,null,null,"Guatemala",59,null,null,null,0,null,null,null,null,null,null,null,null,null,0,null,null,"Guatemala",59,null,null,null,0,null,null,null,null,null,null,null,null,null,0]
[null,null,null,null,null,null,null,null,null,null,null,null,null,null,null,null,null,null,null,null,null,null,null,null,null,null,null,null,null,null,null,null,null,null,null,null,null,null,null,null,"Guinea-Bissau",60,null,null,null,0,null,null,null,null,null,null,null,null,null,0,null,null,"Guinea-Bissau",60,null,null,null,0,null,null,null,null,null,null,null,null,null,0]
[null,null,null,null,null,null,null,null,null,null,null,null,null,null,null,null,null,null,null,null,null,null,null,null,null,null,null,null,null,null,null,null,null,null,null,null,null,null,null,null,"Honduras",61,null,null,null,0,null,null,null,null,null,null,null,null,null,0,null,null,"Honduras",61,null,null,null,0,null,null,null,null,null,null,null,null,null,0]
[null,null,null,null,null,null,null,null,null,null,null,null,null,null,null,null,null,null,null,null,null,null,null,null,null,null,null,null,null,null,null,null,null,null,null,null,null,null,null,null,"Hong Kong, China",62,null,null,null,0,null,null,null,null,null,null,null,null,null,0,null,null,"Hong Kong, China",62,null,null,null,0,null,null,null,null,null,null,null,null,null,0]
[null,null,null,null,null,null,null,null,null,null,null,null,null,null,null,null,null,null,null,null,null,null,null,null,null,null,null,null,null,null,null,null,null,null,null,null,null,null,null,null,"Hungary",63,null,null,null,0,null,null,null,null,null,null,null,null,null,0,null,null,"Hungary",63,null,null,null,0,null,null,null,null,null,null,null,null,null,0]
[null,null,null,null,null,null,null,null,null,null,null,null,null,null,null,null,null,null,null,null,null,null,null,null,null,null,null,null,null,null,null,null,null,null,null,null,null,null,null,null,"Iceland",64,null,null,null,0,null,null,null,null,null,null,null,null,null,0,null,null,"Iceland",64,null,null,null,0,null,null,null,null,null,null,null,null,null,0]
[null,null,null,null,null,null,null,null,null,null,null,null,null,null,null,null,null,null,null,null,null,null,null,null,null,null,null,null,null,null,null,null,null,null,null,null,null,null,null,null,"India",65,null,null,null,0,null,null,null,null,null,null,null,null,null,0,null,null,"India",65,null,null,null,0,null,null,null,null,null,null,null,null,null,0]
[null,null,null,null,null,null,null,null,null,null,null,null,null,null,null,null,null,null,null,null,null,null,null,null,null,null,null,null,null,null,null,null,null,null,null,null,null,null,null,null,"Indonesia",66,null,null,null,{"$f":"SUM(AQ249:AS249)","v":0},null,null,null,null,null,null,null,null,null,{"$f":"SUM(AU249:BC249)-AY249-BA249","v":0},null,null,"Indonesia",66,null,null,null,{"$f":"SUM(BI249:BK249)","v":0},null,null,null,null,null,null,null,null,null,{"$f":"+BM249+BN249+BO249+BP249+BR249+BT249+BU249","v":0}]
[null,null,null,null,null,null,null,null,null,null,null,null,null,null,null,null,null,null,null,null,null,null,null,null,null,null,null,null,null,null,null,null,null,null,null,null,null,null,null,null,"Iran, Islamic Republic of",67,null,null,null,0,null,null,null,null,null,null,null,null,null,0,null,null,"Iran, Islamic Republic of",67,null,null,null,0,null,null,null,null,null,null,null,null,null,0]
[null,null,null,null,null,null,null,null,null,null,null,null,null,null,null,null,null,null,null,null,null,null,null,null,null,null,null,null,null,null,null,null,null,null,null,null,null,null,null,null,"Iraq",68,null,null,null,0,null,null,null,null,null,null,null,null,null,0,null,null,"Iraq",68,null,null,null,0,null,null,null,null,null,null,null,null,null,0]
[null,null,null,null,null,null,null,null,null,null,null,null,null,null,null,null,null,null,null,null,null,null,null,null,null,null,null,null,null,null,null,null,null,null,null,null,null,null,null,null,"Ireland",69,null,null,null,0,null,null,null,null,null,null,null,null,null,0,null,null,"Ireland",69,null,null,null,0,null,null,null,null,null,null,null,null,null,0]
[null,null,null,null,null,null,null,null,null,null,null,null,null,null,null,null,null,null,null,null,null,null,null,null,null,null,null,null,null,null,null,null,null,null,null,null,null,null,null,null,"Israel",70,null,null,null,0,null,null,null,null,null,null,null,null,null,0,null,null,"Israel",70,null,null,null,0,null,null,null,null,null,null,null,null,null,0]
[null,null,null,null,null,null,null,null,null,null,null,null,null,null,null,null,null,null,null,null,null,null,null,null,null,null,null,null,null,null,null,null,null,null,null,null,null,null,null,null,"Italy",71,null,null,null,0,null,null,null,null,null,null,null,null,null,0,null,null,"Italy",71,null,null,null,0,null,null,null,null,null,null,null,null,null,0]
[null,null,null,null,null,null,null,null,null,null,null,null,null,null,null,null,null,null,null,null,null,null,null,null,null,null,null,null,null,null,null,null,null,null,null,null,null,null,null,null,"Jamaica",72,null,null,null,0,null,null,null,null,null,null,null,null,null,0,null,null,"Jamaica",72,null,null,null,0,null,null,null,null,null,null,null,null,null,0]
[null,null,null,null,null,null,null,null,null,null,null,null,null,null,null,null,null,null,null,null,null,null,null,null,null,null,null,null,null,null,null,null,null,null,null,null,null,null,null,null,"Japan",73,null,null,null,0,null,null,null,null,null,null,null,null,null,0,null,null,"Japan",73,null,null,null,0,null,null,null,null,null,null,null,null,null,0]
[null,null,null,null,null,null,null,null,null,null,null,null,null,null,null,null,null,null,null,null,null,null,null,null,null,null,null,null,null,null,null,null,null,null,null,null,null,null,null,null,"Jordan",74,null,null,null,0,null,null,null,null,null,null,null,null,null,0,null,null,"Jordan",74,null,null,null,0,null,null,null,null,null,null,null,null,null,0]
[null,null,null,null,null,null,null,null,null,null,null,null,null,null,null,null,null,null,null,null,null,null,null,null,null,null,null,null,null,null,null,null,null,null,null,null,null,null,null,null,"Kazakhstan",75,null,null,null,0,null,null,null,null,null,null,null,null,null,0,null,null,"Kazakhstan",75,null,null,null,0,null,null,null,null,null,null,null,null,null,0]
[null,null,null,null,null,null,null,null,null,null,null,null,null,null,null,null,null,null,null,null,null,null,null,null,null,null,null,null,null,null,null,null,null,null,null,null,null,null,null,null,"Kenya",76,null,null,null,{"$f":"SUM(AQ259:AS259)","v":0},null,null,null,null,null,null,null,null,null,0,null,null,"Kenya",76,null,null,null,0,null,null,null,null,null,null,null,null,null,0]
[null,null,null,null,null,null,null,null,null,null,null,null,null,null,null,null,null,null,null,null,null,null,null,null,null,null,null,null,null,null,null,null,null,null,null,null,null,null,null,null,"Korea",77,null,null,null,{"$f":"SUM(AQ260:AS260)","v":0},null,null,null,null,null,null,null,null,null,0,null,null,"Korea",77,null,null,null,0,null,null,null,null,null,null,null,null,null,0]
[null,null,null,null,null,null,null,null,null,null,null,null,null,null,null,null,null,null,null,null,null,null,null,null,null,null,null,null,null,null,null,null,null,null,null,null,null,null,null,null,"Kosovo*",78,null,null,null,0,null,null,null,null,null,null,null,null,null,0,null,null,"Kosovo*",78,null,null,null,0,null,null,null,null,null,null,null,null,null,0]
[null,null,null,null,null,null,null,null,null,null,null,null,null,null,null,null,null,null,null,null,null,null,null,null,null,null,null,null,null,null,null,null,null,null,null,null,null,null,null,null,"Kuwait",79,null,null,null,0,null,null,null,null,null,null,null,null,null,0,null,null,"Kuwait",79,null,null,null,0,null,null,null,null,null,null,null,null,null,0]
[null,null,null,null,null,null,null,null,null,null,null,null,null,null,null,null,null,null,null,null,null,null,null,null,null,null,null,null,null,null,null,null,null,null,null,null,null,null,null,null,"Kyrgyzstan",80,null,null,null,0,null,null,null,null,null,null,null,null,null,0,null,null,"Kyrgyzstan",80,null,null,null,0,null,null,null,null,null,null,null,null,null,0]
[null,null,null,null,null,null,null,null,null,null,null,null,null,null,null,null,null,null,null,null,null,null,null,null,null,null,null,null,null,null,null,null,null,null,null,null,null,null,null,null,"Lao People's Democratic Republic",81,null,null,null,0,null,null,null,null,null,null,null,null,null,0,null,null,"Lao People's Democratic Republic",81,null,null,null,0,null,null,null,null,null,null,null,null,null,0]
[null,null,null,null,null,null,null,null,null,null,null,null,null,null,null,null,null,null,null,null,null,null,null,null,null,null,null,null,null,null,null,null,null,null,null,null,null,null,null,null,"Latvia",82,null,null,null,0,null,null,null,null,null,null,null,null,null,0,null,null,"Latvia",82,null,null,null,0,null,null,null,null,null,null,null,null,null,0]
[null,null,null,null,null,null,null,null,null,null,null,null,null,null,null,null,null,null,null,null,null,null,null,null,null,null,null,null,null,null,null,null,null,null,null,null,null,null,null,null,"Lebanon",83,null,null,null,0,null,null,null,null,null,null,null,null,null,0,null,null,"Lebanon",83,null,null,null,0,null,null,null,null,null,null,null,null,null,0]
[null,null,null,null,null,null,null,null,null,null,null,null,null,null,null,null,null,null,null,null,null,null,null,null,null,null,null,null,null,null,null,null,null,null,null,null,null,null,null,null,"Liberia",84,null,null,null,0,null,null,null,null,null,null,null,null,null,0,null,null,"Liberia",84,null,null,null,0,null,null,null,null,null,null,null,null,null,0]
[null,null,null,null,null,null,null,null,null,null,null,null,null,null,null,null,null,null,null,null,null,null,null,null,null,null,null,null,null,null,null,null,null,null,null,null,null,null,null,null,"Libya",85,null,null,null,0,null,null,null,null,null,null,null,null,null,0,null,null,"Libya",85,null,null,null,0,null,null,null,null,null,null,null,null,null,0]
[null,null,null,null,null,null,null,null,null,null,null,null,null,null,null,null,null,null,null,null,null,null,null,null,null,null,null,null,null,null,null,null,null,null,null,null,null,null,null,null,"Liechtenstein",86,null,null,null,0,null,null,null,null,null,null,null,null,null,0,null,null,"Liechtenstein",86,null,null,null,0,null,null,null,null,null,null,null,null,null,0]
[null,null,null,null,null,null,null,null,null,null,null,null,null,null,null,null,null,null,null,null,null,null,null,null,null,null,null,null,null,null,null,null,null,null,null,null,null,null,null,null,"Lithuania",87,null,null,null,0,null,null,null,null,null,null,null,null,null,0,null,null,"Lithuania",87,null,null,null,0,null,null,null,null,null,null,null,null,null,0]
[null,null,null,null,null,null,null,null,null,null,null,null,null,null,null,null,null,null,null,null,null,null,null,null,null,null,null,null,null,null,null,null,null,null,null,null,null,null,null,null,"Luxembourg",88,null,null,null,0,null,null,null,null,null,null,null,null,null,0,null,null,"Luxembourg",88,null,null,null,0,null,null,null,null,null,null,null,null,null,0]
[null,null,null,null,null,null,null,null,null,null,null,null,null,null,null,null,null,null,null,null,null,null,null,null,null,null,null,null,null,null,null,null,null,null,null,null,null,null,null,null,"Madagascar",89,null,null,null,0,null,null,null,null,null,null,null,null,null,0,null,null,"Madagascar",89,null,null,null,0,null,null,null,null,null,null,null,null,null,0]
[null,null,null,null,null,null,null,null,null,null,null,null,null,null,null,null,null,null,null,null,null,null,null,null,null,null,null,null,null,null,null,null,null,null,null,null,null,null,null,null,"Malaysia",90,null,null,null,0,null,null,null,null,null,null,null,null,null,0,null,null,"Malaysia",90,null,null,null,0,null,null,null,null,null,null,null,null,null,0]
[null,null,null,null,null,null,null,null,null,null,null,null,null,null,null,null,null,null,null,null,null,null,null,null,null,null,null,null,null,null,null,null,null,null,null,null,null,null,null,null,"Malta",91,null,null,null,0,null,null,null,null,null,null,null,null,null,0,null,null,"Malta",91,null,null,null,0,null,null,null,null,null,null,null,null,null,0]
[null,null,null,null,null,null,null,null,null,null,null,null,null,null,null,null,null,null,null,null,null,null,null,null,null,null,null,null,null,null,null,null,null,null,null,null,null,null,null,null,"Marshall Islands",92,null,null,null,0,null,null,null,null,null,null,null,null,null,0,null,null,"Marshall Islands",92,null,null,null,0,null,null,null,null,null,null,null,null,null,0]
[null,null,null,null,null,null,null,null,null,null,null,null,null,null,null,null,null,null,null,null,null,null,null,null,null,null,null,null,null,null,null,null,null,null,null,null,null,null,null,null,"Mauritania",93,null,null,null,0,null,null,null,null,null,null,null,null,null,0,null,null,"Mauritania",93,null,null,null,0,null,null,null,null,null,null,null,null,null,0]
[null,null,null,null,null,null,null,null,null,null,null,null,null,null,null,null,null,null,null,null,null,null,null,null,null,null,null,null,null,null,null,null,null,null,null,null,null,null,null,null,"Mauritius",94,null,null,null,0,null,null,null,null,null,null,null,null,null,0,null,null,"Mauritius",94,null,null,null,0,null,null,null,null,null,null,null,null,null,0]
[null,null,null,null,null,null,null,null,null,null,null,null,null,null,null,null,null,null,null,null,null,null,null,null,null,null,null,null,null,null,null,null,null,null,null,null,null,null,null,null,"Mexico",95,null,null,null,0,null,null,null,null,null,null,null,null,null,0,null,null,"Mexico",95,null,null,null,0,null,null,null,null,null,null,null,null,null,0]
[null,null,null,null,null,null,null,null,null,null,null,null,null,null,null,null,null,null,null,null,null,null,null,null,null,null,null,null,null,null,null,null,null,null,null,null,null,null,null,null,"Moldova, Republic of",96,null,null,null,0,null,null,null,null,null,null,null,null,null,0,null,null,"Moldova, Republic of",96,null,null,null,0,null,null,null,null,null,null,null,null,null,0]
[null,null,null,null,null,null,null,null,null,null,null,null,null,null,null,null,null,null,null,null,null,null,null,null,null,null,null,null,null,null,null,null,null,null,null,null,null,null,null,null,"Mongolia",97,null,null,null,0,null,null,null,null,null,null,null,null,null,0,null,null,"Mongolia",97,null,null,null,0,null,null,null,null,null,null,null,null,null,0]
[null,null,null,null,null,null,null,null,null,null,null,null,null,null,null,null,null,null,null,null,null,null,null,null,null,null,null,null,null,null,null,null,null,null,null,null,null,null,null,null,"Montenegro",98,null,null,null,0,null,null,null,null,null,null,null,null,null,0,null,null,"Montenegro",98,null,null,null,0,null,null,null,null,null,null,null,null,null,0]
[null,null,null,null,null,null,null,null,null,null,null,null,null,null,null,null,null,null,null,null,null,null,null,null,null,null,null,null,null,null,null,null,null,null,null,null,null,null,null,null,"Morocco",99,null,null,null,0,null,null,null,null,null,null,null,null,null,0,null,null,"Morocco",99,null,null,null,0,null,null,null,null,null,null,null,null,null,0]
[null,null,null,null,null,null,null,null,null,null,null,null,null,null,null,null,null,null,null,null,null,null,null,null,null,null,null,null,null,null,null,null,null,null,null,null,null,null,null,null,"Mozambique",100,null,null,null,0,null,null,null,null,null,null,null,null,null,0,null,null,"Mozambique",100,null,null,null,0,null,null,null,null,null,null,null,null,null,0]
[null,null,null,null,null,null,null,null,null,null,null,null,null,null,null,null,null,null,null,null,null,null,null,null,null,null,null,null,null,null,null,null,null,null,null,null,null,null,null,null,"Myanmar",101,null,null,null,0,null,null,null,null,null,null,null,null,null,0,null,null,"Myanmar",101,null,null,null,0,null,null,null,null,null,null,null,null,null,0]
[null,null,null,null,null,null,null,null,null,null,null,null,null,null,null,null,null,null,null,null,null,null,null,null,null,null,null,null,null,null,null,null,null,null,null,null,null,null,null,null,"Namibia",102,null,null,null,0,null,null,null,null,null,null,null,null,null,0,null,null,"Namibia",102,null,null,null,0,null,null,null,null,null,null,null,null,null,0]
[null,null,null,null,null,null,null,null,null,null,null,null,null,null,null,null,null,null,null,null,null,null,null,null,null,null,null,null,null,null,null,null,null,null,null,null,null,null,null,null,"Nepal",103,null,null,null,0,null,null,null,null,null,null,null,null,null,0,null,null,"Nepal",103,null,null,null,0,null,null,null,null,null,null,null,null,null,0]
[null,null,null,null,null,null,null,null,null,null,null,null,null,null,null,null,null,null,null,null,null,null,null,null,null,null,null,null,null,null,null,null,null,null,null,null,null,null,null,null,"Netherlands",104,null,null,null,0,null,null,null,null,null,null,null,null,null,0,null,null,"Netherlands",104,null,null,null,0,null,null,null,null,null,null,null,null,null,0]
[null,null,null,null,null,null,null,null,null,null,null,null,null,null,null,null,null,null,null,null,null,null,null,null,null,null,null,null,null,null,null,null,null,null,null,null,null,null,null,null,"New Caledonia",105,null,null,null,0,null,null,null,null,null,null,null,null,null,0,null,null,"New Caledonia",105,null,null,null,0,null,null,null,null,null,null,null,null,null,0]
[null,null,null,null,null,null,null,null,null,null,null,null,null,null,null,null,null,null,null,null,null,null,null,null,null,null,null,null,null,null,null,null,null,null,null,null,null,null,null,null,"New Zealand",106,null,null,null,0,null,null,null,null,null,null,null,null,null,0,null,null,"New Zealand",106,null,null,null,0,null,null,null,null,null,null,null,null,null,0]
[null,null,null,null,null,null,null,null,null,null,null,null,null,null,null,null,null,null,null,null,null,null,null,null,null,null,null,null,null,null,null,null,null,null,null,null,null,null,null,null,"Niger",107,null,null,null,0,null,null,null,null,null,null,null,null,null,0,null,null,"Niger",107,null,null,null,0,null,null,null,null,null,null,null,null,null,0]
[null,null,null,null,null,null,null,null,null,null,null,null,null,null,null,null,null,null,null,null,null,null,null,null,null,null,null,null,null,null,null,null,null,null,null,null,null,null,null,null,"Nigeria",108,null,null,null,0,null,null,null,null,null,null,null,null,null,0,null,null,"Nigeria",108,null,null,null,0,null,null,null,null,null,null,null,null,null,0]
[null,null,null,null,null,null,null,null,null,null,null,null,null,null,null,null,null,null,null,null,null,null,null,null,null,null,null,null,null,null,null,null,null,null,null,null,null,null,null,null,"North Macedonia",109,null,null,null,0,null,null,null,null,null,null,null,null,null,0,null,null,"North Macedonia",109,null,null,null,0,null,null,null,null,null,null,null,null,null,0]
[null,null,null,null,null,null,null,null,null,null,null,null,null,null,null,null,null,null,null,null,null,null,null,null,null,null,null,null,null,null,null,null,null,null,null,null,null,null,null,null,"Norway",110,null,null,null,0,null,null,null,null,null,null,null,null,null,0,null,null,"Norway",110,null,null,null,0,null,null,null,null,null,null,null,null,null,0]
[null,null,null,null,null,null,null,null,null,null,null,null,null,null,null,null,null,null,null,null,null,null,null,null,null,null,null,null,null,null,null,null,null,null,null,null,null,null,null,null,"Oman",111,null,null,null,0,null,null,null,null,null,null,null,null,null,0,null,null,"Oman",111,null,null,null,0,null,null,null,null,null,null,null,null,null,0]
[null,null,null,null,null,null,null,null,null,null,null,null,null,null,null,null,null,null,null,null,null,null,null,null,null,null,null,null,null,null,null,null,null,null,null,null,null,null,null,null,"Other Africa",112,null,null,null,0,null,null,null,null,null,null,null,null,null,0,null,null,"Other Africa",112,null,null,null,0,null,null,null,null,null,null,null,null,null,0]
[null,null,null,null,null,null,null,null,null,null,null,null,null,null,null,null,null,null,null,null,null,null,null,null,null,null,null,null,null,null,null,null,null,null,null,null,null,null,null,null,"Other Asia Oceania",113,null,null,null,0,null,null,null,null,null,null,null,null,null,0,null,null,"Other Asia Oceania",113,null,null,null,0,null,null,null,null,null,null,null,null,null,0]
[null,null,null,null,null,null,null,null,null,null,null,null,null,null,null,null,null,null,null,null,null,null,null,null,null,null,null,null,null,null,null,null,null,null,null,null,null,null,null,null,"Other Europe",114,null,null,null,0,null,null,null,null,null,null,null,null,null,0,null,null,"Other Europe",114,null,null,null,0,null,null,null,null,null,null,null,null,null,0]
[null,null,null,null,null,null,null,null,null,null,null,null,null,null,null,null,null,null,null,null,null,null,null,null,null,null,null,null,null,null,null,null,null,null,null,null,null,null,null,null,"Other Former Soviet Union",115,null,null,null,0,null,null,null,null,null,null,null,null,null,0,null,null,"Other Former Soviet Union",115,null,null,null,0,null,null,null,null,null,null,null,null,null,0]
[null,null,null,null,null,null,null,null,null,null,null,null,null,null,null,null,null,null,null,null,null,null,null,null,null,null,null,null,null,null,null,null,null,null,null,null,null,null,null,null,"Other Near and Middle East",116,null,null,null,0,null,null,null,null,null,null,null,null,null,0,null,null,"Other Near and Middle East",116,null,null,null,0,null,null,null,null,null,null,null,null,null,0]
[null,null,null,null,null,null,null,null,null,null,null,null,null,null,null,null,null,null,null,null,null,null,null,null,null,null,null,null,null,null,null,null,null,null,null,null,null,null,null,null,"Other Non-OECD Americas",117,null,null,null,0,null,null,null,null,null,null,null,null,null,0,null,null,"Other Non-OECD Americas",117,null,null,null,0,null,null,null,null,null,null,null,null,null,0]
[null,null,null,null,null,null,null,null,null,null,null,null,null,null,null,null,null,null,null,null,null,null,null,null,null,null,null,null,null,null,null,null,null,null,null,null,null,null,null,null,"Pakistan",118,null,null,null,0,null,null,null,null,null,null,null,null,null,0,null,null,"Pakistan",118,null,null,null,0,null,null,null,null,null,null,null,null,null,0]
[null,null,null,null,null,null,null,null,null,null,null,null,null,null,null,null,null,null,null,null,null,null,null,null,null,null,null,null,null,null,null,null,null,null,null,null,null,null,null,null,"Panama",119,null,null,null,0,null,null,null,null,null,null,null,null,null,0,null,null,"Panama",119,null,null,null,0,null,null,null,null,null,null,null,null,null,0]
[null,null,null,null,null,null,null,null,null,null,null,null,null,null,null,null,null,null,null,null,null,null,null,null,null,null,null,null,null,null,null,null,null,null,null,null,null,null,null,null,"Papua New Guinea",120,null,null,null,0,null,null,null,null,null,null,null,null,null,0,null,null,"Papua New Guinea",120,null,null,null,0,null,null,null,null,null,null,null,null,null,0]
[null,null,null,null,null,null,null,null,null,null,null,null,null,null,null,null,null,null,null,null,null,null,null,null,null,null,null,null,null,null,null,null,null,null,null,null,null,null,null,null,"Peru",121,null,null,null,0,null,null,null,null,null,null,null,null,null,0,null,null,"Peru",121,null,null,null,0,null,null,null,null,null,null,null,null,null,0]
[null,null,null,null,null,null,null,null,null,null,null,null,null,null,null,null,null,null,null,null,null,null,null,null,null,null,null,null,null,null,null,null,null,null,null,null,null,null,null,null,"Philippines",122,null,null,null,0,null,null,null,null,null,null,null,null,null,0,null,null,"Philippines",122,null,null,null,0,null,null,null,null,null,null,null,null,null,0]
[null,null,null,null,null,null,null,null,null,null,null,null,null,null,null,null,null,null,null,null,null,null,null,null,null,null,null,null,null,null,null,null,null,null,null,null,null,null,null,null,"Poland",123,null,null,null,0,null,null,null,null,null,null,null,null,null,0,null,null,"Poland",123,null,null,null,0,null,null,null,null,null,null,null,null,null,0]
[null,null,null,null,null,null,null,null,null,null,null,null,null,null,null,null,null,null,null,null,null,null,null,null,null,null,null,null,null,null,null,null,null,null,null,null,null,null,null,null,"Portugal",124,null,null,null,0,null,null,null,null,null,null,null,null,null,0,null,null,"Portugal",124,null,null,null,0,null,null,null,null,null,null,null,null,null,0]
[null,null,null,null,null,null,null,null,null,null,null,null,null,null,null,null,null,null,null,null,null,null,null,null,null,null,null,null,null,null,null,null,null,null,null,null,null,null,null,null,"Qatar",125,null,null,null,0,null,null,null,null,null,null,null,null,null,0,null,null,"Qatar",125,null,null,null,0,null,null,null,null,null,null,null,null,null,0]
[null,null,null,null,null,null,null,null,null,null,null,null,null,null,null,null,null,null,null,null,null,null,null,null,null,null,null,null,null,null,null,null,null,null,null,null,null,null,null,null,"Romania",126,null,null,null,0,null,null,null,null,null,null,null,null,null,0,null,null,"Romania",126,null,null,null,0,null,null,null,null,null,null,null,null,null,0]
[null,null,null,null,null,null,null,null,null,null,null,null,null,null,null,null,null,null,null,null,null,null,null,null,null,null,null,null,null,null,null,null,null,null,null,null,null,null,null,null,"Russian Federation",127,null,null,null,0,null,null,null,null,null,null,null,null,null,0,null,null,"Russian Federation",127,null,null,null,0,null,null,null,null,null,null,null,null,null,0]
[null,null,null,null,null,null,null,null,null,null,null,null,null,null,null,null,null,null,null,null,null,null,null,null,null,null,null,null,null,null,null,null,null,null,null,null,null,null,null,null,"Sao Tome and Principe",128,null,null,null,0,null,null,null,null,null,null,null,null,null,0,null,null,"Sao Tome and Principe",128,null,null,null,0,null,null,null,null,null,null,null,null,null,0]
[null,null,null,null,null,null,null,null,null,null,null,null,null,null,null,null,null,null,null,null,null,null,null,null,null,null,null,null,null,null,null,null,null,null,null,null,null,null,null,null,"Saudi Arabia",129,null,null,null,0,null,null,null,null,null,null,null,null,null,0,null,null,"Saudi Arabia",129,null,null,null,0,null,null,null,null,null,null,null,null,null,0]
[null,null,null,null,null,null,null,null,null,null,null,null,null,null,null,null,null,null,null,null,null,null,null,null,null,null,null,null,null,null,null,null,null,null,null,null,null,null,null,null,"Senegal",130,null,null,null,0,null,null,null,null,null,null,null,null,null,0,null,null,"Senegal",130,null,null,null,0,null,null,null,null,null,null,null,null,null,0]
[null,null,null,null,null,null,null,null,null,null,null,null,null,null,null,null,null,null,null,null,null,null,null,null,null,null,null,null,null,null,null,null,null,null,null,null,null,null,null,null,"Serbia",131,null,null,null,0,null,null,null,null,null,null,null,null,null,0,null,null,"Serbia",131,null,null,null,0,null,null,null,null,null,null,null,null,null,0]
[null,null,null,null,null,null,null,null,null,null,null,null,null,null,null,null,null,null,null,null,null,null,null,null,null,null,null,null,null,null,null,null,null,null,null,null,null,null,null,null,"Sierra Leone",132,null,null,null,0,null,null,null,null,null,null,null,null,null,0,null,null,"Sierra Leone",132,null,null,null,0,null,null,null,null,null,null,null,null,null,0]
[null,null,null,null,null,null,null,null,null,null,null,null,null,null,null,null,null,null,null,null,null,null,null,null,null,null,null,null,null,null,null,null,null,null,null,null,null,null,null,null,"Singapore",133,null,null,null,0,null,null,null,null,null,null,null,null,null,0,null,null,"Singapore",133,null,null,null,0,null,null,null,null,null,null,null,null,null,0]
[null,null,null,null,null,null,null,null,null,null,null,null,null,null,null,null,null,null,null,null,null,null,null,null,null,null,null,null,null,null,null,null,null,null,null,null,null,null,null,null,"Slovak Republic",134,null,null,null,0,null,null,null,null,null,null,null,null,null,0,null,null,"Slovak Republic",134,null,null,null,0,null,null,null,null,null,null,null,null,null,0]
[null,null,null,null,null,null,null,null,null,null,null,null,null,null,null,null,null,null,null,null,null,null,null,null,null,null,null,null,null,null,null,null,null,null,null,null,null,null,null,null,"Slovenia",135,null,null,null,0,null,null,null,null,null,null,null,null,null,0,null,null,"Slovenia",135,null,null,null,0,null,null,null,null,null,null,null,null,null,0]
[null,null,null,null,null,null,null,null,null,null,null,null,null,null,null,null,null,null,null,null,null,null,null,null,null,null,null,null,null,null,null,null,null,null,null,null,null,null,null,null,"South Africa",136,null,null,null,0,null,null,null,null,null,null,null,null,null,0,null,null,"South Africa",136,null,null,null,0,null,null,null,null,null,null,null,null,null,0]
[null,null,null,null,null,null,null,null,null,null,null,null,null,null,null,null,null,null,null,null,null,null,null,null,null,null,null,null,null,null,null,null,null,null,null,null,null,null,null,null,"South Sudan",137,null,null,null,0,null,null,null,null,null,null,null,null,null,0,null,null,"South Sudan",137,null,null,null,0,null,null,null,null,null,null,null,null,null,0]
[null,null,null,null,null,null,null,null,null,null,null,null,null,null,null,null,null,null,null,null,null,null,null,null,null,null,null,null,null,null,null,null,null,null,null,null,null,null,null,null,"Spain",138,null,null,null,0,null,null,null,null,null,null,null,null,null,0,null,null,"Spain",138,null,null,null,0,null,null,null,null,null,null,null,null,null,0]
[null,null,null,null,null,null,null,null,null,null,null,null,null,null,null,null,null,null,null,null,null,null,null,null,null,null,null,null,null,null,null,null,null,null,null,null,null,null,null,null,"Sri Lanka",139,null,null,null,0,null,null,null,null,null,null,null,null,null,0,null,null,"Sri Lanka",139,null,null,null,0,null,null,null,null,null,null,null,null,null,0]
[null,null,null,null,null,null,null,null,null,null,null,null,null,null,null,null,null,null,null,null,null,null,null,null,null,null,null,null,null,null,null,null,null,null,null,null,null,null,null,null,"Sudan",140,null,null,null,0,null,null,null,null,null,null,null,null,null,0,null,null,"Sudan",140,null,null,null,0,null,null,null,null,null,null,null,null,null,0]
[null,null,null,null,null,null,null,null,null,null,null,null,null,null,null,null,null,null,null,null,null,null,null,null,null,null,null,null,null,null,null,null,null,null,null,null,null,null,null,null,"Sweden",141,null,null,null,{"$f":"SUM(AQ324:AS324)","v":0},null,null,null,null,null,null,null,null,null,0,null,null,"Sweden",141,null,null,null,0,null,null,null,null,null,null,null,null,null,0]
[null,null,null,null,null,null,null,null,null,null,null,null,null,null,null,null,null,null,null,null,null,null,null,null,null,null,null,null,null,null,null,null,null,null,null,null,null,null,null,null,"Switzerland",142,null,null,null,0,null,null,null,null,null,null,null,null,null,0,null,null,"Switzerland",142,null,null,null,0,null,null,null,null,null,null,null,null,null,0]
[null,null,null,null,null,null,null,null,null,null,null,null,null,null,null,null,null,null,null,null,null,null,null,null,null,null,null,null,null,null,null,null,null,null,null,null,null,null,null,null,"Syrian Arab Republic",143,null,null,null,0,null,null,null,null,null,null,null,null,null,0,null,null,"Syrian Arab Republic",143,null,null,null,0,null,null,null,null,null,null,null,null,null,0]
[null,null,null,null,null,null,null,null,null,null,null,null,null,null,null,null,null,null,null,null,null,null,null,null,null,null,null,null,null,null,null,null,null,null,null,null,null,null,null,null,"Taiwan / Chinese Taipei",144,null,null,null,0,null,null,null,null,null,null,null,null,null,0,null,null,"Taiwan / Chinese Taipei",144,null,null,null,0,null,null,null,null,null,null,null,null,null,0]
[null,null,null,null,null,null,null,null,null,null,null,null,null,null,null,null,null,null,null,null,null,null,null,null,null,null,null,null,null,null,null,null,null,null,null,null,null,null,null,null,"Tajikistan",145,null,null,null,0,null,null,null,null,null,null,null,null,null,0,null,null,"Tajikistan",145,null,null,null,0,null,null,null,null,null,null,null,null,null,0]
[null,null,null,null,null,null,null,null,null,null,null,null,null,null,null,null,null,null,null,null,null,null,null,null,null,null,null,null,null,null,null,null,null,null,null,null,null,null,null,null,"Tanzania, United Republic of",146,null,null,null,0,null,null,null,null,null,null,null,null,null,0,null,null,"Tanzania, United Republic of",146,null,null,null,0,null,null,null,null,null,null,null,null,null,0]
[null,null,null,null,null,null,null,null,null,null,null,null,null,null,null,null,null,null,null,null,null,null,null,null,null,null,null,null,null,null,null,null,null,null,null,null,null,null,null,null,"Thailand",147,null,null,null,0,null,null,null,null,null,null,null,null,null,0,null,null,"Thailand",147,null,null,null,0,null,null,null,null,null,null,null,null,null,0]
[null,null,null,null,null,null,null,null,null,null,null,null,null,null,null,null,null,null,null,null,null,null,null,null,null,null,null,null,null,null,null,null,null,null,null,null,null,null,null,null,"Timor-Leste",148,null,null,null,0,null,null,null,null,null,null,null,null,null,0,null,null,"Timor-Leste",148,null,null,null,0,null,null,null,null,null,null,null,null,null,0]
[null,null,null,null,null,null,null,null,null,null,null,null,null,null,null,null,null,null,null,null,null,null,null,null,null,null,null,null,null,null,null,null,null,null,null,null,null,null,null,null,"Togo",149,null,null,null,0,null,null,null,null,null,null,null,null,null,0,null,null,"Togo",149,null,null,null,0,null,null,null,null,null,null,null,null,null,0]
[null,null,null,null,null,null,null,null,null,null,null,null,null,null,null,null,null,null,null,null,null,null,null,null,null,null,null,null,null,null,null,null,null,null,null,null,null,null,null,null,"Trinidad and Tobago",150,null,null,null,0,null,null,null,null,null,null,null,null,null,0,null,null,"Trinidad and Tobago",150,null,null,null,0,null,null,null,null,null,null,null,null,null,0]
[null,null,null,null,null,null,null,null,null,null,null,null,null,null,null,null,null,null,null,null,null,null,null,null,null,null,null,null,null,null,null,null,null,null,null,null,null,null,null,null,"Tunisia",151,null,null,null,0,null,null,null,null,null,null,null,null,null,0,null,null,"Tunisia",151,null,null,null,0,null,null,null,null,null,null,null,null,null,0]
[null,null,null,null,null,null,null,null,null,null,null,null,null,null,null,null,null,null,null,null,null,null,null,null,null,null,null,null,null,null,null,null,null,null,null,null,null,null,null,null,"Turkey",152,null,null,null,0,null,null,null,null,null,null,null,null,null,0,null,null,"Turkey",152,null,null,null,0,null,null,null,null,null,null,null,null,null,0]
[null,null,null,null,null,null,null,null,null,null,null,null,null,null,null,null,null,null,null,null,null,null,null,null,null,null,null,null,null,null,null,null,null,null,null,null,null,null,null,null,"Turkmenistan",153,null,null,null,0,null,null,null,null,null,null,null,null,null,0,null,null,"Turkmenistan",153,null,null,null,0,null,null,null,null,null,null,null,null,null,0]
[null,null,null,null,null,null,null,null,null,null,null,null,null,null,null,null,null,null,null,null,null,null,null,null,null,null,null,null,null,null,null,null,null,null,null,null,null,null,null,null,"Uganda",154,null,null,null,0,null,null,null,null,null,null,null,null,null,0,null,null,"Uganda",154,null,null,null,0,null,null,null,null,null,null,null,null,null,0]
[null,null,null,null,null,null,null,null,null,null,null,null,null,null,null,null,null,null,null,null,null,null,null,null,null,null,null,null,null,null,null,null,null,null,null,null,null,null,null,null,"Ukraine",155,null,null,null,0,null,null,null,null,null,null,null,null,null,0,null,null,"Ukraine",155,null,null,null,0,null,null,null,null,null,null,null,null,null,0]
[null,null,null,null,null,null,null,null,null,null,null,null,null,null,null,null,null,null,null,null,null,null,null,null,null,null,null,null,null,null,null,null,null,null,null,null,null,null,null,null,"United Arab Emirates",156,null,null,null,0,null,null,null,null,null,null,null,null,null,0,null,null,"United Arab Emirates",156,null,null,null,0,null,null,null,null,null,null,null,null,null,0]
[null,null,null,null,null,null,null,null,null,null,null,null,null,null,null,null,null,null,null,null,null,null,null,null,null,null,null,null,null,null,null,null,null,null,null,null,null,null,null,null,"United Kingdom",157,null,null,null,0,null,null,null,null,null,null,null,null,null,0,null,null,"United Kingdom",157,null,null,null,0,null,null,null,null,null,null,null,null,null,0]
[null,null,null,null,null,null,null,null,null,null,null,null,null,null,null,null,null,null,null,null,null,null,null,null,null,null,null,null,null,null,null,null,null,null,null,null,null,null,null,null,"United States",158,null,null,null,0,null,null,null,null,null,null,null,null,null,0,null,null,"United States",158,null,null,null,0,null,null,null,null,null,null,null,null,null,0]
[null,null,null,null,null,null,null,null,null,null,null,null,null,null,null,null,null,null,null,null,null,null,null,null,null,null,null,null,null,null,null,null,null,null,null,null,null,null,null,null,"Uruguay",159,null,null,null,0,null,null,null,null,null,null,null,null,null,0,null,null,"Uruguay",159,null,null,null,0,null,null,null,null,null,null,null,null,null,0]
[null,null,null,null,null,null,null,null,null,null,null,null,null,null,null,null,null,null,null,null,null,null,null,null,null,null,null,null,null,null,null,null,null,null,null,null,null,null,null,null,"Uzbekistan",160,null,null,null,0,null,null,null,null,null,null,null,null,null,0,null,null,"Uzbekistan",160,null,null,null,0,null,null,null,null,null,null,null,null,null,0]
[null,null,null,null,null,null,null,null,null,null,null,null,null,null,null,null,null,null,null,null,null,null,null,null,null,null,null,null,null,null,null,null,null,null,null,null,null,null,null,null,"Venezuela, Bolivarian Republic",161,null,null,null,0,null,null,null,null,null,null,null,null,null,0,null,null,"Venezuela, Bolivarian Republic",161,null,null,null,0,null,null,null,null,null,null,null,null,null,0]
[null,null,null,null,null,null,null,null,null,null,null,null,null,null,null,null,null,null,null,null,null,null,null,null,null,null,null,null,null,null,null,null,null,null,null,null,null,null,null,null,"Viet Nam",162,null,null,null,0,null,null,null,null,null,null,null,null,null,{"$f":"SUM(AU345:BC345)-AY345-BA345","v":0},null,null,"Viet Nam",162,null,null,null,{"$f":"SUM(BI345:BK345)","v":0},null,null,null,null,null,null,null,null,null,{"$f":"+BM345+BN345+BO345+BP345+BR345+BT345+BU345","v":0}]
[null,null,null,null,null,null,null,null,null,null,null,null,null,null,null,null,null,null,null,null,null,null,null,null,null,null,null,null,null,null,null,null,null,null,null,null,null,null,null,null,"Yemen",163,null,null,null,0,null,null,null,null,null,null,null,null,null,0,null,null,"Yemen",163,null,null,null,0,null,null,null,null,null,null,null,null,null,0]
[null,null,null,null,null,null,null,null,null,null,null,null,null,null,null,null,null,null,null,null,null,null,null,null,null,null,null,null,null,null,null,null,null,null,null,null,null,null,null,null,"Not elsewhere specified",164,null,null,null,0,null,null,null,null,null,null,null,null,null,0,null,null,"Not elsewhere specified",164,null,null,null,0,null,null,null,null,null,null,null,null,null,0]
[null,null,null,null,null,null,null,null,null,null,null,null,null,null,null,null,null,null,null,null,null,null,null,null,null,null,null,null,null,null,null,null,null,null,null,null,null,null,null,null,"Total Imports",165,{"$f":"SUM(AQ184:AQ347)","v":0},{"$f":"SUM(AR184:AR347)","v":0},{"$f":"SUM(AS184:AS347)","v":0},{"$f":"SUM(AQ348:AS348)","v":0},{"$f":"SUM(AU184:AU347)","v":0},0,0,0,0,0,0,0,0,{"$f":"SUM(AU348:BC348)-AY348-BA348","v":0},null,null,"Total Exports",165,{"$f":"SUM(BI184:BI347)","v":0},{"$f":"SUM(BJ184:BJ347)","v":0},{"$f":"SUM(BK184:BK347)","v":0},{"$f":"SUM(BI348:BK348)","v":0},{"$f":"SUM(BM184:BM347)","v":0},0,0,0,0,0,0,0,0,{"$f":"+BM348+BN348+BO348+BP348+BR348+BT348+BU348","v":0}]