{"text_format":"1","workbook":"xlsx","n_sheets":31,"sheets":["Historical_ISO","Historical_ISO_Period","Historical_SDMX","Historical_SDMX_Period","Historical","Input_ISO","Input_ISO_Period","Input_SDMX","Input_SDMX_Period","Entries","Output_ISO_csv","Output_SDMX_csv","Output_SDMX_long_complete","Mapping_Products_Flows","Parameters","Parameter_mapping","Logs","Mapping_countries","Param_Menu","Param_Questionnaire","Param_Multilanguage","Menu","Instructions","TemplateTS1to2","TemplateRemarks","CheckReport","TemplateGraphs","Param_Sheets","Param_Sheets_Templates","Param_Tables","Param_Tables_Templates"],"not_rendered":{"charts":1,"images":0,"macros":1,"external_links":0,"defined_names":47,"comments":0,"pivot_tables":1},"unopened":[],"bounds":{"document_bytes":16777216,"sheet_cells":100000,"rows_first":2000,"rows_last":500,"rows_between":2000,"halvings":0,"cell_chars":16384,"cell_head_chars":4096},"cells_cut":0,"cells_raw":0,"read":"whole","date_system":"1900"}

{"sheet":"Historical_ISO","index":0,"n_rows":1,"n_cols":11,"rows_kept":1,"cut":false,"hidden":true,"merged":[]}
["COUNTRY","QUEST","PRODUCT","DATATYPE","ITEM1","ITEM2","TIME","VALUE","OBSERVATION","CONFIDENTIALITY","Record"]

{"sheet":"Historical_ISO_Period","index":1,"n_rows":1,"n_cols":1,"rows_kept":1,"cut":false,"hidden":true,"merged":[]}
["TIME"]

{"sheet":"Historical_SDMX","index":2,"n_rows":1,"n_cols":11,"rows_kept":1,"cut":false,"hidden":true,"merged":[]}
["REF_AREA","DATAFLOW","PRODUCT","DATATYPE","ITEM1","ITEM2","TIME","VALUE","OBSERVATION","CONFIDENTIALITY","Record"]

{"sheet":"Historical_SDMX_Period","index":3,"n_rows":1,"n_cols":1,"rows_kept":1,"cut":false,"hidden":true,"merged":[]}
["TIME"]

{"sheet":"Historical","index":4,"n_rows":1,"n_cols":11,"rows_kept":1,"cut":false,"hidden":true,"merged":[]}
["COUNTRY","QUEST","PRODUCT","DATATYPE","ITEM1","ITEM2","TIME","VALUE","OBSERVATION","CONFIDENTIALITY","KEYREC"]

{"sheet":"Input_ISO","index":5,"n_rows":1,"n_cols":11,"rows_kept":1,"cut":false,"hidden":true,"merged":[]}
["COUNTRY","QUEST","PRODUCT","DATATYPE","ITEM1","ITEM2","TIME","VALUE","OBSERVATION","CONFIDENTIALITY","Record"]

{"sheet":"Input_ISO_Period","index":6,"n_rows":1,"n_cols":1,"rows_kept":1,"cut":false,"hidden":true,"merged":[]}
["TIME"]

{"sheet":"Input_SDMX","index":7,"n_rows":1,"n_cols":11,"rows_kept":1,"cut":false,"hidden":true,"merged":[]}
["REF_AREA","DATAFLOW","PRODUCT","DATATYPE","ITEM1","ITEM2","TIME","VALUE","OBSERVATION","CONFIDENTIALITY","Record"]

{"sheet":"Input_SDMX_Period","index":8,"n_rows":1,"n_cols":1,"rows_kept":1,"cut":false,"hidden":true,"merged":[]}
["TIME"]

{"sheet":"Entries","index":9,"n_rows":1,"n_cols":11,"rows_kept":1,"cut":false,"hidden":true,"merged":[]}
["COUNTRY","QUEST","PRODUCT","DATATYPE","ITEM1","ITEM2","TIME","VALUE","OBSERVATION","CONFIDENTIALITY","KEYREC"]

{"sheet":"Output_ISO_csv","index":10,"n_rows":1,"n_cols":1,"rows_kept":1,"cut":false,"hidden":true,"merged":[]}
["Output"]

{"sheet":"Output_SDMX_csv","index":11,"n_rows":1,"n_cols":1,"rows_kept":1,"cut":false,"hidden":true,"merged":[]}
["Output"]

{"sheet":"Output_SDMX_long_complete","index":12,"n_rows":1,"n_cols":22,"rows_kept":1,"cut":false,"hidden":true,"merged":[]}
["DATAFLOW","QUEST_SOURCE","REF_AREA","FREQ","ENERGY_PRODUCT","MAIN_FLOW","FLOW_BREAKDOWN","PLANT_TECH","PLANT_TYPE","STOCKS","INFRASTRUCTURE_IND","VIS_A_VIS_AREA","MEASURE_VALUE_TYPE","FACILITY_ID","TIME_PERIOD","OBS_VALUE","UNIT_MEASURE","OBS_STATUS","CONF_STATUS","COMMENT_OBS","FACILITY_TYPE","FACILITY_NAME"]

{"sheet":"Mapping_Products_Flows","index":13,"n_rows":30,"n_cols":16,"rows_kept":30,"cut":false,"hidden":true,"merged":[]}
["DATATYPE","PRODUCT","ITEM1","ITEM2","ENERGY_PRODUCT","MAIN_FLOW","FLOW_BREAKDOWN","PLANT_TECH","PLANT_TYPE","STOCKS","INFRASTRUCTURE_IND","VIS_A_VIS_AREA","MEASURE_VALUE_TYPE","FACILITY_ID","UNIT_MEASURE","ISO_EXCLUSION"]
["BALANCE","ELECTR","NELEPROD",null,"E7000","NETPROD","_Z","_T","_T","_Z","_Z","_Z","ENERGY","_Z","GWH","y"]
["BALANCE","NUCLEAR","NELEPROD",null,"E7000","NETPROD","_Z","NUCLEAR","_T","_Z","_Z","_Z","ENERGY","_Z","GWH","y"]
["BALANCE","COMBFUEL","NELEPROD",null,"E7000","NETPROD","_Z","COMBFUEL","_T","_Z","_Z","_Z","ENERGY","_Z","GWH","y"]
["BALANCE","COAL","NELEPROD",null,"E7000","NETPROD","_Z","COMBCOAL","_T","_Z","_Z","_Z","ENERGY","_Z","GWH","y"]
["BALANCE","OIL","NELEPROD",null,"E7000","NETPROD","_Z","COMBOIL","_T","_Z","_Z","_Z","ENERGY","_Z","GWH","y"]
["BALANCE","NATGAS","NELEPROD",null,"E7000","NETPROD","_Z","COMBGAS","_T","_Z","_Z","_Z","ENERGY","_Z","GWH","y"]
["BALANCE","COMBREN","NELEPROD",null,"E7000","NETPROD","_Z","COMBREN","_T","_Z","_Z","_Z","ENERGY","_Z","GWH","y"]
["BALANCE","COMBNREN","NELEPROD",null,"E7000","NETPROD","_Z","COMBOTH","_T","_Z","_Z","_Z","ENERGY","_Z","GWH","y"]
["BALANCE","HYDRO","NELEPROD",null,"E7000","NETPROD","_Z","HYDRO","_T","_Z","_Z","_Z","ENERGY","_Z","GWH","y"]
["BALANCE","HYDPURE","NELEPROD",null,"E7000","NETPROD","_Z","PURHYDRO","_T","_Z","_Z","_Z","ENERGY","_Z","GWH","y"]
["BALANCE","HYDMIXED","NELEPROD",null,"E7000","NETPROD","_Z","MIXHYDRO","_T","_Z","_Z","_Z","ENERGY","_Z","GWH","y"]
["BALANCE","HYDPUMP","NELEPROD",null,"E7000","NETPROD","_Z","HYDPUMP","_T","_Z","_Z","_Z","ENERGY","_Z","GWH","y"]
["BALANCE","WIND","NELEPROD",null,"E7000","NETPROD","_Z","WIND","_T","_Z","_Z","_Z","ENERGY","_Z","GWH","y"]
["BALANCE","WINDON","NELEPROD",null,"E7000","NETPROD","_Z","WINDON","_T","_Z","_Z","_Z","ENERGY","_Z","GWH","y"]
{"$rows_left_out":16}
{"sheet":"Parameters","index":14,"n_rows":21,"n_cols":7,"rows_kept":21,"cut":false,"hidden":true,"merged":[]}
["Element","Type","PosType","Position",null,"DataStart","P2"]
["QUEST_SOURCE","DIM","COLUMN","B",null,"DataEnd","P100000"]
["FREQ","DIM","COLUMN","D",null,"SkipIncompleteKeys","true"]
["REF_AREA","DIM","COLUMN","C",null,"formatValues","actualValue"]
["ENERGY_PRODUCT","DIM","COLUMN","E"]
["MAIN_FLOW","DIM","COLUMN","F"]
["FLOW_BREAKDOWN","DIM","COLUMN","G"]
["PLANT_TECH","DIM","COLUMN","H"]
["PLANT_TYPE","DIM","COLUMN","I"]
["STOCKS","DIM","COLUMN","J"]
["INFRASTRUCTURE_IND","DIM","COLUMN","K"]
["VIS_A_VIS_AREA","DIM","COLUMN","L"]
["MEASURE_VALUE_TYPE","DIM","COLUMN","M"]
["TIME_PERIOD","DIM","COLUMN","O"]
["FACILITY_ID","DIM","COLUMN","N"]
{"$rows_left_out":7}
{"sheet":"Parameter_mapping","index":15,"n_rows":2,"n_cols":2,"rows_kept":2,"cut":false,"hidden":true,"merged":[]}
["Data sheet","Parameter sheet"]
["Output_SDMX_long_complete","Parameters"]

{"sheet":"Logs","index":16,"n_rows":1,"n_cols":7,"rows_kept":1,"cut":false,"hidden":true,"merged":[]}
["Date","Module","Function","Param","Return","ErrorCode","Description"]

{"sheet":"Mapping_countries","index":17,"n_rows":73,"n_cols":4,"rows_kept":73,"cut":false,"hidden":true,"merged":[]}
["Official","IEA","EUROSTAT","IEA-ISO"]
["Albania","ALBANIA","AL","AL"]
["Argentina","ARGENTINA","AR","AR"]
["Armenia","ARMENIA","AM","AM"]
["Australia","AUSTRALI","AU","AU"]
["Austria","AUSTRIA","AT","AT"]
["Azerbaijan","AZERBAIJAN","AZ","AZ"]
["Belarus","BELARUS","BY","BY"]
["Belgium","BELGIUM","BE","BE"]
["Bosnia and Herzegovina","BOSNIAHERZ","BA","BA"]
["Brazil","BRAZIL","BR","BR"]
["Bulgaria","BULGARIA","BG","BG"]
["Canada","CANADA","CA","CA"]
["Chile","CHILE","CL","CL"]
["China, People's Republic of","CHINA","CN","CN"]
{"$rows_left_out":59}
{"sheet":"Param_Menu","index":18,"n_rows":43,"n_cols":8,"rows_kept":43,"cut":false,"hidden":true,"merged":[]}
[null,"Selection",null,"Sep"]
["Format",1,null,",",null,null,"Year","Year shown in the drop-down box with the reference period (in Menu sheet)"]
["File Import","M:\\Data\\Energy - LOT2\\Development\\Questionnaires\\Monthly\\Monthly ELEC\\Developed quest\\test.csv",null,null,null,null,{"$f":"A8","v":2024}]
["File Export","D:\\ARTEMIS INFO. MGMT\\Energy - Lot 2\\Development\\Questionnaires\\Monthly ELEC\\Developed quest\\Albania_SDMX_2024-06-09_10-53.csv",null,null,null,null,{"$f":"A8+1","v":2025}]
["File Import historical","D:\\ARTEMIS INFO. MGMT\\Energy - Lot 2\\Development\\Questionnaires\\Monthly ELEC\\Developed quest\\Albania_SDMX_2024-06-09_10-53.csv",null,null,null,null,{"$f":"A8+2","v":2026}]
[]
["Year","Month","Period","Selected"]
[2024,"M01",{"$f":"PeriodsToLoad[[#This Row],[Year]]&PeriodsToLoad[[#This Row],[Month]]","v":"2024M01"},0]
[{"$f":"$A$8","v":2024},"M02",{"$f":"PeriodsToLoad[[#This Row],[Year]]&PeriodsToLoad[[#This Row],[Month]]","v":"2024M02"},0]
[2024,"M03",{"$f":"PeriodsToLoad[[#This Row],[Year]]&PeriodsToLoad[[#This Row],[Month]]","v":"2024M03"},0]
[2024,"M04",{"$f":"PeriodsToLoad[[#This Row],[Year]]&PeriodsToLoad[[#This Row],[Month]]","v":"2024M04"},0]
[2024,"M05",{"$f":"PeriodsToLoad[[#This Row],[Year]]&PeriodsToLoad[[#This Row],[Month]]","v":"2024M05"},0]
[2024,"M06",{"$f":"PeriodsToLoad[[#This Row],[Year]]&PeriodsToLoad[[#This Row],[Month]]","v":"2024M06"},0]
[2024,"M07",{"$f":"PeriodsToLoad[[#This Row],[Year]]&PeriodsToLoad[[#This Row],[Month]]","v":"2024M07"},0]
[2024,"M08",{"$f":"PeriodsToLoad[[#This Row],[Year]]&PeriodsToLoad[[#This Row],[Month]]","v":"2024M08"},0]
{"$rows_left_out":29}
{"sheet":"Param_Questionnaire","index":19,"n_rows":73,"n_cols":18,"rows_kept":73,"cut":false,"hidden":true,"merged":[]}
["Version","IEA",null,"Eurostat","IEA","Language",null,"FormatNormal","FormatConfidential","FormatConfidential2","FormatEstimated","FormatNotAvailable","FormatDataCannotExist","FormatNotSignificant","FormatLowReliability","FormatDefinitionDiff","FormatTSBreak","FormatProvisional"]
["Questionnaire","MES",null,"Albania","Albania","English",0,1234567.8899999999,0,1234.56789,1234567.8899999999,1234567.8899999999,1234567.8899999999,1234567.8899999999,1234567.8899999999,1234567.8899999999,1234567.8899999999,1234567.8899999999]
["DATAFLOW","ESTAT:ENERGY_ELECT3_M(1.0)",null,"Austria","Argentina","French",1,1234567.8899999999,0,1234.56789,1234567.8899999999,1234567.8899999999,1234567.8899999999,1234567.8899999999,1234567.8899999999,1234567.8899999999,1234567.8899999999,1234567.8899999999]
["QUEST_SOURCE","M_ELECT",null,"Belgium","Armenia","German",2,1234567.8899999999,0,1234.56789,1234567.8899999999,1234567.8899999999,1234567.8899999999,1234567.8899999999,1234567.8899999999,1234567.8899999999,1234567.8899999999,1234567.8899999999]
["FREQ","M",null,"Bosnia and Herzegovina","Australia","Bulgarian",3,1234567.8899999999,0,1234.56789,1234567.8899999999,1234567.8899999999,1234567.8899999999,1234567.8899999999,1234567.8899999999,1234567.8899999999,1234567.8899999999,1234567.8899999999]
["CountryName",{"$f":"Menu!D9","v":"Australia"},null,"Bulgaria","Austria","Spanish",4,1234567.8899999999,0,1234.56789,1234567.8899999999,1234567.8899999999,1234567.8899999999,1234567.8899999999,1234567.8899999999,1234567.8899999999,1234567.8899999999,1234567.8899999999]
["CountryIEA",{"$f":"VLOOKUP(CountryName, Mapping_countries[], 2, 0)","v":"AUSTRALI"},null,"Croatia","Azerbaijan","Czech",5,1234567.8899999999,0,1234.56789,1234567.8899999999,1234567.8899999999,1234567.8899999999,1234567.8899999999,1234567.8899999999,1234567.8899999999,1234567.8899999999,1234567.8899999999]
["CountryEurostat",{"$f":"VLOOKUP(CountryName, Mapping_countries[], 3, 0)","v":"AU"},null,"Cyprus","Belarus","Danish",6,1234567.8899999999,0,1234.56789,1234567.8899999999,1234567.8899999999,1234567.8899999999,1234567.8899999999,1234567.8899999999,1234567.8899999999,1234567.8899999999,1234567.8899999999]
["Language",{"$f":"Menu!D7","v":"English"},null,"Czech Republic","Belgium","Estonian",null,null,null,null,"e","o","m","n","u","d","b","p"]
["PeriodSelected",{"$f":"Menu!C13","v":2026},null,"Denmark","Bosnia and Herzegovina","Greek"]
["Data Format",{"$f":"IF(Param_Menu!B2=1, \"ISO\", \"SDMX\")","v":"ISO"},null,"Estonia","Brazil","Croatian"]
["FormatError","aaa",null,"Finland","Bulgaria","Italian"]
["FormatWarning","aaa",null,"France","Canada","Latvian"]
["FormatRevision","aaa",null,"Georgia","Chile","Lithuanian"]
["FormatLockFormula","aaa",null,"Germany","China, People's Republic of","Hungarian"]
{"$rows_left_out":59}
{"sheet":"Param_Multilanguage","index":20,"n_rows":33,"n_cols":25,"rows_kept":33,"cut":false,"hidden":true,"merged":[]}
["Shortnames","English","French","German","Bulgarian","Spanish","Czech","Danish","Estonian","Greek","Croatian","Italian","Latvian","Lithuanian","Hungarian","Maltese","Dutch","Polish","Portuguese","Romanian","Slovak","Slovenian","Finnish","Swedish","Russian"]
[null,"Monthly Electricity Statistics (GWh)","Monthly Electricity Statistics (GWh)"]
[null,"Total net production","Total net production"]
[null,"Nuclear","Nuclear"]
[null,"Conventional thermal","Conventional thermal"]
[null,"Coal","Coal"]
[null,"Oil","Oil"]
[null,"Natural gas","Natural gas"]
[null,"Combustible renewables","Combustible renewables"]
[null,"Other combustible fuels (non-renewable)","Other combustible fuels (non-renewable)"]
[null,"Hydro","Hydro"]
[null,"Pure hydro","Pure hydro"]
[null,"Mixed hydro","Mixed hydro"]
[null,"Pure pumped storage","Pure pumped storage"]
[null,"Wind","Wind"]
{"$rows_left_out":19}
{"sheet":"Menu","index":21,"n_rows":989,"n_cols":34,"rows_kept":989,"cut":false,"hidden":false,"merged":[[9,9,12,12],[18,2,18,8],[1,2,1,8],[2,2,2,8],[10,2,10,8],[14,2,14,8],[3,2,3,8],[6,3,6,4],[8,3,8,4]]}
[]
[null,null,"Monthly Electricity Statistics"]
[null,null,"REPORTING TEMPLATE "]
[null,null,"IEA - Eurostat"]
[null,null,"Prefilled by:"]
[]
[null,null,"Language:","English"]
[]
[null,null,"Country:","Australia"]
[null,null,null,null,null,null,null,null,null,{"$f":"IF(SaveDone,\"If you see a red box on this page, please click the 'Prepare file for transmission' or 'Export data file' button before saving, closing and transmitting the file.\",\"\")","v":""}]
[null,null,"TABLE AND TIMESERIES"]
[]
[null,null,2026]
[]
[null,null,"DATA TRANSFER"]
{"$rows_left_out":975}
{"sheet":"Instructions","index":22,"n_rows":158,"n_cols":5,"rows_kept":158,"cut":false,"hidden":false,"merged":[[157,4,159,5],[149,1,149,5],[151,1,151,5],[152,1,152,5],[153,1,153,5],[155,1,155,5],[119,4,121,5],[139,2,139,5],[140,2,140,5],[141,2,141,5],[142,2,142,5],[96,1,96,5],[97,1,98,5],[99,4,104,5],[105,4,113,5],[114,4,117,5],[61,4,63,5],[76,4,78,5],[80,4,82,5],[86,1,86,5],[95,1,95,5],[46,1,46,5],[49,4,51,5],[53,1,55,5],[57,1,57,5],[58,1,59,5],[1,1,1,5],[2,1,2,5],[5,1,5,5],[10,1,10,5],[11,1,11,5],[12,1,12,5],[13,1,13,5],[18,1,18,5],[19,1,19,5],[21,1,21,5],[15,1,16,5],[23,4,27,5],[29,1,29,5],[65,4,67,5],[69,4,74,5],[144,1,144,5],[47,1,47,5],[84,1,84,5],[85,1,85,5],[88,4,93,5],[123,4,125,5],[127,1,127,5],[128,1,131,5],[30,1,31,5],[33,4,35,5],[37,4,40,5],[42,1,44,5],[146,1,146,5],[147,1,148,5],[133,2,133,5],[134,2,134,5],[135,2,135,5],[136,1,137,1],[136,2,137,5],[138,2,138,5],[145,1,145,5]]}
[]
[null,"Monthly Electricity Statistics"]
[null,"REPORTING TEMPLATE "]
[]
[" "]
[null,"SUPPORT CONTACT"]
[null,"IEA: ",null,"CES@iea.org"]
[null,"EUROSTAT: ",null,"ESTAT-ENERGY-MONTHLY@EC.EUROPA.EU"]
[]
[null,""]
[null,"SUBMISSION INSTRUCTIONS:"]
[null,"Countries reporting to Eurostat should transmit the completed reporting template via the Single Entry Point (SEP) via EDAMIS."]
[null,"https://webgate.ec.europa.eu/edamis4"]
[null,"In EDAMIS, please use dataset ENERGY_ELEC3_M."]
[]
{"$rows_left_out":144}
{"sheet":"TemplateTS1to2","index":23,"n_rows":43,"n_cols":22,"rows_kept":43,"cut":false,"hidden":true,"merged":[[0,10,0,21],[9,10,9,21]]}
["Mode",null,null,null,null,null,null,null,"Monthly Electricity Statistics (GWh)",null,{"$f":"VLOOKUP(I1, LanguageData, MATCH(LanguageChosen, Language[Language],0), FALSE)","v":"Monthly Electricity Statistics (GWh)"}]
["DataType","BALANCE",null,null,null,null,null,null,null,null,"M01","M02","M03","M04","M05","M06","M07","M08","M09","M10","M11","M12"]
["Item2",null,null,null,null,null,null,null,"TimeRow",null,{"$f":"$B$4 & K2","v":"2024M01"},{"$f":"$B$4 & L2","v":"2024M02"},"2024M03","2024M04","2024M05","2024M06","2024M07","2024M08","2024M09","2024M10","2024M11","2024M12"]
["Version",2024,null,null,null,null,null,null,"FormulaRow"]
[null,null,null,null,null,null,null,null,"CheckRow"]
[null,null,null,null,null,null,null,null,"LockedRow"]
[null,null,null,null,null,null,null,null,"EmptyRow"]
[null,null,null,null,null,null,null,null,"VoluntaryRow"]
[]
[null,null,null,null,null,null,null,null,null,null,{"$f":"B4","v":2024}]
["Item1","Product","FormulaCol","CheckCol1","LabelCheckCol1","LockedCol","EmptyCol","VoluntaryCol","Label",{"$f":"CountryName","v":"Australia"},{"$f":"K3","v":"2024M01"},{"$f":"L3","v":"2024M02"},"2024M03","2024M04","2024M05","2024M06","2024M07","2024M08","2024M09","2024M10","2024M11","2024M12"]
[null,null,null,null,null,null,null,null,"Table 1: NET ELECTRICITY PRODUCTION (GWh)",{"$f":"VLOOKUP(I12, LanguageData, MATCH(LanguageChosen, Language[Language],0), FALSE)","v":"Table 1: NET ELECTRICITY PRODUCTION (GWh)"}]
["NELEPROD","ELECTR","IF(sum([Product=NUCLEAR],[Product=COMBFUEL],[Product=HYDRO],[Product=WIND],[Product=SOLAR],[Product=GEOTHERM],[Product=OTHERREN],[Product=NONSPEC])>0,sum([Product=NUCLEAR],[Product=COMBFUEL],[Product=HYDRO],[Product=WIND],[Product=SOLAR],[Product=GEOTHERM],[Product=OTHERREN],[Product=NONSPEC]),\"\")",null,null,1,null,null,"Total net production",{"$f":"VLOOKUP(I13, LanguageData, MATCH(LanguageChosen, Language[Language],0), FALSE)","v":"Total net production"}]
["NELEPROD","NUCLEAR",null,null,null,null,null,null,"Nuclear",{"$f":"VLOOKUP(I14, LanguageData, MATCH(LanguageChosen, Language[Language],0), FALSE)","v":"Nuclear"}]
["NELEPROD","COMBFUEL","IF(sum([Product=COAL],[Product=OIL],[Product=NATGAS],[Product=COMBREN],[Product=COMBNREN])>0,sum([Product=COAL],[Product=OIL],[Product=NATGAS],[Product=COMBREN],[Product=COMBNREN]),\"\")","< sum([Product=COAL],[Product=OIL],[Product=NATGAS],[Product=COMBREN],[Product=COMBNREN])","Conventional thermal cannot be less than\nCoal + Oil + Natural gas + Combustible \nrenewables + Other combustible fuels (non-renewables)",null,null,null,"Conventional thermal",{"$f":"VLOOKUP(I15, LanguageData, MATCH(LanguageChosen, Language[Language],0), FALSE)","v":"Conventional thermal"}]
{"$rows_left_out":29}
{"sheet":"TemplateRemarks","index":24,"n_rows":35,"n_cols":16,"rows_kept":35,"cut":false,"hidden":true,"merged":[[0,4,2,4]]}
["Mode","Remarks",null,null,{"$f":"VLOOKUP(B1, LanguageData, MATCH(LanguageChosen, Language[Language],0), FALSE)","v":"Remarks"}]
["DataType"]
["Product"]
["Version",2024,"TypeRow",null,"txt","txt","txt","txt","txt","txt","txt","txt","txt","txt","txt","txt"]
["Item2",null,null,null,"M01","M02","M03","M04","M05","M06","M07","M08","M09","M10","M11","M12"]
[null,null,"Time",{"$f":"CountryName","v":"Australia"},{"$f":"$B$4&E5","v":"2024M01"},{"$f":"$B$4&F5","v":"2024M02"},"2024M03","2024M04","2024M05","2024M06","2024M07","2024M08","2024M09","2024M10","2024M11","2024M12"]
["Item1",null,"Label"]
["REMROW01",null,"Remarks 1"]
["REMROW02",null,"Remarks 2"]
["REMROW03",null,"Remarks 3"]
["REMROW04",null,"Remarks 4"]
["REMROW05",null,"Remarks 5"]
["REMROW06",null,"Remarks 6"]
["REMROW07",null,"Remarks 7"]
["REMROW08",null,"Remarks 8"]
{"$rows_left_out":21}
{"sheet":"CheckReport","index":25,"n_rows":1,"n_cols":14,"rows_kept":1,"cut":false,"hidden":true,"merged":[]}
["COUNTRY","QUEST","DATATYPE","PRODUCT","ITEM1","ITEM2","TIME","VALIDATION","VALUE","EXPECTED","RULE","CELL","TABLE","ERRORTYPE"]

{"sheet":"TemplateGraphs","index":26,"n_rows":363,"n_cols":30,"rows_kept":363,"cut":false,"hidden":true,"merged":[]}
["Mode",null,null,null,null,null,null,null,"Monthly Electricity Statistics (GWh)",null,null,null,null,null,null,null,{"$f":"CountryName&\": \"&VLOOKUP(I1,LanguageData,MATCH(LanguageChosen,Language[Language]),FALSE)","v":"Australia: Monthly Electricity Statistics (GWh)"}]
["DataType","BALANCE"]
["Item2"]
["Version","2026M07",null,null,null,null,null,null,"FormulaRow"]
[null,null,null,null,null,null,null,null,"CheckRow"]
[null,null,null,null,null,null,null,null,"LockedRow",null,null,1]
[null,null,null,null,null,null,null,null,"EmptyRow"]
[null,null,null,null,null,null,null,null,"VoluntaryRow"]
[null,null,null,null,null,null,null,null,null,{"$f":"CountryName","v":"Australia"}]
[]
["Item1","Product","FormulaCol","CheckCol1","LabelCheckCol1","LockedCol","EmptyCol","VoluntaryCol","Label","Flow","Time","Value"]
["NELEPROD","ELECTR",null,null,null,null,null,null,"Total net production","Total net production",{"$f":"YEAR(DATE(LEFT($B$4,4),RIGHT($B$4,2)-M12,1)) & \"M\" & TEXT(MONTH(DATE(LEFT($B$4,4),RIGHT($B$4,2)-M12,1)),\"00\")","v":"2025M08"},null,11]
["NELEPROD","NUCLEAR",null,null,null,null,null,null,"Nuclear","Nuclear",{"$f":"YEAR(DATE(LEFT($B$4,4),RIGHT($B$4,2)-M13,1)) & \"M\" & TEXT(MONTH(DATE(LEFT($B$4,4),RIGHT($B$4,2)-M13,1)),\"00\")","v":"2025M08"},null,11]
["NELEPROD","COMBFUEL",null,null,null,null,null,null,"Conventional thermal","Conventional thermal","2025M08",null,11]
["NELEPROD","COAL",null,null,null,null,null,null,"Coal","Coal","2025M08",null,11]
{"$rows_left_out":349}
{"sheet":"Param_Sheets","index":27,"n_rows":8,"n_cols":14,"rows_kept":8,"cut":false,"hidden":true,"merged":[]}
["Name","Template_Sheet","Version","Datatype","Product","Item1","Item2","Time","Protect",null,null,null,"Refresh Formula","Name"]
[{"$f":"\"TS1and2_\"&C2","v":"TS1and2_2024"},"TemplateTS1to2",{"$f":"Param_Menu!A8","v":2024},"BALANCE","Template","Template",null,"Template",1,null,null,null,null,{"$f":"A2","v":"TS1and2_2024"}]
[{"$f":"\"TS1and2_\"&C3","v":"TS1and2_2025"},"TemplateTS1to2",{"$f":"C2+1","v":2025},"BALANCE","Template","Template",null,"Template",1,null,null,null,null,{"$f":"A3","v":"TS1and2_2025"}]
[{"$f":"\"TS1and2_\"&C4","v":"TS1and2_2026"},"TemplateTS1to2",{"$f":"C3+1","v":2026},"BALANCE","Template","Template",null,"Template",1,null,null,null,null,{"$f":"A4","v":"TS1and2_2026"}]
["Graphs","TemplateGraphs",{"$f":"Menu!G21","v":"2026M01"},"BALANCE","Template","Template",null,"Template",3]
[{"$f":"\"REMARKS_\"&C6","v":"REMARKS_2024"},"TemplateRemarks",{"$f":"C2","v":2024},"REMARKS",null,"Template",null,"Template",1]
[{"$f":"\"REMARKS_\"&C7","v":"REMARKS_2025"},"TemplateRemarks",{"$f":"C6+1","v":2025},"REMARKS",null,"Template",null,"Template",1]
[{"$f":"\"REMARKS_\"&C8","v":"REMARKS_2026"},"TemplateRemarks",{"$f":"C7+1","v":2026},"REMARKS",null,"Template",null,"Template",1]

{"sheet":"Param_Sheets_Templates","index":28,"n_rows":6,"n_cols":4,"rows_kept":6,"cut":false,"hidden":true,"merged":[]}
["Name","TemplateTS1to2","TemplateRemarks","TemplateGraphs"]
["Format","TimeSeries","TimeSeries","TimeSeries"]
["VersionRow",4,4,4]
["VersionCol",2,2,2]
["HideCol","A:H","A:C","A:M"]
["HideRow","2:6","4:5","2:9"]

{"sheet":"Param_Tables","index":29,"n_rows":11,"n_cols":9,"rows_kept":11,"cut":false,"hidden":true,"merged":[]}
["Name","SheetName","Template","Version","Datatype","Product","Item1","Item2","Time"]
[{"$f":"\"TS1_\" & D2","v":"TS1_2024"},{"$f":"\"TS1and2_\"&D2","v":"TS1and2_2024"},"TemplateTS1",{"$f":"Param_Menu!A8","v":2024},"BALANCE","Template","NELEPROD",null,"Template"]
[{"$f":"\"TS1_\" & D3","v":"TS1_2025"},"TS1and2_2025","TemplateTS1",{"$f":"D2+1","v":2025},"BALANCE","Template","NELEPROD",null,"Template"]
[{"$f":"\"TS1_\" & D4","v":"TS1_2026"},"TS1and2_2026","TemplateTS1",{"$f":"D2+2","v":2026},"BALANCE","Template","NELEPROD",null,"Template"]
[{"$f":"\"TS2_\" & D5","v":"TS2_2024"},"TS1and2_2024","TemplateTS2",{"$f":"Param_Menu!A11","v":2024},"BALANCE","ELECTR","Template",null,"Template"]
[{"$f":"\"TS2_\" & D6","v":"TS2_2025"},"TS1and2_2025","TemplateTS2",{"$f":"D5+1","v":2025},"BALANCE","ELECTR","Template",null,"Template"]
[{"$f":"\"TS2_\" & D7","v":"TS2_2026"},"TS1and2_2026","TemplateTS2",{"$f":"D5+2","v":2026},"BALANCE","ELECTR","Template",null,"Template"]
["Graphs","Graphs","TemplateGraphs",{"$f":"Menu!G21","v":"2026M01"},"BALANCE","Template","Template",null,"Template"]
["REMARKS",{"$f":"\"REMARKS_\"&D9","v":"REMARKS_2024"},"TemplateRemarks",{"$f":"Param_Menu!A15","v":2024},"REMARKS",null,"Template",null,"Template"]
["REMARKS",{"$f":"\"REMARKS_\"&D10","v":"REMARKS_2025"},"TemplateRemarks",{"$f":"D9+1","v":2025},"REMARKS",null,"Template",null,"Template"]
["REMARKS",{"$f":"\"REMARKS_\"&D11","v":"REMARKS_2026"},"TemplateRemarks",{"$f":"D9+2","v":2026},"REMARKS",null,"Template",null,"Template"]

{"sheet":"Param_Tables_Templates","index":30,"n_rows":45,"n_cols":5,"rows_kept":45,"cut":false,"hidden":true,"merged":[]}
["Name","TemplateTS1","TemplateTS2","TemplateGraphs","TemplateRemarks"]
["SheetName","TemplateTS1to2","TemplateTS1to2","TemplateGraphs","TemplateRemarks"]
["Format","TimeSeries","TimeSeries","OneYear","TimeSeries"]
["VersionRow",4,4,4,4]
["VersionCol",2,2,2,2]
["FirstRow",13,36,12,8]
["FirstCol",11,11,12,5]
["LastRow",33,43,347,35]
["LastCol",22,22,12,16]
["DataTypeRow",2,2,2,2]
["DataTypeCol",2,2,2,2]
["ProductRow",0,0,0,3]
["ProductCol",2,2,2,2]
["Item1Row",0,0,0,0]
["Item1Col",1,1,1,1]
{"$rows_left_out":30}