{"text_format":"1","workbook":"xlsx","n_sheets":9,"sheets":["Summary","Table 10","Table 11","Table 12","Remarks","Param","Formulas","Parameter_mapping","Parameters"],"not_rendered":{"charts":0,"images":2,"macros":1,"external_links":0,"defined_names":64,"comments":1,"pivot_tables":0},"unopened":[],"bounds":{"document_bytes":16777216,"sheet_cells":100000,"rows_first":2000,"rows_last":500,"rows_between":2000,"halvings":0,"cell_chars":16384,"cell_head_chars":4096},"cells_cut":0,"cells_raw":0,"read":"whole","date_system":"1900"}

{"sheet":"Summary","index":0,"n_rows":55,"n_cols":10,"rows_kept":55,"cut":false,"hidden":false,"merged":[[12,5,12,6]]}
[]
[]
[]
[]
[]
[]
[]
[null,null,null,{"$f":"\"Monthly Gas Questionnaire - \" & Quest","v":"Monthly Gas Questionnaire - MOS GAS"}]
[]
[]
{"$rows_left_out":46}
{"sheet":"Table 10","index":1,"n_rows":1002,"n_cols":135,"rows_kept":1002,"cut":false,"hidden":false,"merged":[]}
[{"$f":"Quest & \" QUESTIONNAIRE\"","v":"MOS GAS QUESTIONNAIRE"},null,null,null,null,null,null,null,null,null,null,null,null,null,null,null,null,null,null,null,null,null,null,null,null,null,null,null,null,null,null,null,null,null,null,null,null,null,null,null,null,null,null,null,"Datatype"]
["Table 10: SUPPLY OF NATURAL GAS",null,null,null,null,null,null,null,null,null,null,null,null,null,null,null,null,null,null,null,null,null,null,null,null,null,null,null,null,null,null,null,null,null,null,null,null,null,null,null,null,null,null,null,"BALANCE"]
[{"$f":"IF(Summary!F13=0,\"\",Summary!F13)","v":"(select country)"}]
[{"$f":"IF(Summary!F14=0,\"\",Summary!F14 & \" \" & QuestYear)","v":"January 2020"}]
[null,null,"Natural gas \nMillion m3 (at\n15°C, 760 mm Hg)","Natural gas \nTerajoules\n(Gross calor. value)","Natural gas \nGross calorific value\n(Calculated)",null,null,null,null,null,null,null,null,null,null,null,null,null,null,null,null,null,null,null,null,null,null,null,null,null,null,null,null,null,null,null,null,null,null,null,null,null,null,null,null,null,null,null,null,null,null,null,null,null,null,null,null,null,null,null,null,null,null,null,null,null,null,null,null,null,null,null,null,null,null,null,null,null,null,null,null,null,null,null,null,null,null,null,null,null,null,null,null,null,null,null,null,null,null,null,null,null,null,null,null,null,null,null,null,null,null,null,null,null,null,null,null,null,null,null,null,null,"*** DSD codes ***"]
[null,null,"A","B","C",null,null,null,null,null,null,null,null,null,null,null,null,null,null,null,null,null,null,null,null,null,null,null,null,null,null,null,null,null,null,null,null,null,null,null,null,null,null,null,"Item1 ê",null,null,null,null,null,null,null,null,null,null,null,null,null,null,null,null,null,null,null,null,null,null,null,null,null,null,null,null,null,null,null,null,null,null,null,null,null,null,null,null,null,null,null,null,null,null,null,null,null,null,null,null,null,null,null,null,null,null,null,null,null,null,null,null,null,null,null,null,null,null,null,null,null,null,null,null,null,"REF_AREA","ENERGY_PRODUCT","MAIN_FLOW","FLOW_BREAKDOWN","PLANT_TECH","PLANT_TYPE","STOCKS","INFRASTRUCTURE_IND","VIS_A_VIS_AREA","MEASURE_VALUE_TYPE","FACILITY_ID","UNIT_MEASURE","TIME_PERIOD"]
["Indigenous production",1,null,null,{"$f":"IF(OR(D7=0,C7=0),\"\",ROUND((D7/C7)*1000,0))","v":""},null,null,null,null,null,null,null,null,null,null,null,null,null,null,null,null,null,null,null,null,null,null,null,null,null,null,null,null,null,null,null,null,null,null,null,null,null,null,null,"INDPROD",null,null,null,null,null,null,null,null,null,null,null,null,null,null,null,null,null,null,null,null,null,null,null,null,null,null,null,null,null,null,null,null,null,null,null,null,null,null,null,null,null,null,null,null,null,null,null,null,null,null,null,null,null,null,null,null,null,null,null,null,null,null,null,null,null,null,null,null,null,null,null,null,null,null,null,null,null,{"$f":"VLOOKUP(CountryUser, Param!$C$9:$E$65, 3, 0)","v":{"$error":"#N/A"}},"Row 1000","PRODUCT","INDPROD","_Z","_Z","_Z","_Z","_Z","Row 1001","_Z","Row 1002",{"$f":"QuestYear&\"-\"&TEXT(MATCH(FirstMonth, Param!C70:C81,0), \"00\")","v":"2020-01"}]
["Receipts from other sources",2,null,null,{"$f":"IF(OR(D8=0,C8=0),\"\",ROUND((D8/C8)*1000,0))","v":""},null,null,null,null,null,null,null,null,null,null,null,null,null,null,null,null,null,null,null,null,null,null,null,null,null,null,null,null,null,null,null,null,null,null,null,null,null,null,null,"OSOURCES",null,null,null,null,null,null,null,null,null,null,null,null,null,null,null,null,null,null,null,null,null,null,null,null,null,null,null,null,null,null,null,null,null,null,null,null,null,null,null,null,null,null,null,null,null,null,null,null,null,null,null,null,null,null,null,null,null,null,null,null,null,null,null,null,null,null,null,null,null,null,null,null,null,null,null,null,null,null,null,"SUPPLY","OSOURCES","_Z","_Z","_Z","_Z","_Z",null,"_Z"]
["Imports (Entries)1",3,null,null,{"$f":"IF(OR(D9=0,C9=0),\"\",ROUND((D9/C9)*1000,0))","v":""},null,null,null,null,null,null,null,null,null,null,null,null,null,null,null,null,null,null,null,null,null,null,null,null,null,null,null,null,null,null,null,null,null,null,null,null,null,null,null,"TOTENTSB",null,null,null,null,null,null,null,null,null,null,null,null,null,null,null,null,null,null,null,null,null,null,null,null,null,null,null,null,null,null,null,null,null,null,null,null,null,null,null,null,null,null,null,null,null,null,null,null,null,null,null,null,null,null,null,null,null,null,null,null,null,null,null,null,null,null,null,null,null,null,null,null,null,null,null,null,null,null,null,"IMPORTS","TOTIMPSB","_Z","_Z","_Z","_Z","_Z",null,"_Z"]
["Exports (Exits)2",4,null,null,"",null,null,null,null,null,null,null,null,null,null,null,null,null,null,null,null,null,null,null,null,null,null,null,null,null,null,null,null,null,null,null,null,null,null,null,null,null,null,null,"TOTEXTSB",null,null,null,null,null,null,null,null,null,null,null,null,null,null,null,null,null,null,null,null,null,null,null,null,null,null,null,null,null,null,null,null,null,null,null,null,null,null,null,null,null,null,null,null,null,null,null,null,null,null,null,null,null,null,null,null,null,null,null,null,null,null,null,null,null,null,null,null,null,null,null,null,null,null,null,null,null,null,null,"EXPORTS","TOTEXPSB","_Z","_Z","_Z","_Z","_Z",null,"_Z"]
{"$rows_left_out":993}
{"sheet":"Table 11","index":2,"n_rows":1002,"n_cols":135,"rows_kept":1002,"cut":false,"hidden":false,"merged":[[4,6,5,6],[4,8,5,8],[4,2,5,2],[4,4,5,4]]}
[{"$f":"Quest & \" QUESTIONNAIRE\"","v":"MOS GAS QUESTIONNAIRE"},null,null,null,null,null,null,null,null,null,null,null,null,null,null,null,null,null,null,null,null,null,null,null,null,null,null,null,null,null,null,null,null,null,null,null,null,null,null,null,null,null,null,null,"Datatype"]
["Table 11: IMPORTS (ENTRIES) OF NATURAL GAS BY ORIGIN",null,null,null,null,null,null,null,null,null,null,null,null,null,null,null,null,null,null,null,null,null,null,null,null,null,null,null,null,null,null,null,null,null,null,null,null,null,null,null,null,null,null,null,"ENTRIES"]
[{"$f":"IF(Summary!F13=0,\"\",Summary!F13)","v":"(select country)"}]
[{"$f":"IF(Summary!F14=0,\"\",Summary!F14 & \" \" & QuestYear)","v":"January 2020"}]
[null,null,"Natural gas \nMillion m3 (at\n15°C, 760 mm Hg)",null,"Natural gas \nTerajoules\n(Gross calor. value)",null,"Natural gas\nGross calorific value\n(Calculated)",null,"Probate",null,null,null,null,null,null,null,null,null,null,null,null,null,null,null,null,null,null,null,null,null,null,null,null,null,null,null,null,null,null,null,null,null,null,null,null,null,null,null,null,null,null,null,null,null,null,null,null,null,null,null,null,null,null,null,null,null,null,null,null,null,null,null,null,null,null,null,null,null,null,null,null,null,null,null,null,null,null,null,null,null,null,null,null,null,null,null,null,null,null,null,null,null,null,null,null,null,null,null,null,null,null,null,null,null,null,null,null,null,null,null,null,null,"*** DSD codes ***"]
[null,null,null,"Of which: LNG",null,"Of which: LNG",null,null,null,null,null,null,null,null,null,null,null,null,null,null,null,null,null,null,null,null,null,null,null,null,null,null,null,null,null,null,null,null,null,null,null,null,null,null,null,null,null,null,null,null,null,null,null,null,null,null,null,null,null,null,null,null,null,null,null,null,null,null,null,null,null,null,null,null,null,null,null,null,null,null,null,null,null,null,null,null,null,null,null,null,null,null,null,null,null,null,null,null,null,null,null,null,null,null,null,null,null,null,null,null,null,null,null,null,null,null,null,null,null,null,null,null,"REF_AREA","ENERGY_PRODUCT","MAIN_FLOW","FLOW_BREAKDOWN","PLANT_TECH","PLANT_TYPE","STOCKS","INFRASTRUCTURE_IND","VIS_A_VIS_AREA","MEASURE_VALUE_TYPE","FACILITY_ID","UNIT_MEASURE","TIME_PERIOD"]
[null,null,"A","B","C","D","E",null,"F",null,null,null,null,null,null,null,null,null,null,null,null,null,null,null,null,null,null,null,null,null,null,null,null,null,null,null,null,null,null,null,null,null,null,null,"Item1 ê",null,null,null,null,null,null,null,null,null,null,null,null,null,null,null,null,null,null,null,null,null,null,null,null,null,null,null,null,null,null,null,null,null,null,null,null,null,null,null,null,null,null,null,null,null,null,null,null,null,null,null,null,null,null,null,null,null,null,null,null,null,null,null,null,null,null,null,null,null,null,null,null,null,null,null,null,null,{"$f":"VLOOKUP(CountryUser, Param!$C$9:$E$65, 3, 0)","v":{"$error":"#N/A"}},"Row 1000",null,null,null,null,null,null,null,"Row 1001",null,"Row 1002",{"$f":"QuestYear&\"-\"&TEXT(MATCH(FirstMonth, Param!C70:C81,0), \"00\")","v":"2020-01"}]
["Albania",1,null,null,null,null,{"$f":"IF(OR(E8=0,C8=0),\"\",ROUND((E8/C8)*1000,0))","v":""},{"$f":"IF(MIN(C8:F8)<0,1,0)+IF(OR(C8<D8,E8<F8),1,0)","v":0},{"$f":"IF(H8=0,\" \",IF(H8=1,\"Error: \",\"2 errors: \"))&IF(MIN(C8:F8)<0,\"Imports data should not be negative. \",\"\")&IF(OR(C8<D8,E8<F8),\"'Of which: LNG' greater than Total.\",\"\")","v":" "},null,null,null,null,null,null,null,null,null,null,null,null,null,null,null,null,null,null,null,null,null,null,null,null,null,null,null,null,null,null,null,null,null,null,"AL","ALBANIA",null,null,null,null,null,null,null,null,null,null,null,null,null,null,null,null,null,null,null,null,null,null,null,null,null,null,null,null,null,null,null,null,null,null,null,null,null,null,null,null,null,null,null,null,null,null,null,null,null,null,null,null,null,null,null,null,null,null,null,null,null,null,null,null,null,null,null,null,null,null,null,null,null,null,null,null,null,null,null,"IMPORTS","_Z","_Z","_Z","_Z","_Z","AL",null,"_Z"]
["Algeria",2,null,null,null,null,{"$f":"IF(OR(E9=0,C9=0),\"\",ROUND((E9/C9)*1000,0))","v":""},0," ",null,null,null,null,null,null,null,null,null,null,null,null,null,null,null,null,null,null,null,null,null,null,null,null,null,null,null,null,null,null,null,null,null,null,"DZ","ALGERIA",null,null,null,null,null,null,null,null,null,null,null,null,null,null,null,null,null,null,null,null,null,null,null,null,null,null,null,null,null,null,null,null,null,null,null,null,null,null,null,null,null,null,null,null,null,null,null,null,null,null,null,null,null,null,null,null,null,null,null,null,null,null,null,null,null,null,null,null,null,null,null,null,null,null,null,null,null,null,null,"IMPORTS","_Z","_Z","_Z","_Z","_Z","DZ",null,"_Z"]
["Andorra",3,null,null,null,null,"",0," ",null,null,null,null,null,null,null,null,null,null,null,null,null,null,null,null,null,null,null,null,null,null,null,null,null,null,null,null,null,null,null,null,null,null,"AD","ANDORRA",null,null,null,null,null,null,null,null,null,null,null,null,null,null,null,null,null,null,null,null,null,null,null,null,null,null,null,null,null,null,null,null,null,null,null,null,null,null,null,null,null,null,null,null,null,null,null,null,null,null,null,null,null,null,null,null,null,null,null,null,null,null,null,null,null,null,null,null,null,null,null,null,null,null,null,null,null,null,null,"IMPORTS","_Z","_Z","_Z","_Z","_Z","AD",null,"_Z"]
{"$rows_left_out":993}
{"sheet":"Table 12","index":3,"n_rows":1002,"n_cols":135,"rows_kept":1002,"cut":false,"hidden":false,"merged":[[4,6,5,6],[4,2,5,2],[4,4,5,4],[4,8,5,8]]}
[{"$f":"Quest & \" QUESTIONNAIRE\"","v":"MOS GAS QUESTIONNAIRE"},null,null,null,null,null,null,null,null,null,null,null,null,null,null,null,null,null,null,null,null,null,null,null,null,null,null,null,null,null,null,null,null,null,null,null,null,null,null,null,null,null,null,null,"Datatype"]
["Table 12:  EXPORTS (EXITS) OF NATURAL GAS BY DESTINATION",null,null,null,null,null,null,null,null,null,null,null,null,null,null,null,null,null,null,null,null,null,null,null,null,null,null,null,null,null,null,null,null,null,null,null,null,null,null,null,null,null,null,null,"EXITS"]
[{"$f":"IF(Summary!F13=0,\"\",Summary!F13)","v":"(select country)"}]
[{"$f":"IF(Summary!F14=0,\"\",Summary!F14 & \" \" & QuestYear)","v":"January 2020"}]
[null,null,"Natural gas \nMillion m3 (at\n15°C, 760 mm Hg)",null,"Natural gas \nTerajoules\n(Gross calor. value)",null,"Natural gas\nGross calorific value\n(Calculated)",null,"Probate",null,null,null,null,null,null,null,null,null,null,null,null,null,null,null,null,null,null,null,null,null,null,null,null,null,null,null,null,null,null,null,null,null,null,null,null,null,null,null,null,null,null,null,null,null,null,null,null,null,null,null,null,null,null,null,null,null,null,null,null,null,null,null,null,null,null,null,null,null,null,null,null,null,null,null,null,null,null,null,null,null,null,null,null,null,null,null,null,null,null,null,null,null,null,null,null,null,null,null,null,null,null,null,null,null,null,null,null,null,null,null,null,null,"*** DSD codes ***"]
[null,null,null,"Of which:\nLNG",null,"Of which:\nLNG",null,null,null,null,null,null,null,null,null,null,null,null,null,null,null,null,null,null,null,null,null,null,null,null,null,null,null,null,null,null,null,null,null,null,null,null,null,null,null,null,null,null,null,null,null,null,null,null,null,null,null,null,null,null,null,null,null,null,null,null,null,null,null,null,null,null,null,null,null,null,null,null,null,null,null,null,null,null,null,null,null,null,null,null,null,null,null,null,null,null,null,null,null,null,null,null,null,null,null,null,null,null,null,null,null,null,null,null,null,null,null,null,null,null,null,null,"REF_AREA","ENERGY_PRODUCT","MAIN_FLOW","FLOW_BREAKDOWN","PLANT_TECH","PLANT_TYPE","STOCKS","INFRASTRUCTURE_IND","VIS_A_VIS_AREA","MEASURE_VALUE_TYPE","FACILITY_ID","UNIT_MEASURE","TIME_PERIOD"]
[null,null,"A","B","C","D","E",null,"F",null,null,null,null,null,null,null,null,null,null,null,null,null,null,null,null,null,null,null,null,null,null,null,null,null,null,null,null,null,null,null,null,null,null,null,"Item1 ê",null,null,null,null,null,null,null,null,null,null,null,null,null,null,null,null,null,null,null,null,null,null,null,null,null,null,null,null,null,null,null,null,null,null,null,null,null,null,null,null,null,null,null,null,null,null,null,null,null,null,null,null,null,null,null,null,null,null,null,null,null,null,null,null,null,null,null,null,null,null,null,null,null,null,null,null,null,{"$f":"VLOOKUP(CountryUser, Param!$C$9:$E$65, 3, 0)","v":{"$error":"#N/A"}},"Row 1000",null,null,null,null,null,null,null,"Row 1001",null,"Row 1002",{"$f":"QuestYear&\"-\"&TEXT(MATCH(FirstMonth, Param!C70:C81,0), \"00\")","v":"2020-01"}]
["Albania",1,null,null,null,null,{"$f":"IF(OR(E8=0,C8=0),\"\",ROUND((E8/C8)*1000,0))","v":""},{"$f":"IF(MIN(C8:F8)<0,1,0)+IF(OR(C8<D8,E8<F8),1,0)","v":0},{"$f":"IF(H8=0,\" \",IF(H8=1,\"Error: \",\"2 errors: \"))&IF(MIN(C8:F8)<0,\"Imports data should not be negative. \",\"\")&IF(OR(C8<D8,E8<F8),\"'Of which: LNG' greater than Total.\",\"\")","v":" "},null,null,null,null,null,null,null,null,null,null,null,null,null,null,null,null,null,null,null,null,null,null,null,null,null,null,null,null,null,null,null,null,null,null,"AL","ALBANIA",null,null,null,null,null,null,null,null,null,null,null,null,null,null,null,null,null,null,null,null,null,null,null,null,null,null,null,null,null,null,null,null,null,null,null,null,null,null,null,null,null,null,null,null,null,null,null,null,null,null,null,null,null,null,null,null,null,null,null,null,null,null,null,null,null,null,null,null,null,null,null,null,null,null,null,null,null,null,null,"EXPORTS","_Z","_Z","_Z","_Z","_Z","AL",null,"_Z"]
["Algeria",2,null,null,null,null,{"$f":"IF(OR(E9=0,C9=0),\"\",ROUND((E9/C9)*1000,0))","v":""},0," ",null,null,null,null,null,null,null,null,null,null,null,null,null,null,null,null,null,null,null,null,null,null,null,null,null,null,null,null,null,null,null,null,null,null,"DZ","ALGERIA",null,null,null,null,null,null,null,null,null,null,null,null,null,null,null,null,null,null,null,null,null,null,null,null,null,null,null,null,null,null,null,null,null,null,null,null,null,null,null,null,null,null,null,null,null,null,null,null,null,null,null,null,null,null,null,null,null,null,null,null,null,null,null,null,null,null,null,null,null,null,null,null,null,null,null,null,null,null,null,"EXPORTS","_Z","_Z","_Z","_Z","_Z","DZ",null,"_Z"]
["Andorra",3,null,null,null,null,"",0," ",null,null,null,null,null,null,null,null,null,null,null,null,null,null,null,null,null,null,null,null,null,null,null,null,null,null,null,null,null,null,null,null,null,null,"AD","ANDORRA",null,null,null,null,null,null,null,null,null,null,null,null,null,null,null,null,null,null,null,null,null,null,null,null,null,null,null,null,null,null,null,null,null,null,null,null,null,null,null,null,null,null,null,null,null,null,null,null,null,null,null,null,null,null,null,null,null,null,null,null,null,null,null,null,null,null,null,null,null,null,null,null,null,null,null,null,null,null,null,"EXPORTS","_Z","_Z","_Z","_Z","_Z","AD",null,"_Z"]
{"$rows_left_out":993}
{"sheet":"Remarks","index":4,"n_rows":43,"n_cols":35,"rows_kept":43,"cut":false,"hidden":false,"merged":[]}
[null,null,null,null,null,null,null,null,null,null,null,null,null,null,null,null,null,null,null,null,null,null,null,null,null,null,null,null,null,null,null,null,null,null,"Datatype"]
[null,null,{"$f":"IF(ChosenQuest=\"MOSG\",Quest & \" Remarks\",Quest & \" Remarks\")","v":"MOS GAS Remarks"},null,null,null,null,null,null,null,null,null,null,null,null,null,null,null,null,null,null,null,null,null,null,null,null,null,null,null,null,null,null,null,"REMARKS"]
[null,null,null,null,null,null,null,null,null,null,null,null,null,null,null,null,null,null,null,null,null,null,null,null,null,null,null,null,null,null,null,null,null,null,"Item1 ê"]
[null,null,null,null,null,null,null,null,null,null,null,null,null,null,null,null,null,null,null,null,null,null,null,null,null,null,null,null,null,null,null,null,null,null,"REMROW01"]
[null,null,null,null,null,null,null,null,null,null,null,null,null,null,null,null,null,null,null,null,null,null,null,null,null,null,null,null,null,null,null,null,null,null,"REMROW02"]
[null,null,null,null,null,null,null,null,null,null,null,null,null,null,null,null,null,null,null,null,null,null,null,null,null,null,null,null,null,null,null,null,null,null,"REMROW03"]
[null,null,null,null,null,null,null,null,null,null,null,null,null,null,null,null,null,null,null,null,null,null,null,null,null,null,null,null,null,null,null,null,null,null,"REMROW04"]
[null,null,null,null,null,null,null,null,null,null,null,null,null,null,null,null,null,null,null,null,null,null,null,null,null,null,null,null,null,null,null,null,null,null,"REMROW05"]
[null,null,null,null,null,null,null,null,null,null,null,null,null,null,null,null,null,null,null,null,null,null,null,null,null,null,null,null,null,null,null,null,null,null,"REMROW06"]
[null,null,null,null,null,null,null,null,null,null,null,null,null,null,null,null,null,null,null,null,null,null,null,null,null,null,null,null,null,null,null,null,null,null,"REMROW07"]
{"$rows_left_out":34}
{"sheet":"Param","index":5,"n_rows":124,"n_cols":11,"rows_kept":124,"cut":false,"hidden":true,"merged":[[1,1,1,3]]}
[]
[null,"SETTINGS"]
[]
[]
[]
[]
[null,null,"ParamCountry / CountryList"]
[null,null,"(select country)","SELECT","00"]
[null,null,"Albania","ALBANIA","AL"]
[null,null,"Armenia","ARMENIA","AM"]
{"$rows_left_out":115}
{"sheet":"Formulas","index":6,"n_rows":374,"n_cols":8,"rows_kept":374,"cut":false,"hidden":true,"merged":[[33,4,34,4],[33,6,34,6]]}
[]
[null,"Formulas backup for forms"]
[]
[null,"This sheet has been done in order to facilitate the maintenance of the formulas the user could erase: you must do it in this current sheet."]
[]
[]
[]
[null,null,"Table 10: SUPPLY OF NATURAL GAS"]
[null,null,null,null,"Natural gas \nMillion m3 (at\n15°C, 760 mm Hg)","Natural gas \nTerajoules\n(Gross calor. value)"]
[null,null,null,null,"A","B"]
{"$rows_left_out":365}
{"sheet":"Parameter_mapping","index":7,"n_rows":4,"n_cols":2,"rows_kept":4,"cut":false,"hidden":true,"merged":[]}
["Data sheet","Parameter sheet"]
["Table 10","Parameters"]
["Table 11","Parameters"]
["Table 12","Parameters"]

{"sheet":"Parameters","index":8,"n_rows":21,"n_cols":7,"rows_kept":21,"cut":false,"hidden":true,"merged":[]}
["Element","Type","PosType","Position",null,"DataStart","C7"]
["QUEST_SOURCE","DIM","FIX","M_NATGAS",null,"DataEnd","G172"]
["FREQ","DIM","FIX","M",null,"SkipIncompleteKeys","true"]
["REF_AREA","DIM","CELL","DS7",null,"SkipObservationWithValue",0]
["ENERGY_PRODUCT","DIM","ROW",1000]
["MAIN_FLOW","DIM","COLUMN","DU"]
["FLOW_BREAKDOWN","DIM","COLUMN","DV"]
["PLANT_TECH","DIM","COLUMN","DW"]
["PLANT_TYPE","DIM","COLUMN","DX"]
["STOCKS","DIM","COLUMN","DY"]
{"$rows_left_out":11}