{"text_format":"1","workbook":"xlsx","n_sheets":8,"sheets":["Note","Table_old","Table","Remarks","Definitions","Data","Param","Dataload"],"not_rendered":{"charts":0,"images":0,"macros":1,"external_links":0,"defined_names":60,"comments":0,"pivot_tables":0},"unopened":[],"bounds":{"document_bytes":16777216,"sheet_cells":100000,"rows_first":2000,"rows_last":500,"rows_between":2000,"halvings":0,"cell_chars":16384,"cell_head_chars":4096},"cells_cut":0,"cells_raw":0,"read":"whole","date_system":"1900"}

{"sheet":"Note","index":0,"n_rows":16,"n_cols":2,"rows_kept":16,"cut":false,"hidden":false,"merged":[[14,1,14,8],[15,1,15,8]]}
[]
[]
[]
[null,"RENEWABLES AND WASTE"]
[]
[]
[null,"ANNUAL MINI QUESTIONNAIRE"]
[null,{"$f":"DataCountry","v":0}]
[null,{"$f":"DataYear+1&\"E\"","v":"1E"}]
[]
[]
[]
[]
[]
[null,"Contact for OECD countries: RenewAQ@iea.org"]
[null,"Contact for non-OECD countries: WED@iea.org"]

{"sheet":"Table_old","index":1,"n_rows":89,"n_cols":10,"rows_kept":89,"cut":false,"hidden":true,"merged":[[1,1,1,4],[2,1,2,4]]}
[]
[null,"Renewables and Waste Mini Questionnaire",null,null,null,null,null,"Datatype"]
[null,{"$f":"Data!B2","v":0},null,null,null,null,null,"BALANCE"]
[null,null,null,null,null,null,null,"Item2"]
[null,null,null,{"$f":"DataYear","v":0},{"$f":"DataYear+1&\"E\"","v":"1E"}]
[null,"Geothermal, Direct Use (TJ)",null,null,null,null,null,"Item1","Product","Concatenated"]
[null,null,"Distribution Losses",{"$f":"IFERROR(VLOOKUP(J7&REPT(\" \",18-LEN(I7)-LEN(H7)),Data!A:B,2,FALSE),\"\")","v":""},0,null,null,"DISTLOSS","GEOTHERM",{"$f":"IF(H7=0, \"\",CONCATENATE(I7,\".\",H7))","v":"GEOTHERM.DISTLOSS"}]
[null,null,"Total Final Consumption *",{"$f":"IFERROR(VLOOKUP(J8&REPT(\" \",18-LEN(I8)-LEN(H8)),Data!A:B,2,FALSE),\"\")","v":""},0,null,null,"FINCONS","GEOTHERM",{"$f":"IF(H8=0, \"\",CONCATENATE(I8,\".\",H8))","v":"GEOTHERM.FINCONS"}]
[null,"* Please note that this includes only geothermal energy consumed directly (and not to produce",null,null,null,null,null,null,null,""]
[null,"   electricity and/or heat sold, which is reported in the Mini Electricity and Heat Questionnaire)",null,null,null,null,null,null,null,""]
[null,"Solar Thermal, Direct Use (TJ)",null,null,null,null,null,null,null,""]
[null,null,"Distribution Losses",{"$f":"IFERROR(VLOOKUP(J12&REPT(\" \",18-LEN(I12)-LEN(H12)),Data!A:B,2,FALSE),\"\")","v":""},0,null,null,"DISTLOSS","SOLARTH","SOLARTH.DISTLOSS"]
[null,null,"Total Final Consumption *",{"$f":"IFERROR(VLOOKUP(J13&REPT(\" \",18-LEN(I13)-LEN(H13)),Data!A:B,2,FALSE),\"\")","v":""},0,null,null,"FINCONS","SOLARTH","SOLARTH.FINCONS"]
[null,"* Please note that this includes only solar thermal energy consumed directly (and not to produce",null,null,null,null,null,null,null,""]
[null,"   electricity and/or heat sold, which is reported in the Mini Electricity and Heat Questionnaire)",null,null,null,null,null,null,null,""]
[null,"Industrial Waste (non-renewable) (TJ, net)",null,null,null,null,null,null,null,""]
[null,"(+)","Indigenous Production",{"$f":"IFERROR(VLOOKUP(J17&REPT(\" \",18-LEN(I17)-LEN(H17)),Data!A:B,2,FALSE),\"\")","v":""},0,null,null,"INDPROD","INDWASTE","INDWASTE.INDPROD"]
[null,"(+)","Total Imports (Balance)",{"$f":"IFERROR(VLOOKUP(J18&REPT(\" \",18-LEN(I18)-LEN(H18)),Data!A:B,2,FALSE),\"\")","v":""},0,null,null,"TOTIMPSB","INDWASTE","INDWASTE.TOTIMPSB"]
[null,"(-)","Total Exports (Balance)",{"$f":"IFERROR(VLOOKUP(J19&REPT(\" \",18-LEN(I19)-LEN(H19)),Data!A:B,2,FALSE),\"\")","v":""},0,null,null,"TOTEXPSB","INDWASTE","INDWASTE.TOTEXPSB"]
[null,"(+/-)","Stock Changes (National Territory)",{"$f":"IFERROR(VLOOKUP(J20&REPT(\" \",18-LEN(I20)-LEN(H20)),Data!A:B,2,FALSE),\"\")","v":""},0,null,null,"STCHANAT","INDWASTE","INDWASTE.STCHANAT"]
{"$rows_left_out":70}
{"sheet":"Table","index":2,"n_rows":290,"n_cols":54,"rows_kept":290,"cut":false,"hidden":false,"merged":[[2,5,2,44],[34,18,34,20],[9,39,9,41],[9,42,9,44],[33,18,33,20],[9,21,9,23],[9,24,9,26],[9,27,9,29],[9,30,9,32],[9,33,9,35],[9,36,9,38],[33,5,35,5],[33,6,33,8],[33,9,33,11],[33,12,33,14],[33,15,33,17],[34,6,34,8],[34,9,34,11],[34,12,34,14],[34,15,34,17],[8,30,8,32],[8,39,8,41],[8,42,8,44],[9,6,9,8],[9,9,9,11],[9,12,9,14],[9,15,9,17],[9,18,9,20],[8,27,8,29],[3,5,3,44],[7,5,10,5],[7,6,7,14],[7,15,7,20],[7,21,7,26],[7,27,7,29],[7,30,7,44],[8,6,8,8],[8,9,8,11],[8,12,8,14],[8,15,8,17],[8,18,8,20],[8,21,8,23],[8,24,8,26],[8,33,8,35],[8,36,8,38]]}
[]
[]
[null,null,null,null,null,"Renewables and Wastes Mini-Questionnaire"]
[null,null,null,null,null,{"$f":"DataCountry","v":0}]
[]
[null,null,null,null,null,"PRODUCT →","GEOTHERM","GEOTHERM",null,"SOLARTH","SOLARTH",null,"INDWASTE","INDWASTE",null,"MUNWASTER","MUNWASTER",null,"MUNWASTEN","MUNWASTEN",null,"PRIMSBIO","PRIMSBIO",null,"CHARCOAL","CHARCOAL",null,"BIOGASES","BIOGASES",null,"BIOGASOL","BIOGASOL",null,"BIOETHANOL","BIOETHANOL",null,"BIOJETKERO","BIOJETKERO",null,"BIODIESEL","BIODIESEL",null,"OBIOLIQ","OBIOLIQ"]
[null,null,null,null,null,null,2,2,null,3,3,null,4,4,null,5,5,null,6,6,null,7,7,null,8,8,null,9,9,null,10,10,null,11,11,null,12,12,null,13,13,null,14,14]
[null,null,null,null,null,"Table 1 of 2:\nMini Balance",null,null,null,null,null,null,null,null,null,"Municipal Wastes",null,null,null,null,null,"Solid Biofuels",null,null,null,null,null,"Biogases",null,null,"Liquid Biofuels"]
[null,null,"↓",null,null,null,"Geothermal energy",null,null,"Solar Thermal",null,null,"Industrial waste\n(non-renewable)",null,null,"Renewable",null,null,"Non-renewable",null,null,"Solid biofuels\nexcluding charcoal",null,null,"Charcoal",null,null,"Biogases\n(In Table 2, a + b + c + d)",null,null,"Biogasoline",null,null,"Of which bioethanol",null,null,"Bio jet kerosenes",null,null,"Biodiesels",null,null,"Other liquid biofuels"]
[null,null,"BALANCE",null,null,null,"TJ (NCV)",null,null,"TJ (NCV)",null,null,"TJ (NCV)",null,null,"TJ (NCV)",null,null,"TJ (NCV)",null,null,"TJ (NCV)",null,null,"kt",null,null,"TJ (NCV)",null,null,"kt",null,null,"kt",null,null,"kt",null,null,"kt",null,null,"kt"]
[null,null,null,null,null,null,{"$f":"DataYear","v":0},{"$f":"DataYear+1&\"E\"","v":"1E"},"% change",{"$f":"DataYear","v":0},{"$f":"H11","v":"1E"},"% change",{"$f":"DataYear","v":0},{"$f":"K11","v":"1E"},"% change",{"$f":"DataYear","v":0},{"$f":"N11","v":"1E"},{"$f":"O11","v":"% change"},{"$f":"DataYear","v":0},{"$f":"Q11","v":"1E"},"% change",{"$f":"DataYear","v":0},{"$f":"H11","v":"1E"},{"$f":"U11","v":"% change"},{"$f":"DataYear","v":0},{"$f":"W11","v":"1E"},{"$f":"X11","v":"% change"},{"$f":"DataYear","v":0},{"$f":"Z11","v":"1E"},{"$f":"AA11","v":"% change"},{"$f":"DataYear","v":0},{"$f":"AC11","v":"1E"},{"$f":"AD11","v":"% change"},{"$f":"DataYear","v":0},{"$f":"AF11","v":"1E"},{"$f":"AG11","v":"% change"},{"$f":"DataYear","v":0},{"$f":"AI11","v":"1E"},{"$f":"AJ11","v":"% change"},{"$f":"DataYear","v":0},{"$f":"AL11","v":"1E"},{"$f":"AM11","v":"% change"},{"$f":"DataYear","v":0},{"$f":"AO11","v":"1E"},"% change"]
[null,5,"INDPROD",null,null,"Indigenous production",{"$f":"Data!B5","v":0},0,{"$f":"IF(G12 = 0,\"n/a\", H12/G12-1)","v":"n/a"},{"$f":"Data!C5","v":0},0,{"$f":"IF(J12 = 0,\"n/a\", K12/J12-1)","v":"n/a"},{"$f":"Data!D5","v":0},0,{"$f":"IF(M12 = 0,\"n/a\", N12/M12-1)","v":"n/a"},{"$f":"Data!E5","v":0},0,{"$f":"IF(P12 = 0,\"n/a\", Q12/P12-1)","v":"n/a"},{"$f":"Data!F5","v":0},0,{"$f":"IF(S12 = 0,\"n/a\", T12/S12-1)","v":"n/a"},{"$f":"Data!G5","v":0},0,{"$f":"IF(V12 = 0,\"n/a\", W12/V12-1)","v":"n/a"},{"$f":"Data!H5","v":0},0,{"$f":"IF(Y12 = 0,\"n/a\", Z12/Y12-1)","v":"n/a"},{"$f":"Data!I5","v":0},0,{"$f":"IF(AB12 = 0,\"n/a\", AC12/AB12-1)","v":"n/a"},{"$f":"Data!J5","v":0},0,{"$f":"IF(AE12 = 0,\"n/a\", AF12/AE12-1)","v":"n/a"},{"$f":"Data!K5","v":0},0,{"$f":"IF(AH12 = 0,\"n/a\", AI12/AH12-1)","v":"n/a"},{"$f":"Data!L5","v":0},0,{"$f":"IF(AK12 = 0,\"n/a\", AL12/AK12-1)","v":"n/a"},{"$f":"Data!M5","v":0},0,{"$f":"IF(AN12 = 0,\"n/a\", AO12/AN12-1)","v":"n/a"},{"$f":"Data!N5","v":0},0,{"$f":"IF(AQ12 = 0,\"n/a\", AR12/AQ12-1)","v":"n/a"}]
[null,6,"TOTIMPSB",null,null,"(+) Total imports (balance)",{"$f":"Data!B6","v":0},0,"n/a",{"$f":"Data!C6","v":0},0,"n/a",{"$f":"Data!D6","v":0},0,"n/a",{"$f":"Data!E6","v":0},0,"n/a",{"$f":"Data!F6","v":0},0,"n/a",{"$f":"Data!G6","v":0},0,"n/a",{"$f":"Data!H6","v":0},0,"n/a",{"$f":"Data!I6","v":0},0,"n/a",{"$f":"Data!J6","v":0},0,"n/a",{"$f":"Data!K6","v":0},0,"n/a",{"$f":"Data!L6","v":0},0,"n/a",{"$f":"Data!M6","v":0},0,"n/a",{"$f":"Data!N6","v":0},0,"n/a"]
[null,7,"TOTEXPSB",null,null,"(-) Total exports (balance)",{"$f":"Data!B7","v":0},0,"n/a",{"$f":"Data!C7","v":0},0,"n/a",{"$f":"Data!D7","v":0},0,"n/a",{"$f":"Data!E7","v":0},0,"n/a",{"$f":"Data!F7","v":0},0,"n/a",{"$f":"Data!G7","v":0},0,"n/a",{"$f":"Data!H7","v":0},0,"n/a",{"$f":"Data!I7","v":0},0,"n/a",{"$f":"Data!J7","v":0},0,"n/a",{"$f":"Data!K7","v":0},0,"n/a",{"$f":"Data!L7","v":0},0,"n/a",{"$f":"Data!M7","v":0},0,"n/a",{"$f":"Data!N7","v":0},0,"n/a"]
[null,8,"STCHANAT",null,null,"(+) Stock changes (national territory)",{"$f":"Data!B8","v":0},0,"n/a",{"$f":"Data!C8","v":0},0,"n/a",{"$f":"Data!D8","v":0},0,"n/a",{"$f":"Data!E8","v":0},0,"n/a",{"$f":"Data!F8","v":0},0,"n/a",{"$f":"Data!G8","v":0},0,"n/a",{"$f":"Data!H8","v":0},0,"n/a",{"$f":"Data!I8","v":0},0,"n/a",{"$f":"Data!J8","v":0},0,"n/a",{"$f":"Data!K8","v":0},0,"n/a",{"$f":"Data!L8","v":0},0,"n/a",{"$f":"Data!M8","v":0},0,"n/a",{"$f":"Data!N8","v":0},0,"n/a"]
[null,9,"INDCONC",null,null,"(=) Inland consumption (calculated)",{"$f":"Data!B9","v":0},{"$f":"ROUND(H12+H13-H14+H15,3)","v":0},"n/a",{"$f":"Data!C9","v":0},{"$f":"ROUND(K12+K13-K14+K15,3)","v":0},"n/a",{"$f":"Data!D9","v":0},{"$f":"ROUND(N12+N13-N14+N15,3)","v":0},"n/a",{"$f":"Data!E9","v":0},{"$f":"ROUND(Q12+Q13-Q14+Q15,3)","v":0},"n/a",{"$f":"Data!F9","v":0},{"$f":"ROUND(T12+T13-T14+T15,3)","v":0},"n/a",{"$f":"Data!G9","v":0},{"$f":"ROUND(W12+W13-W14+W15,3)","v":0},"n/a",{"$f":"Data!H9","v":0},{"$f":"ROUND(Z12+Z13-Z14+Z15,3)","v":0},"n/a",{"$f":"Data!I9","v":0},{"$f":"ROUND(AC12+AC13-AC14+AC15,3)","v":0},"n/a",{"$f":"Data!J9","v":0},{"$f":"ROUND(AF12+AF13-AF14+AF15,3)","v":0},"n/a",{"$f":"Data!K9","v":0},{"$f":"ROUND(AI12+AI13-AI14+AI15,3)","v":0},"n/a",{"$f":"Data!L9","v":0},{"$f":"ROUND(AL12+AL13-AL14+AL15,3)","v":0},"n/a",{"$f":"Data!M9","v":0},{"$f":"ROUND(AO12+AO13-AO14+AO15,3)","v":0},"n/a",{"$f":"Data!N9","v":0},{"$f":"ROUND(AR12+AR13-AR14+AR15,3)","v":0},"n/a"]
[null,10,"STATDIFF",null,null,"Statistical differences",{"$f":"Data!B10","v":0},{"$f":"ROUND(H16-H18-H22-H23-H25,3)","v":0},"n/a",{"$f":"Data!C10","v":0},{"$f":"ROUND(K16-K18-K22-K23-K25,3)","v":0},"n/a",{"$f":"Data!D10","v":0},{"$f":"ROUND(N16-N18-N22-N23-N25,3)","v":0},"n/a",{"$f":"Data!E10","v":0},{"$f":"ROUND(Q16-Q18-Q22-Q23-Q25,3)","v":0},"n/a",{"$f":"Data!F10","v":0},{"$f":"ROUND(T16-T18-T22-T23-T25,3)","v":0},"n/a",{"$f":"Data!G10","v":0},{"$f":"ROUND(W16-W18-W22-W23-W25,3)","v":0},"n/a",{"$f":"Data!H10","v":0},{"$f":"ROUND(Z16-Z18-Z22-Z23-Z25,3)","v":0},"n/a",{"$f":"Data!I10","v":0},{"$f":"ROUND(AC16-AC18-AC22-AC23-AC25,3)","v":0},"n/a",{"$f":"Data!J10","v":0},{"$f":"ROUND(AF16-AF18-AF22-AF23-AF25,3)","v":0},"n/a",{"$f":"Data!K10","v":0},{"$f":"ROUND(AI16-AI18-AI22-AI23-AI25,3)","v":0},"n/a",{"$f":"Data!L10","v":0},{"$f":"ROUND(AL16-AL18-AL22-AL23-AL25,3)","v":0},"n/a",{"$f":"Data!M10","v":0},{"$f":"ROUND(AO16-AO18-AO22-AO23-AO25,3)","v":0},"n/a",{"$f":"Data!N10","v":0},{"$f":"ROUND(AR16-AR18-AR22-AR23-AR25,3)","v":0},"n/a"]
[null,11,"TOTTRANF",null,null,"Transformation sector",{"$f":"Data!B11","v":0},0,"n/a",{"$f":"Data!C11","v":0},0,"n/a",{"$f":"Data!D11","v":0},0,"n/a",{"$f":"Data!E11","v":0},0,"n/a",{"$f":"Data!F11","v":0},0,"n/a",{"$f":"Data!G11","v":0},0,"n/a",{"$f":"Data!H11","v":0},0,"n/a",{"$f":"Data!I11","v":0},0,"n/a",{"$f":"Data!J11","v":0},0,"n/a",{"$f":"Data!K11","v":0},0,"n/a",{"$f":"Data!L11","v":0},0,"n/a",{"$f":"Data!M11","v":0},0,"n/a",{"$f":"Data!N11","v":0},0,"n/a"]
[null,12,"MTOELEHEAT",null,null,"of which: input to electricity and heat plants",{"$f":"Data!B12","v":0},0,"n/a",{"$f":"Data!C12","v":0},0,"n/a",{"$f":"Data!D12","v":0},0,"n/a",{"$f":"Data!E12","v":0},0,"n/a",{"$f":"Data!F12","v":0},0,"n/a",{"$f":"Data!G12","v":0},0,"n/a",{"$f":"Data!H12","v":0},0,"n/a",{"$f":"Data!I12","v":0},0,"n/a",{"$f":"Data!J12","v":0},0,"n/a",{"$f":"Data!K12","v":0},0,"n/a",{"$f":"Data!L12","v":0},0,"n/a",{"$f":"Data!M12","v":0},0,"n/a",{"$f":"Data!N12","v":0},0,"n/a"]
[null,13,"TBLENDGAS",null,null,"of which: natural gas blending plants",{"$f":"Data!B13","v":0},0,"n/a",{"$f":"Data!C13","v":0},0,"n/a",{"$f":"Data!D13","v":0},0,"n/a",{"$f":"Data!E13","v":0},0,"n/a",{"$f":"Data!F13","v":0},0,"n/a",{"$f":"Data!G13","v":0},0,"n/a",{"$f":"Data!H13","v":0},0,null,{"$f":"Data!I13","v":0},0,"n/a",{"$f":"Data!J13","v":0},0,"n/a",{"$f":"Data!K13","v":0},0,"n/a",{"$f":"Data!L13","v":0},0,"n/a",{"$f":"Data!M13","v":0},0,"n/a",{"$f":"Data!N13","v":0},0,"n/a"]
{"$rows_left_out":271}
{"sheet":"Remarks","index":3,"n_rows":45,"n_cols":8,"rows_kept":45,"cut":false,"hidden":false,"merged":[]}
[]
[null,null,null,null,null,null,"Datatype","Item2"]
[null,{"$f":"\"REMARKS PAGE - \" & DataCountry & \" - \" & DataYear+1&\"E\"","v":"REMARKS PAGE -  - 1E"},null,null,null,null,"REMARKS"]
[null,null,null,null,null,null,"Item1","Product (none)"]
[null,null,null,null,null,null,"REMROW01"]
[null,null,null,null,null,null,"REMROW02"]
[null,null,null,null,null,null,"REMROW03"]
[null,null,null,null,null,null,"REMROW04"]
[null,null,null,null,null,null,"REMROW05"]
[null,null,null,null,null,null,"REMROW06"]
[null,null,null,null,null,null,"REMROW07"]
[null,null,null,null,null,null,"REMROW08"]
[null,null,null,null,null,null,"REMROW09"]
[null,null,null,null,null,null,"REMROW10"]
[null,null,null,null,null,null,"REMROW11"]
[null,null,null,null,null,null,"REMROW12"]
[null,null,null,null,null,null,"REMROW13"]
[null,null,null,null,null,null,"REMROW14"]
[null,null,null,null,null,null,"REMROW15"]
[null,null,null,null,null,null,"REMROW16"]
{"$rows_left_out":26}
{"sheet":"Definitions","index":4,"n_rows":79,"n_cols":3,"rows_kept":79,"cut":false,"hidden":false,"merged":[]}
[]
[null,null,"** DEFINITIONS OF RENEWABLE ENERGY AND WASTE SOURCES **"]
[]
[null,"1. Geothermal, Direct Use*"]
[null,"Energy available as heat emitted from within the earth’s crust, usually in the form of hot water or"]
[null,"steam. It is exploited at suitable sites directly as heat for district heating, agriculture etc."]
[]
[]
[null,"* Please note that this includes only geothermal energy consumed directly (and not to produce"]
[null,"  electricity and/or heat sold, which is reported in the Mini Electricity and Heat Questionnaire)"]
[]
[null,"2. Solar Thermal, Direct Use*"]
[null,"Solar radiation exploited for hot water production. Passive solar energy for the direct heating,"]
[null,"cooling and lighting of dwellings or other buildings is not included. Solar thermal can consist of equipment"]
[null,"for the production of domestic hot water or for the seasonal heating of swimming pools (e.g. flat plate"]
[null,"collectors, mainly of the thermosyphon type)"]
[]
[null,"* Please note that this includes only solar thermal energy consumed directly (and not to produce"]
[null,"electricity and/or heat sold, which is reported in the Mini Electricity and Heat Questionnaire)"]
[]
{"$rows_left_out":60}
{"sheet":"Data","index":5,"n_rows":23,"n_cols":18,"rows_kept":23,"cut":false,"hidden":false,"merged":[]}
["TIME"]
["COUNTRY"]
["PLANT","Total"]
[null,"GEOTHERM","SOLARTH","INDWASTE","MUNWASTER","MUNWASTEN","PRIMSBIO","CHARCOAL","BIOGASES","BIOGASOL","BIOETHANOL","BIOJETKERO","BIODIESEL","OBIOLIQ","LANDFILL","SLUDGEGS","OBIOGAS","BGTHERM"]
["INDPROD   ",0,0,0,0,0,0,0,0,0,0,0,0,0,0,0,0,0]
["TOTIMPSB  ",0,0,0,0,0,0,0,0,0,0,0,0,0,0,0,0,0]
["TOTEXPSB  ",0,0,0,0,0,0,0,0,0,0,0,0,0,0,0,0,0]
["STCHANAT  ",0,0,0,0,0,0,0,0,0,0,0,0,0,0,0,0,0]
["INDCONC   ",0,0,0,0,0,0,0,0,0,0,0,0,0,0,0,0,0]
["STATDIFF  ",0,0,0,0,0,0,0,0,0,0,0,0,0,0,0,0,0]
["TOTTRANF  ",0,0,0,0,0,0,0,0,0,0,0,0,0,0,0,0,0]
["MTOELEHEAT",0,0,0,0,0,0,0,0,0,0,0,0,0,0,0,0,0]
["TBLENDGAS ",0,0,0,0,0,0,0,0,0,0,0,0,0,0,0,0,0]
["TBLENDOIL ",0,0,0,0,0,0,0,0,0,0,0,0,0,0,0,0,0]
["TOTENGY   ",0,0,0,0,0,0,0,0,0,0,0,0,0,0,0,0,0]
["DISTLOSS  ",0,0,0,0,0,0,0,0,0,0,0,0,0,0,0,0,0]
["FINCONS   ",0,0,0,0,0,0,0,0,0,0,0,0,0,0,0,0,0]
["FINECONS  ",0,0,0,0,0,0,0,0,0,0,0,0,0,0,0,0,0]
["TOTIND    ",0,0,0,0,0,0,0,0,0,0,0,0,0,0,0,0,0]
["TOTTRANS  ",0,0,0,0,0,0,0,0,0,0,0,0,0,0,0,0,0]
{"$rows_left_out":4}
{"sheet":"Param","index":6,"n_rows":91,"n_cols":44,"rows_kept":91,"cut":false,"hidden":false,"merged":[]}
[]
[null,"SETTINGS"]
[]
[]
[null,null,"ParamCountry / CountryList"]
[null,null,"Country","COUNTRY","00"]
[null,null,"Australia","AUSTRALI","AU"]
[null,null,"Austria","AUSTRIA","AT"]
[null,null,"Belgium","BELGIUM","BE"]
[null,null,"Canada","CANADA","CA"]
[null,null,"Chile","CHILE","CL"]
[null,null,"Colombia","COLOMBIA","CO"]
[null,null,"Czech Republic","CZECH","CZ"]
[null,null,"Denmark","DENMARK","DK"]
[null,null,"Estonia","ESTONIA","EE"]
[null,null,"Finland","FINLAND","FI",null,null,{"$f":"H12+H13-H14+H15","v":0},null,null,{"$f":"K12+K13-K14+K15","v":0},null,null,{"$f":"N12+N13-N14+N15","v":0},null,null,{"$f":"Q12+Q13-Q14+Q15","v":0},null,null,{"$f":"T12+T13-T14+T15","v":0},null,null,{"$f":"W12+W13-W14+W15","v":0},null,null,{"$f":"Z12+Z13-Z14+Z15","v":0},null,null,{"$f":"AC12+AC13-AC14+AC15","v":0},null,null,{"$f":"AF12+AF13-AF14+AF15","v":0},null,null,{"$f":"AI12+AI13-AI14+AI15","v":0},null,null,{"$f":"AL12+AL13-AL14+AL15","v":0},null,null,{"$f":"AO12+AO13-AO14+AO15","v":0},null,null,{"$f":"AR12+AR13-AR14+AR15","v":0}]
[null,null,"France","FRANCE","FR",null,null,{"$f":"H16-H18-H22-H23-H25","v":0},null,null,{"$f":"K16-K18-K22-K23-K25","v":0},null,null,{"$f":"N16-N18-N22-N23-N25","v":0},null,null,{"$f":"Q16-Q18-Q22-Q23-Q25","v":0},null,null,{"$f":"T16-T18-T22-T23-T25","v":0},null,null,{"$f":"W16-W18-W22-W23-W25","v":0},null,null,{"$f":"Z16-Z18-Z22-Z23-Z25","v":0},null,null,{"$f":"AC16-AC18-AC22-AC23-AC25","v":0},null,null,{"$f":"AF16-AF18-AF22-AF23-AF25","v":0},null,null,{"$f":"AI16-AI18-AI22-AI23-AI25","v":0},null,null,{"$f":"AL16-AL18-AL22-AL23-AL25","v":0},null,null,{"$f":"AO16-AO18-AO22-AO23-AO25","v":0},null,null,{"$f":"AR16-AR18-AR22-AR23-AR25","v":0}]
[null,null,"Germany","GERMANY","DE"]
[null,null,"Greece","GREECE","GR"]
[null,null,"Hungary","HUNGARY","HU"]
{"$rows_left_out":72}
{"sheet":"Dataload","index":7,"n_rows":254,"n_cols":5,"rows_kept":254,"cut":false,"hidden":false,"merged":[]}
["TIME",{"$f":"Note!B9","v":"1E"}]
["COUNTRY",{"$f":"DataCountry","v":0}]
[null,"TOTAL"]
["GEOTHERM.INDPROD",{"$f":"IFERROR(INDEX(GEOTHERM_VAL,MATCH(C$4,Item1Tab1,0)),0)","v":0},"INDPROD"]
["GEOTHERM.TOTIMPSB",{"$f":"IFERROR(INDEX(GEOTHERM_VAL,MATCH(C$5,Item1Tab1,0)),0)","v":0},"TOTIMPSB"]
["GEOTHERM.TOTEXPSB",{"$f":"IFERROR(INDEX(GEOTHERM_VAL,MATCH(C$6,Item1Tab1,0)),0)","v":0},"TOTEXPSB"]
["GEOTHERM.STCHANAT",{"$f":"IFERROR(INDEX(GEOTHERM_VAL,MATCH(C$7,Item1Tab1,0)),0)","v":0},"STCHANAT"]
["GEOTHERM.INDCONC",{"$f":"IFERROR(INDEX(GEOTHERM_VAL,MATCH(C$8,Item1Tab1,0)),0)","v":0},"INDCONC"]
["GEOTHERM.STATDIFF",{"$f":"IFERROR(INDEX(GEOTHERM_VAL,MATCH(C$9,Item1Tab1,0)),0)","v":0},"STATDIFF"]
["GEOTHERM.TOTTRANF",{"$f":"IFERROR(INDEX(GEOTHERM_VAL,MATCH(C$10,Item1Tab1,0)),0)","v":0},"TOTTRANF"]
["GEOTHERM.MTOELEHEAT",{"$f":"IFERROR(INDEX(GEOTHERM_VAL,MATCH(C$11,Item1Tab1,0)),0)","v":0},"MTOELEHEAT",null,0]
["GEOTHERM.TBLENDGAS",{"$f":"IFERROR(INDEX(GEOTHERM_VAL,MATCH(C$12,Item1Tab1,0)),0)","v":0},"TBLENDGAS"]
["GEOTHERM.TBLENDOIL",{"$f":"IFERROR(INDEX(GEOTHERM_VAL,MATCH(C$13,Item1Tab1,0)),0)","v":0},"TBLENDOIL"]
["GEOTHERM.TOTENGY",{"$f":"IFERROR(INDEX(GEOTHERM_VAL,MATCH(C$14,Item1Tab1,0)),0)","v":0},"TOTENGY"]
["GEOTHERM.DISTLOSS",{"$f":"IFERROR(INDEX(GEOTHERM_VAL,MATCH(C$15,Item1Tab1,0)),0)","v":0},"DISTLOSS"]
["GEOTHERM.FINCONS",{"$f":"IFERROR(INDEX(GEOTHERM_VAL,MATCH(C$16,Item1Tab1,0)),0)","v":0},"FINCONS"]
["GEOTHERM.FINECONS",{"$f":"IFERROR(INDEX(GEOTHERM_VAL,MATCH(C$17,Item1Tab1,0)),0)","v":0},"FINECONS"]
["GEOTHERM.TOTIND",{"$f":"IFERROR(INDEX(GEOTHERM_VAL,MATCH(C$18,Item1Tab1,0)),0)","v":0},"TOTIND"]
["GEOTHERM.TOTTRANS",{"$f":"IFERROR(INDEX(GEOTHERM_VAL,MATCH(C$19,Item1Tab1,0)),0)","v":0},"TOTTRANS"]
["GEOTHERM.TOTOTHER",{"$f":"IFERROR(INDEX(GEOTHERM_VAL,MATCH(C$20,Item1Tab1,0)),0)","v":0},"TOTOTHER"]
{"$rows_left_out":234}