{"text_format":"1","workbook":"xlsx","n_sheets":15,"sheets":["START","Intro","Metadata","Energy Balance Time Series","2018","Table 1 2019P","Table 1 2020","Table 1 2030","Table 1 2040","Table 1 2050","Table 2","Table 3","LastCycle","Database","Efficiencies"],"not_rendered":{"charts":16,"images":1,"macros":1,"external_links":0,"defined_names":28,"comments":0,"pivot_tables":0},"unopened":[],"bounds":{"document_bytes":16777216,"sheet_cells":100000,"rows_first":2000,"rows_last":500,"rows_between":2000,"halvings":0,"cell_chars":16384,"cell_head_chars":4096},"cells_cut":0,"cells_raw":0,"read":"whole","date_system":"1900"}

{"sheet":"START","index":0,"n_rows":12,"n_cols":2,"rows_kept":12,"cut":false,"hidden":false,"merged":[]}
["QUESTIONNAIRE FOR COUNTRY SUBMISSIONS"]
[{"$f":"\"FOR THE \"&Database!B3&\"/\"&Database!C3&\" SLT/CERT ANNUAL REVIEW\"","v":"FOR THE 2020/2021 SLT/CERT ANNUAL REVIEW"}]
[]
[{"$f":"Database!B12","v":"Australia"}]
[]
[]
["Click on the \"Start\" button to begin:"]
["If it does not work, please:"]
[null,"1)  Close this file"]
[null,"2)  Reopen it and click \"Enable Macros\" if a security warning appears."]
[]
[null,"The macros in this file are virus free."]

{"sheet":"Intro","index":1,"n_rows":36,"n_cols":3,"rows_kept":36,"cut":false,"hidden":false,"merged":[[18,0,19,8]]}
["QUESTIONNAIRE FOR COUNTRY SUBMISSIONS"]
[{"$f":"\"FOR THE \"&Database!B3&\"/\"&Database!C3&\" SLT/CERT ANNUAL REVIEW\"","v":"FOR THE 2020/2021 SLT/CERT ANNUAL REVIEW"}]
[]
[{"$f":"Database!B12","v":"Australia"}]
[]
["Instructions for completing the electronic questionnaire:"]
[]
[]
["1. You should complete the tables on the following sheets:"]
[]
[{"$f":"HYPERLINK(\"#'Table 1 \"&Database!M11&\"'!c6\",\"Table 1 \"&Database!M11)","v":"Table 1 2019P"},null,{"$f":"\"Energy Balances for \"&Database!B4&\" provisional\"","v":"Energy Balances for 2019 provisional"}]
[{"$f":"HYPERLINK(\"#'Table 1 \"&Database!N11&\"'!c6\",\"Table 1 \"&Database!N11)","v":"Table 1 2020"},null,{"$f":"\"Energy Balances for \"&Database!B5","v":"Energy Balances for 2020"}]
[{"$f":"HYPERLINK(\"#'Table 1 \"&Database!O11&\"'!c6\",\"Table 1 \"&Database!O11)","v":"Table 1 2030"},null,{"$f":"\"Energy Balances for \"&Database!C5","v":"Energy Balances for 2030"}]
[{"$f":"HYPERLINK(\"#'Table 1 \"&Database!P11&\"'!c6\",\"Table 1 \"&Database!P11)","v":"Table 1 2040"},null,{"$f":"\"Energy Balances for \"&Database!D5","v":"Energy Balances for 2040"}]
[{"$f":"HYPERLINK(\"#'Table 1 \"&Database!Q11&\"'!c6\",\"Table 1 \"&Database!Q11)","v":"Table 1 2050"},null,{"$f":"\"Energy Balances for \"&Database!E5&\" (optional)\"","v":"Energy Balances for 2050 (optional)"}]
["Table 2",null,"Supplementary Data"]
["Table 3",null,"Coal Production, Imports and Exports"]
[]
["Note: To respond to user requests, the “Solar,etc.” category is since this cycle split into “Solar” and “Tide and other” categories. Note that when using the macro to copy the data from last cycle, the “Solar, etc.” data will be by default allocated to the new “Solar” product, due to the absence of this disaggregation in time series. Please adjust the figures if needed. "]
[]
[]
[]
[]
[]
[]
[]
[]
[]
[]
[]
[]
[]
[]
[]
[]
["2. You should check the tables for errors "]

{"sheet":"Metadata","index":2,"n_rows":29,"n_cols":1,"rows_kept":29,"cut":false,"hidden":false,"merged":[[28,0,28,12],[18,0,18,12],[23,0,23,12],[1,0,1,12],[3,0,3,12],[8,0,8,12],[13,0,13,12],[2,0,2,12]]}
[" Metadata / Working Sheet"]
["Please provide any metadata about the tables or workbook here.  You can also use this page as a scratch pad for workings. Please state here if you have used the forecasts from last cycle."]
["Additionally can you also please indicate:"]
["•    Source institution for modelling and collaborating institutions"]
[]
[]
[]
[]
["•    Short description of the methodology (assumptions, policy targets, and model used for the scenario)"]
[]
[]
[]
[]
["•    Assumption for specific scenario used (if it is only one or why it is considered representative)"]
[]
[]
[]
[]
["•    Frequency of projections update"]
[]
[]
[]
[]
["•    Please provide links to any documentation, reports, or website"]
[]
[]
[]
[]
["•    Any other comments if you want"]

{"sheet":"Energy Balance Time Series","index":3,"n_rows":396,"n_cols":45,"rows_kept":396,"cut":false,"hidden":false,"merged":[[107,9,107,12],[289,9,289,12],[315,9,315,12],[341,9,341,12],[315,1,315,3],[341,1,341,3],[341,4,341,8],[289,1,289,3],[263,4,263,8],[289,4,289,8],[315,4,315,8],[133,9,133,12],[159,9,159,12],[185,9,185,12],[133,1,133,3],[159,1,159,3],[185,1,185,3],[185,4,185,8],[107,4,107,8],[133,4,133,8],[159,4,159,8],[55,1,55,3],[263,1,263,3],[107,1,107,3],[0,0,0,11],[1,0,1,11],[29,4,29,8],[81,4,81,8],[3,1,3,3],[29,1,29,3],[3,4,3,8],[81,1,81,3],[55,4,55,8],[3,9,3,12],[29,9,29,12],[55,9,55,12],[81,9,81,12],[237,4,237,8],[237,9,237,12],[211,1,211,3],[237,1,237,3],[263,9,263,12],[211,4,211,8],[211,9,211,12]]}
["Energy Balance Time Series"]
[{"$f":"Database!B12","v":"Australia"}]
[null,null,null,null,null,null,null,null,null,null,null,null,null,null,null,null,null,null,null,null,null,null,null,null,null,null,null,null,null,"Display",{"$f":"IF(SUMSQ(F$344:F$365)>0,TRUE,FALSE)","v":false},{"$f":"IF(SUMSQ(G$344:G$365)>0,TRUE,FALSE)","v":false},{"$f":"IF(SUMSQ(H$344:H$365)>0,TRUE,FALSE)","v":false},{"$f":"IF(SUMSQ(I$344:I$365)>0,TRUE,FALSE)","v":false}]
["Coal / Oil shale","Historical Data",null,null,"Data Submission This Cycle",null,null,null,null,"Last Cycle Projections"]
[null,{"$f":"Database!B11","v":2016},{"$f":"Database!C11","v":2017},{"$f":"Database!D11","v":2018},{"$f":"Database!M11","v":"2019P"},{"$f":"Database!N11","v":2020},{"$f":"Database!O11","v":2030},{"$f":"Database!P11","v":2040},{"$f":"Database!Q11","v":2050},{"$f":"Database!E13","v":"2020.LC"},{"$f":"Database!F13","v":"2030.LC"},{"$f":"Database!G13","v":"2040.LC"},{"$f":"Database!H13","v":"2050.LC"},null,null,null,null,null,null,null,null,null,null,null,null,5,{"$f":"B5","v":2016},{"$f":"C5","v":2017},{"$f":"D5","v":2018},{"$f":"VALUE(LEFT(E5,4))","v":2019},{"$f":"F5","v":2020},{"$f":"G5","v":2030},{"$f":"H5","v":2040},{"$f":"I5","v":2050},{"$f":"H5","v":2040},{"$f":"I5","v":2050}]
["Production (+)",{"$f":"Database!J14","v":0},{"$f":"Database!K14","v":0},{"$f":"Database!L14","v":0},0,0,0,0,0,{"$f":"Database!E14","v":0},{"$f":"Database!F14","v":0},{"$f":"Database!G14","v":0},{"$f":"Database!H14","v":0},null,null,null,null,null,null,null,null,null,null,null,null,{"$f":"INDEX(A6:G27,$Z$5,1)","v":"International aviation bunkers (–)"},{"$f":"INDEX(B6:N27,$Z$5,1)","v":0},{"$f":"INDEX(C6:O27,$Z$5,1)","v":0},{"$f":"INDEX(D6:P27,$Z$5,1)","v":0},{"$f":"INDEX(E6:Q27,$Z$5,1)","v":0},{"$f":"IF(AE$3,INDEX(F6:U27,$Z$5,1),NA())","v":{"$error":"#N/A"}},{"$f":"IF(AF$3,INDEX(G6:V27,$Z$5,1),NA())","v":{"$error":"#N/A"}},{"$f":"IF(AG$3,INDEX(H6:W27,$Z$5,1),NA())","v":{"$error":"#N/A"}},{"$f":"IF(AH$3,INDEX(I6:X27,$Z$5,1),NA())","v":{"$error":"#N/A"}},{"$f":"IF(AG$3,INDEX(H6:W27,$Z$5,1),NA())","v":{"$error":"#N/A"}},{"$f":"IF(AH$3,INDEX(I6:X27,$Z$5,1),NA())","v":{"$error":"#N/A"}}]
["Imports (+)",{"$f":"Database!J15","v":0},{"$f":"Database!K15","v":0},{"$f":"Database!L15","v":0},0,0,0,0,0,{"$f":"Database!E15","v":0},{"$f":"Database!F15","v":0},{"$f":"Database!G15","v":0},{"$f":"Database!H15","v":0}]
["Exports (–)",{"$f":"Database!J16","v":0},{"$f":"Database!K16","v":0},{"$f":"Database!L16","v":0},0,0,0,0,0,{"$f":"Database!E16","v":0},{"$f":"Database!F16","v":0},{"$f":"Database!G16","v":0},{"$f":"Database!H16","v":0}]
["International marine bunkers (–)",{"$f":"Database!J17","v":0},{"$f":"Database!K17","v":0},{"$f":"Database!L17","v":0},0,0,0,0,0,{"$f":"Database!E17","v":0},{"$f":"Database!F17","v":0},{"$f":"Database!G17","v":0},{"$f":"Database!H17","v":0}]
["International aviation bunkers (–)",{"$f":"Database!J18","v":0},{"$f":"Database!K18","v":0},{"$f":"Database!L18","v":0},0,0,0,0,0,{"$f":"Database!E18","v":0},{"$f":"Database!F18","v":0},{"$f":"Database!G18","v":0},{"$f":"Database!H18","v":0}]
["Stock changes (±)",{"$f":"Database!J19","v":0},{"$f":"Database!K19","v":0},{"$f":"Database!L19","v":0},0,0,0,0,0,{"$f":"Database!E19","v":0},{"$f":"Database!F19","v":0},{"$f":"Database!G19","v":0},{"$f":"Database!H19","v":0}]
["Total Energy Supply",{"$f":"Database!J20","v":0},{"$f":"Database!K20","v":0},{"$f":"Database!L20","v":0},{"$f":"SUM(E6:E11)","v":0},{"$f":"SUM(F6:F11)","v":0},{"$f":"SUM(G6:G11)","v":0},{"$f":"SUM(H6:H11)","v":0},{"$f":"SUM(I6:I11)","v":0},{"$f":"Database!E20","v":0},{"$f":"Database!F20","v":0},{"$f":"Database!G20","v":0},{"$f":"Database!H20","v":0}]
["Transformation processes & Energy industry own use",{"$f":"Database!J21","v":0},{"$f":"Database!K21","v":0},{"$f":"Database!L21","v":0},{"$f":"SUM(E14:E16)","v":0},{"$f":"SUM(F14:F16)","v":0},{"$f":"SUM(G14:G16)","v":0},{"$f":"SUM(H14:H16)","v":0},{"$f":"SUM(I14:I16)","v":0},{"$f":"SUM(J14:J16)","v":0},{"$f":"SUM(K14:K16)","v":0},{"$f":"SUM(L14:L16)","v":0},{"$f":"SUM(M14:M16)","v":0}]
["Electricity, CHP & heat plants (±)",{"$f":"Database!J22","v":0},{"$f":"Database!K22","v":0},{"$f":"Database!L22","v":0},0,0,0,0,0,{"$f":"Database!E22","v":0},{"$f":"Database!F22","v":0},{"$f":"Database!G22","v":0},{"$f":"Database!H22","v":0}]
["Other transformation processes (±)     ",{"$f":"Database!J23","v":0},{"$f":"Database!K23","v":0},{"$f":"Database!L23","v":0},0,0,0,0,0,{"$f":"Database!E23","v":0},{"$f":"Database!F23","v":0},{"$f":"Database!G23","v":0},{"$f":"Database!H23","v":0}]
["Own use and Losses            ",{"$f":"Database!J24","v":0},{"$f":"Database!K24","v":0},{"$f":"Database!L24","v":0},0,0,0,0,0,{"$f":"Database!E24","v":0},{"$f":"Database!F24","v":0},{"$f":"Database!G24","v":0},{"$f":"Database!H24","v":0}]
["Statistical differences (±)",{"$f":"Database!J25","v":0},{"$f":"Database!K25","v":0},{"$f":"Database!L25","v":0},0,0,0,0,0,{"$f":"Database!E25","v":0},{"$f":"Database!F25","v":0},{"$f":"Database!G25","v":0},{"$f":"Database!H25","v":0}]
["Total Final Consumption       ",{"$f":"Database!J26","v":0},{"$f":"Database!K26","v":0},{"$f":"Database!L26","v":0},{"$f":"SUM(E19,E20,E22,E24)","v":0},{"$f":"SUM(F19,F20,F22,F24)","v":0},{"$f":"SUM(G19,G20,G22,G24)","v":0},{"$f":"SUM(H19,H20,H22,H24)","v":0},{"$f":"SUM(I19,I20,I22,I24)","v":0},{"$f":"Database!E26","v":0},{"$f":"Database!F26","v":0},{"$f":"Database!G26","v":0},{"$f":"Database!H26","v":0}]
["Industry (+)",{"$f":"Database!J27","v":0},{"$f":"Database!K27","v":0},{"$f":"Database!L27","v":0},0,0,0,0,0,{"$f":"Database!E27","v":0},{"$f":"Database!F27","v":0},{"$f":"Database!G27","v":0},{"$f":"Database!H27","v":0}]
["Transport (+)",{"$f":"Database!J28","v":0},{"$f":"Database!K28","v":0},{"$f":"Database!L28","v":0},0,0,0,0,0,{"$f":"Database!E28","v":0},{"$f":"Database!F28","v":0},{"$f":"Database!G28","v":0},{"$f":"Database!H28","v":0}]
["of which: Road (+)",{"$f":"Database!J29","v":0},{"$f":"Database!K29","v":0},{"$f":"Database!L29","v":0},0,0,0,0,0,{"$f":"Database!E29","v":0},{"$f":"Database!F29","v":0},{"$f":"Database!G29","v":0},{"$f":"Database!H29","v":0}]
["Other (+)",{"$f":"Database!J30","v":0},{"$f":"Database!K30","v":0},{"$f":"Database!L30","v":0},0,0,0,0,0,{"$f":"Database!E30","v":0},{"$f":"Database!F30","v":0},{"$f":"Database!G30","v":0},{"$f":"Database!H30","v":0}]
["of which: Residential (+) ",{"$f":"Database!J31","v":0},{"$f":"Database!K31","v":0},{"$f":"Database!L31","v":0},0,0,0,0,0,{"$f":"Database!E31","v":0},{"$f":"Database!F31","v":0},{"$f":"Database!G31","v":0},{"$f":"Database!H31","v":0}]
["Non-energy use (+)",{"$f":"Database!J32","v":0},{"$f":"Database!K32","v":0},{"$f":"Database!L32","v":0},0,0,0,0,0,{"$f":"Database!E32","v":0},{"$f":"Database!F32","v":0},{"$f":"Database!G32","v":0},{"$f":"Database!H32","v":0}]
["of which: chemical/petrochemical (+)",{"$f":"Database!J33","v":0},{"$f":"Database!K33","v":0},{"$f":"Database!L33","v":0},0,0,0,0,0,{"$f":"Database!E33","v":0},{"$f":"Database!F33","v":0},{"$f":"Database!G33","v":0},{"$f":"Database!H33","v":0},null,null,null,null,{"$f":"Z6","v":"International aviation bunkers (–)"}]
["Elec. Gen. Exc. Pumped storage (TWh) (+)",{"$f":"Database!J34","v":0},{"$f":"Database!K34","v":0},{"$f":"Database!L34","v":0},0,0,0,0,0,{"$f":"Database!E34","v":0},{"$f":"Database!F34","v":0},{"$f":"Database!G34","v":0},{"$f":"Database!H34","v":0}]
["Heat generated (PJ) (+)",{"$f":"Database!J35","v":0},{"$f":"Database!K35","v":0},{"$f":"Database!L35","v":0},0,0,0,0,0,{"$f":"Database!E35","v":0},{"$f":"Database!F35","v":0},{"$f":"Database!G35","v":0},{"$f":"Database!H35","v":0}]
[null,null,null,null,{"$f":"IF(ABS(E18-SUM(E12,E13,E17))>0.002,HYPERLINK(\"#'Table 1 \"&Database!M$11&\"'!$C$32\",\"Error\"),IF(E26+E27=0, IF(E14<>0,HYPERLINK(\"#'Table 1 \"&Database!M$11&\"'!$C$32\",\"Error\"),\"\"), IF(E14=0, HYPERLINK(\"#'Table 1 \"&Database!M$11&\"'!$C$32\",\"Error\"), IF((E26*0.086+E27*0.02388)/E14*-100>Eff_Max_Coal,HYPERLINK(\"#'Table 1 \"&Database!M$11&\"'!$C$35\",\"Warning\"),IF((E26*0.086+E27*0.02388)/E14*-100<Eff_Min_Coal,HYPERLINK(\"#'Table 1 \"&Database!M$11&\"'!$C$35\",\"Warning\"),\"\")))))","v":""},{"$f":"IF(ABS(F18-SUM(F12,F13,F17))>0.002,HYPERLINK(\"#'Table 1 \"&Database!N$11&\"'!$C$32\",\"Error\"),IF(F26+F27=0, IF(F14<>0,HYPERLINK(\"#'Table 1 \"&Database!N$11&\"'!$C$32\",\"Error\"),\"\"), IF(F14=0, HYPERLINK(\"#'Table 1 \"&Database!N$11&\"'!$C$32\",\"Error\"), IF((F26*0.086+F27*0.02388)/F14*-100>Eff_Max_Coal,HYPERLINK(\"#'Table 1 \"&Database!N$11&\"'!$C$35\",\"Warning\"),IF((F26*0.086+F27*0.02388)/F14*-100<Eff_Min_Coal,HYPERLINK(\"#'Table 1 \"&Database!N$11&\"'!$C$35\",\"Warning\"),\"\")))))","v":""},{"$f":"IF(ABS(G18-SUM(G12,G13,G17))>0.002,HYPERLINK(\"#'Table 1 \"&Database!O$11&\"'!$C$32\",\"Error\"),IF(G26+G27=0, IF(G14<>0,HYPERLINK(\"#'Table 1 \"&Database!O$11&\"'!$C$32\",\"Error\"),\"\"), IF(G14=0, HYPERLINK(\"#'Table 1 \"&Database!O$11&\"'!$C$32\",\"Error\"), IF((G26*0.086+G27*0.02388)/G14*-100>Eff_Max_Coal,HYPERLINK(\"#'Table 1 \"&Database!O$11&\"'!$C$35\",\"Warning\"),IF((G26*0.086+G27*0.02388)/G14*-100<Eff_Min_Coal,HYPERLINK(\"#'Table 1 \"&Database!O$11&\"'!$C$35\",\"Warning\"),\"\")))))","v":""},{"$f":"IF(ABS(H18-SUM(H12,H13,H17))>0.002,HYPERLINK(\"#'Table 1 \"&Database!P$11&\"'!$C$32\",\"Error\"),IF(H26+H27=0, IF(H14<>0,HYPERLINK(\"#'Table 1 \"&Database!P$11&\"'!$C$32\",\"Error\"),\"\"), IF(H14=0, HYPERLINK(\"#'Table 1 \"&Database!P$11&\"'!$C$32\",\"Error\"), IF((H26*0.086+H27*0.02388)/H14*-100>Eff_Max_Coal,HYPERLINK(\"#'Table 1 \"&Database!P$11&\"'!$C$35\",\"Warning\"),IF((H26*0.086+H27*0.02388)/H14*-100<Eff_Min_Coal,HYPERLINK(\"#'Table 1 \"&Database!P$11&\"'!$C$35\",\"Warning\"),\"\")))))","v":""},{"$f":"IF(ABS(I18-SUM(I12,I13,I17))>0.002,HYPERLINK(\"#'Table 1 \"&Database!Q$11&\"'!$C$32\",\"Error\"),IF(I26+I27=0, IF(I14<>0,HYPERLINK(\"#'Table 1 \"&Database!Q$11&\"'!$C$32\",\"Error\"),\"\"), IF(I14=0, HYPERLINK(\"#'Table 1 \"&Database!Q$11&\"'!$C$32\",\"Error\"), IF((I26*0.086+I27*0.02388)/I14*-100>Eff_Max_Coal,HYPERLINK(\"#'Table 1 \"&Database!Q$11&\"'!$C$35\",\"Warning\"),IF((I26*0.086+I27*0.02388)/I14*-100<Eff_Min_Coal,HYPERLINK(\"#'Table 1 \"&Database!Q$11&\"'!$C$35\",\"Warning\"),\"\")))))","v":""}]
[]
["Peat","Historical Data",null,null,"Data Submission This Cycle",null,null,null,null,"Last Cycle Projections"]
[null,{"$f":"Database!B11","v":2016},{"$f":"Database!C11","v":2017},{"$f":"Database!D11","v":2018},{"$f":"E5","v":"2019P"},2020,2030,2040,2050,"2020.LC","2030.LC",{"$f":"L5","v":"2040.LC"},{"$f":"M5","v":"2050.LC"},null,null,null,null,null,null,null,null,null,null,null,null,1,{"$f":"B31","v":2016},{"$f":"C31","v":2017},{"$f":"D31","v":2018},{"$f":"VALUE(LEFT(E31,4))","v":2019},{"$f":"F31","v":2020},{"$f":"G31","v":2030},{"$f":"H31","v":2040},{"$f":"I31","v":2050},{"$f":"H31","v":2040},{"$f":"I31","v":2050}]
[{"$f":"A6","v":"Production (+)"},{"$f":"Database!J36","v":0},{"$f":"Database!K36","v":0},{"$f":"Database!L36","v":0},0,0,0,0,0,{"$f":"Database!E36","v":0},{"$f":"Database!F36","v":0},{"$f":"Database!G36","v":0},{"$f":"Database!H36","v":0},null,null,null,null,null,null,null,null,null,null,null,null,{"$f":"INDEX(A32:G53,$Z$31,1)","v":"Production (+)"},{"$f":"INDEX(B32:N53,$Z$31,1)","v":0},{"$f":"INDEX(C32:O53,$Z$31,1)","v":0},{"$f":"INDEX(D32:P53,$Z$31,1)","v":0},{"$f":"INDEX(E32:Q53,$Z$31,1)","v":0},{"$f":"IF(AE$3,INDEX(F32:U53,$Z$31,1),NA())","v":{"$error":"#N/A"}},{"$f":"IF(AF$3,INDEX(G32:V53,$Z$31,1),NA())","v":{"$error":"#N/A"}},{"$f":"IF(AG$3,INDEX(H32:W53,$Z$31,1),NA())","v":{"$error":"#N/A"}},{"$f":"IF(AH$3,INDEX(I32:X53,$Z$31,1),NA())","v":{"$error":"#N/A"}},{"$f":"IF(AG$3,INDEX(H32:W53,$Z$31,1),NA())","v":{"$error":"#N/A"}},{"$f":"IF(AH$3,INDEX(I32:X53,$Z$31,1),NA())","v":{"$error":"#N/A"}}]
[{"$f":"A7","v":"Imports (+)"},{"$f":"Database!J37","v":0},{"$f":"Database!K37","v":0},{"$f":"Database!L37","v":0},0,0,0,0,0,{"$f":"Database!E37","v":0},{"$f":"Database!F37","v":0},{"$f":"Database!G37","v":0},{"$f":"Database!H37","v":0}]
["Exports (–)",{"$f":"Database!J38","v":0},{"$f":"Database!K38","v":0},{"$f":"Database!L38","v":0},0,0,0,0,0,{"$f":"Database!E38","v":0},{"$f":"Database!F38","v":0},{"$f":"Database!G38","v":0},{"$f":"Database!H38","v":0}]
["International marine bunkers (–)",{"$f":"Database!J39","v":0},{"$f":"Database!K39","v":0},{"$f":"Database!L39","v":0},0,0,0,0,0,{"$f":"Database!E39","v":0},{"$f":"Database!F39","v":0},{"$f":"Database!G39","v":0},{"$f":"Database!H39","v":0}]
["International aviation bunkers (–)",{"$f":"Database!J40","v":0},{"$f":"Database!K40","v":0},{"$f":"Database!L40","v":0},0,0,0,0,0,{"$f":"Database!E40","v":0},{"$f":"Database!F40","v":0},{"$f":"Database!G40","v":0},{"$f":"Database!H40","v":0}]
["Stock changes (±)",{"$f":"Database!J41","v":0},{"$f":"Database!K41","v":0},{"$f":"Database!L41","v":0},0,0,0,0,0,{"$f":"Database!E41","v":0},{"$f":"Database!F41","v":0},{"$f":"Database!G41","v":0},{"$f":"Database!H41","v":0}]
["Total Energy Supply",{"$f":"Database!J42","v":0},{"$f":"Database!K42","v":0},{"$f":"Database!L42","v":0},{"$f":"SUM(E32:E37)","v":0},{"$f":"SUM(F32:F37)","v":0},0,0,0,{"$f":"Database!E42","v":0},{"$f":"Database!F42","v":0},{"$f":"Database!G42","v":0},{"$f":"Database!H42","v":0}]
["Transformation processes & Energy industry own use",{"$f":"Database!J43","v":0},{"$f":"Database!K43","v":0},{"$f":"Database!L43","v":0},{"$f":"SUM(E40:E42)","v":0},{"$f":"SUM(F40:F42)","v":0},0,0,0,{"$f":"Database!E43","v":0},{"$f":"Database!F43","v":0},{"$f":"Database!G43","v":0},{"$f":"Database!H43","v":0}]
["Electricity, CHP & heat plants (±)",{"$f":"Database!J44","v":0},{"$f":"Database!K44","v":0},{"$f":"Database!L44","v":0},0,0,0,0,0,{"$f":"Database!E44","v":0},{"$f":"Database!F44","v":0},{"$f":"Database!G44","v":0},{"$f":"Database!H44","v":0}]
["Other transformation processes (±)     ",{"$f":"Database!J45","v":0},{"$f":"Database!K45","v":0},{"$f":"Database!L45","v":0},0,0,0,0,0,{"$f":"Database!E45","v":0},{"$f":"Database!F45","v":0},{"$f":"Database!G45","v":0},{"$f":"Database!H45","v":0}]
["Own use and Losses            ",{"$f":"Database!J46","v":0},{"$f":"Database!K46","v":0},{"$f":"Database!L46","v":0},0,0,0,0,0,{"$f":"Database!E46","v":0},{"$f":"Database!F46","v":0},{"$f":"Database!G46","v":0},{"$f":"Database!H46","v":0}]
["Statistical differences (±)",{"$f":"Database!J47","v":0},{"$f":"Database!K47","v":0},{"$f":"Database!L47","v":0},0,0,0,0,0,{"$f":"Database!E47","v":0},{"$f":"Database!F47","v":0},{"$f":"Database!G47","v":0},{"$f":"Database!H47","v":0}]
["Total Final Consumption       ",{"$f":"Database!J48","v":0},{"$f":"Database!K48","v":0},{"$f":"Database!L48","v":0},{"$f":"SUM(E45,E46,E48,E50)","v":0},{"$f":"SUM(F45,F46,F48,F50)","v":0},0,0,0,{"$f":"Database!E48","v":0},{"$f":"Database!F48","v":0},{"$f":"Database!G48","v":0},{"$f":"Database!H48","v":0}]
["Industry (+)",{"$f":"Database!J49","v":0},{"$f":"Database!K49","v":0},{"$f":"Database!L49","v":0},0,0,0,0,0,{"$f":"Database!E49","v":0},{"$f":"Database!F49","v":0},{"$f":"Database!G49","v":0},{"$f":"Database!H49","v":0}]
["Transport (+)",{"$f":"Database!J50","v":0},{"$f":"Database!K50","v":0},{"$f":"Database!L50","v":0},0,0,0,0,0,{"$f":"Database!E50","v":0},{"$f":"Database!F50","v":0},{"$f":"Database!G50","v":0},{"$f":"Database!H50","v":0}]
["of which: Road (+)",{"$f":"Database!J51","v":0},{"$f":"Database!K51","v":0},{"$f":"Database!L51","v":0},0,0,0,0,0,{"$f":"Database!E51","v":0},{"$f":"Database!F51","v":0},{"$f":"Database!G51","v":0},{"$f":"Database!H51","v":0}]
["Other (+)",{"$f":"Database!J52","v":0},{"$f":"Database!K52","v":0},{"$f":"Database!L52","v":0},0,0,0,0,0,{"$f":"Database!E52","v":0},{"$f":"Database!F52","v":0},{"$f":"Database!G52","v":0},{"$f":"Database!H52","v":0}]
["of which: Residential (+) ",{"$f":"Database!J53","v":0},{"$f":"Database!K53","v":0},{"$f":"Database!L53","v":0},0,0,0,0,0,{"$f":"Database!E53","v":0},{"$f":"Database!F53","v":0},{"$f":"Database!G53","v":0},{"$f":"Database!H53","v":0}]
["Non-energy use (+)",{"$f":"Database!J54","v":0},{"$f":"Database!K54","v":0},{"$f":"Database!L54","v":0},0,0,0,0,0,{"$f":"Database!E54","v":0},{"$f":"Database!F54","v":0},{"$f":"Database!G54","v":0},{"$f":"Database!H54","v":0}]
["of which: chemical/petrochemical (+)",{"$f":"Database!J55","v":0},{"$f":"Database!K55","v":0},{"$f":"Database!L55","v":0},0,0,0,0,0,{"$f":"Database!E55","v":0},{"$f":"Database!F55","v":0},{"$f":"Database!G55","v":0},{"$f":"Database!H55","v":0},null,null,null,null,{"$f":"Z32","v":"Production (+)"}]
["Elec. Gen. Exc. Pumped storage (TWh) (+)",{"$f":"Database!J56","v":0},{"$f":"Database!K56","v":0},{"$f":"Database!L56","v":0},0,0,0,0,0,{"$f":"Database!E56","v":0},{"$f":"Database!F56","v":0},{"$f":"Database!G56","v":0},{"$f":"Database!H56","v":0}]
["Heat generated (PJ) (+)",{"$f":"Database!J57","v":0},{"$f":"Database!K57","v":0},{"$f":"Database!L57","v":0},0,0,0,0,0,{"$f":"Database!E57","v":0},{"$f":"Database!F57","v":0},{"$f":"Database!G57","v":0},{"$f":"Database!H57","v":0}]
[null,null,null,null,{"$f":"IF(ABS(E44-SUM(E38,E39,E43))>0.002,HYPERLINK(\"#'Table 1 \"&Database!M$11&\"'!$D$32\",\"Error\"),IF(E52+E53=0, IF(E40<>0,HYPERLINK(\"#'Table 1 \"&Database!M$11&\"'!$D$32\",\"Error\"),\"\"), IF(E40=0, HYPERLINK(\"#'Table 1 \"&Database!M$11&\"'!$D$32\",\"Error\"), IF((E52*0.086+E53*0.02388)/E40*-100>Eff_Max_Peat,HYPERLINK(\"#'Table 1 \"&Database!M$11&\"'!$D$35\",\"Warning\"),IF((E52*0.086+E53*0.02388)/E40*-100<Eff_Min_Peat,HYPERLINK(\"#'Table 1 \"&Database!M$11&\"'!$D$35\",\"Warning\"),\"\")))))","v":""},{"$f":"IF(ABS(F44-SUM(F38,F39,F43))>0.002,HYPERLINK(\"#'Table 1 \"&Database!N$11&\"'!$D$32\",\"Error\"),IF(F52+F53=0, IF(F40<>0,HYPERLINK(\"#'Table 1 \"&Database!N$11&\"'!$D$32\",\"Error\"),\"\"), IF(F40=0, HYPERLINK(\"#'Table 1 \"&Database!N$11&\"'!$D$32\",\"Error\"), IF((F52*0.086+F53*0.02388)/F40*-100>Eff_Max_Peat,HYPERLINK(\"#'Table 1 \"&Database!N$11&\"'!$D$35\",\"Warning\"),IF((F52*0.086+F53*0.02388)/F40*-100<Eff_Min_Peat,HYPERLINK(\"#'Table 1 \"&Database!N$11&\"'!$D$35\",\"Warning\"),\"\")))))","v":""},{"$f":"IF(ABS(G44-SUM(G38,G39,G43))>0.002,HYPERLINK(\"#'Table 1 \"&Database!O$11&\"'!$D$32\",\"Error\"),IF(G52+G53=0, IF(G40<>0,HYPERLINK(\"#'Table 1 \"&Database!O$11&\"'!$D$32\",\"Error\"),\"\"), IF(G40=0, HYPERLINK(\"#'Table 1 \"&Database!O$11&\"'!$D$32\",\"Error\"), IF((G52*0.086+G53*0.02388)/G40*-100>Eff_Max_Peat,HYPERLINK(\"#'Table 1 \"&Database!O$11&\"'!$D$35\",\"Warning\"),IF((G52*0.086+G53*0.02388)/G40*-100<Eff_Min_Peat,HYPERLINK(\"#'Table 1 \"&Database!O$11&\"'!$D$35\",\"Warning\"),\"\")))))","v":""},{"$f":"IF(ABS(H44-SUM(H38,H39,H43))>0.002,HYPERLINK(\"#'Table 1 \"&Database!P$11&\"'!$D$32\",\"Error\"),IF(H52+H53=0, IF(H40<>0,HYPERLINK(\"#'Table 1 \"&Database!P$11&\"'!$D$32\",\"Error\"),\"\"), IF(H40=0, HYPERLINK(\"#'Table 1 \"&Database!P$11&\"'!$D$32\",\"Error\"), IF((H52*0.086+H53*0.02388)/H40*-100>Eff_Max_Peat,HYPERLINK(\"#'Table 1 \"&Database!P$11&\"'!$D$35\",\"Warning\"),IF((H52*0.086+H53*0.02388)/H40*-100<Eff_Min_Peat,HYPERLINK(\"#'Table 1 \"&Database!P$11&\"'!$D$35\",\"Warning\"),\"\")))))","v":""},{"$f":"IF(ABS(I44-SUM(I38,I39,I43))>0.002,HYPERLINK(\"#'Table 1 \"&Database!Q$11&\"'!$D$32\",\"Error\"),IF(I52+I53=0, IF(I40<>0,HYPERLINK(\"#'Table 1 \"&Database!Q$11&\"'!$D$32\",\"Error\"),\"\"), IF(I40=0, HYPERLINK(\"#'Table 1 \"&Database!Q$11&\"'!$D$32\",\"Error\"), IF((I52*0.086+I53*0.02388)/I40*-100>Eff_Max_Peat,HYPERLINK(\"#'Table 1 \"&Database!Q$11&\"'!$D$35\",\"Warning\"),IF((I52*0.086+I53*0.02388)/I40*-100<Eff_Min_Peat,HYPERLINK(\"#'Table 1 \"&Database!Q$11&\"'!$D$35\",\"Warning\"),\"\")))))","v":""}]
[]
["Oil ","Historical Data",null,null,"Data Submission This Cycle",null,null,null,null,"Last Cycle Projections"]
[null,{"$f":"Database!B11","v":2016},{"$f":"Database!C11","v":2017},{"$f":"Database!D11","v":2018},{"$f":"E5","v":"2019P"},2020,2030,2040,2050,"2020.LC","2030.LC",{"$f":"L5","v":"2040.LC"},{"$f":"M5","v":"2050.LC"},null,null,null,null,null,null,null,null,null,null,null,null,1,{"$f":"B57","v":2016},{"$f":"C57","v":2017},{"$f":"D57","v":2018},{"$f":"VALUE(LEFT(E57,4))","v":2019},{"$f":"F57","v":2020},{"$f":"G57","v":2030},{"$f":"H57","v":2040},{"$f":"I57","v":2050},{"$f":"H57","v":2040},{"$f":"I57","v":2050}]
[{"$f":"A6","v":"Production (+)"},{"$f":"Database!J58","v":0},{"$f":"Database!K58","v":0},{"$f":"Database!L58","v":0},0,0,0,0,0,{"$f":"Database!E58","v":0},{"$f":"Database!F58","v":0},{"$f":"Database!G58","v":0},{"$f":"Database!H58","v":0},null,null,null,null,null,null,null,null,null,null,null,null,{"$f":"INDEX(A58:G79,$Z$57,1)","v":"Production (+)"},{"$f":"INDEX(B58:N79,$Z$57,1)","v":0},{"$f":"INDEX(C58:O79,$Z$57,1)","v":0},{"$f":"INDEX(D58:P79,$Z$57,1)","v":0},{"$f":"INDEX(E58:Q79,$Z$57,1)","v":0},{"$f":"IF(AE$3,INDEX(F58:U79,$Z$57,1),NA())","v":{"$error":"#N/A"}},{"$f":"IF(AF$3,INDEX(G58:V79,$Z$57,1),NA())","v":{"$error":"#N/A"}},{"$f":"IF(AG$3,INDEX(H58:W79,$Z$57,1),NA())","v":{"$error":"#N/A"}},{"$f":"IF(AH$3,INDEX(I58:X79,$Z$57,1),NA())","v":{"$error":"#N/A"}},{"$f":"IF(AG$3,INDEX(H58:W79,$Z$57,1),NA())","v":{"$error":"#N/A"}},{"$f":"IF(AH$3,INDEX(I58:X79,$Z$57,1),NA())","v":{"$error":"#N/A"}}]
[{"$f":"A7","v":"Imports (+)"},{"$f":"Database!J59","v":0},{"$f":"Database!K59","v":0},{"$f":"Database!L59","v":0},0,0,0,0,0,{"$f":"Database!E59","v":0},{"$f":"Database!F59","v":0},{"$f":"Database!G59","v":0},{"$f":"Database!H59","v":0}]
["Exports (–)",{"$f":"Database!J60","v":0},{"$f":"Database!K60","v":0},{"$f":"Database!L60","v":0},0,0,0,0,0,{"$f":"Database!E60","v":0},{"$f":"Database!F60","v":0},{"$f":"Database!G60","v":0},{"$f":"Database!H60","v":0}]
["International marine bunkers (–)",{"$f":"Database!J61","v":0},{"$f":"Database!K61","v":0},{"$f":"Database!L61","v":0},0,0,0,0,0,{"$f":"Database!E61","v":0},{"$f":"Database!F61","v":0},{"$f":"Database!G61","v":0},{"$f":"Database!H61","v":0}]
["International aviation bunkers (–)",{"$f":"Database!J62","v":0},{"$f":"Database!K62","v":0},{"$f":"Database!L62","v":0},0,0,0,0,0,{"$f":"Database!E62","v":0},{"$f":"Database!F62","v":0},{"$f":"Database!G62","v":0},{"$f":"Database!H62","v":0}]
["Stock changes (±)",{"$f":"Database!J63","v":0},{"$f":"Database!K63","v":0},{"$f":"Database!L63","v":0},0,0,0,0,0,{"$f":"Database!E63","v":0},{"$f":"Database!F63","v":0},{"$f":"Database!G63","v":0},{"$f":"Database!H63","v":0}]
["Total Energy Supply",{"$f":"Database!J64","v":0},{"$f":"Database!K64","v":0},{"$f":"Database!L64","v":0},{"$f":"SUM(E58:E63)","v":0},{"$f":"SUM(F58:F63)","v":0},0,0,0,{"$f":"Database!E64","v":0},{"$f":"Database!F64","v":0},{"$f":"Database!G64","v":0},{"$f":"Database!H64","v":0}]
["Transformation processes & Energy industry own use",{"$f":"Database!J65","v":0},{"$f":"Database!K65","v":0},{"$f":"Database!L65","v":0},{"$f":"SUM(E66:E68)","v":0},{"$f":"SUM(F66:F68)","v":0},0,0,0,{"$f":"Database!E65","v":0},{"$f":"Database!F65","v":0},{"$f":"Database!G65","v":0},{"$f":"Database!H65","v":0}]
["Electricity, CHP & heat plants (±)",{"$f":"Database!J66","v":0},{"$f":"Database!K66","v":0},{"$f":"Database!L66","v":0},0,0,0,0,0,{"$f":"Database!E66","v":0},{"$f":"Database!F66","v":0},{"$f":"Database!G66","v":0},{"$f":"Database!H66","v":0}]
["Other transformation processes (±)     ",{"$f":"Database!J67","v":0},{"$f":"Database!K67","v":0},{"$f":"Database!L67","v":0},0,0,0,0,0,{"$f":"Database!E67","v":0},{"$f":"Database!F67","v":0},{"$f":"Database!G67","v":0},{"$f":"Database!H67","v":0}]
["Own use and Losses            ",{"$f":"Database!J68","v":0},{"$f":"Database!K68","v":0},{"$f":"Database!L68","v":0},0,0,0,0,0,{"$f":"Database!E68","v":0},{"$f":"Database!F68","v":0},{"$f":"Database!G68","v":0},{"$f":"Database!H68","v":0}]
["Statistical differences (±)",{"$f":"Database!J69","v":0},{"$f":"Database!K69","v":0},{"$f":"Database!L69","v":0},0,0,0,0,0,{"$f":"Database!E69","v":0},{"$f":"Database!F69","v":0},{"$f":"Database!G69","v":0},{"$f":"Database!H69","v":0}]
["Total Final Consumption       ",{"$f":"Database!J70","v":0},{"$f":"Database!K70","v":0},{"$f":"Database!L70","v":0},{"$f":"SUM(E71,E72,E74,E76)","v":0},{"$f":"SUM(F71,F72,F74,F76)","v":0},0,0,0,{"$f":"Database!E70","v":0},{"$f":"Database!F70","v":0},{"$f":"Database!G70","v":0},{"$f":"Database!H70","v":0}]
["Industry (+)",{"$f":"Database!J71","v":0},{"$f":"Database!K71","v":0},{"$f":"Database!L71","v":0},0,0,0,0,0,{"$f":"Database!E71","v":0},{"$f":"Database!F71","v":0},{"$f":"Database!G71","v":0},{"$f":"Database!H71","v":0}]
["Transport (+)",{"$f":"Database!J72","v":0},{"$f":"Database!K72","v":0},{"$f":"Database!L72","v":0},0,0,0,0,0,{"$f":"Database!E72","v":0},{"$f":"Database!F72","v":0},{"$f":"Database!G72","v":0},{"$f":"Database!H72","v":0}]
["of which: Road (+)",{"$f":"Database!J73","v":0},{"$f":"Database!K73","v":0},{"$f":"Database!L73","v":0},0,0,0,0,0,{"$f":"Database!E73","v":0},{"$f":"Database!F73","v":0},{"$f":"Database!G73","v":0},{"$f":"Database!H73","v":0}]
["Other (+)",{"$f":"Database!J74","v":0},{"$f":"Database!K74","v":0},{"$f":"Database!L74","v":0},0,0,0,0,0,{"$f":"Database!E74","v":0},{"$f":"Database!F74","v":0},{"$f":"Database!G74","v":0},{"$f":"Database!H74","v":0}]
["of which: Residential (+) ",{"$f":"Database!J75","v":0},{"$f":"Database!K75","v":0},{"$f":"Database!L75","v":0},0,0,0,0,0,{"$f":"Database!E75","v":0},{"$f":"Database!F75","v":0},{"$f":"Database!G75","v":0},{"$f":"Database!H75","v":0}]
["Non-energy use (+)",{"$f":"Database!J76","v":0},{"$f":"Database!K76","v":0},{"$f":"Database!L76","v":0},0,0,0,0,0,{"$f":"Database!E76","v":0},{"$f":"Database!F76","v":0},{"$f":"Database!G76","v":0},{"$f":"Database!H76","v":0}]
["of which: chemical/petrochemical (+)",{"$f":"Database!J77","v":0},{"$f":"Database!K77","v":0},{"$f":"Database!L77","v":0},0,0,0,0,0,{"$f":"Database!E77","v":0},{"$f":"Database!F77","v":0},{"$f":"Database!G77","v":0},{"$f":"Database!H77","v":0},null,null,null,null,{"$f":"Z58","v":"Production (+)"}]
["Elec. Gen. Exc. Pumped storage (TWh) (+)",{"$f":"Database!J78","v":0},{"$f":"Database!K78","v":0},{"$f":"Database!L78","v":0},0,0,0,0,0,{"$f":"Database!E78","v":0},{"$f":"Database!F78","v":0},{"$f":"Database!G78","v":0},{"$f":"Database!H78","v":0}]
["Heat generated (PJ) (+)",{"$f":"Database!J79","v":0},{"$f":"Database!K79","v":0},{"$f":"Database!L79","v":0},0,0,0,0,0,{"$f":"Database!E79","v":0},{"$f":"Database!F79","v":0},{"$f":"Database!G79","v":0},{"$f":"Database!H79","v":0}]
[null,null,null,null,{"$f":"IF(ABS(E70-SUM(E64,E65,E69))>0.002,HYPERLINK(\"#'Table 1 \"&Database!M$11&\"'!$E$32\",\"Error\"),IF(E78+E79=0, IF(E66<>0,HYPERLINK(\"#'Table 1 \"&Database!M$11&\"'!$E$32\",\"Error\"),\"\"), IF(E66=0, HYPERLINK(\"#'Table 1 \"&Database!M$11&\"'!$E$32\",\"Error\"), IF((E78*0.086+E79*0.02388)/E66*-100>Eff_Max_Oil,HYPERLINK(\"#'Table 1 \"&Database!M$11&\"'!$E$35\",\"Warning\"),IF((E78*0.086+E79*0.02388)/E66*-100<Eff_Min_Oil,HYPERLINK(\"#'Table 1 \"&Database!M$11&\"'!$E$35\",\"Warning\"),\"\")))))","v":""},{"$f":"IF(ABS(F70-SUM(F64,F65,F69))>0.002,HYPERLINK(\"#'Table 1 \"&Database!N$11&\"'!$E$32\",\"Error\"),IF(F78+F79=0, IF(F66<>0,HYPERLINK(\"#'Table 1 \"&Database!N$11&\"'!$E$32\",\"Error\"),\"\"), IF(F66=0, HYPERLINK(\"#'Table 1 \"&Database!N$11&\"'!$E$32\",\"Error\"), IF((F78*0.086+F79*0.02388)/F66*-100>Eff_Max_Oil,HYPERLINK(\"#'Table 1 \"&Database!N$11&\"'!$E$35\",\"Warning\"),IF((F78*0.086+F79*0.02388)/F66*-100<Eff_Min_Oil,HYPERLINK(\"#'Table 1 \"&Database!N$11&\"'!$E$35\",\"Warning\"),\"\")))))","v":""},{"$f":"IF(ABS(G70-SUM(G64,G65,G69))>0.002,HYPERLINK(\"#'Table 1 \"&Database!O$11&\"'!$E$32\",\"Error\"),IF(G78+G79=0, IF(G66<>0,HYPERLINK(\"#'Table 1 \"&Database!O$11&\"'!$E$32\",\"Error\"),\"\"), IF(G66=0, HYPERLINK(\"#'Table 1 \"&Database!O$11&\"'!$E$32\",\"Error\"), IF((G78*0.086+G79*0.02388)/G66*-100>Eff_Max_Oil,HYPERLINK(\"#'Table 1 \"&Database!O$11&\"'!$E$35\",\"Warning\"),IF((G78*0.086+G79*0.02388)/G66*-100<Eff_Min_Oil,HYPERLINK(\"#'Table 1 \"&Database!O$11&\"'!$E$35\",\"Warning\"),\"\")))))","v":""},{"$f":"IF(ABS(H70-SUM(H64,H65,H69))>0.002,HYPERLINK(\"#'Table 1 \"&Database!P$11&\"'!$E$32\",\"Error\"),IF(H78+H79=0, IF(H66<>0,HYPERLINK(\"#'Table 1 \"&Database!P$11&\"'!$E$32\",\"Error\"),\"\"), IF(H66=0, HYPERLINK(\"#'Table 1 \"&Database!P$11&\"'!$E$32\",\"Error\"), IF((H78*0.086+H79*0.02388)/H66*-100>Eff_Max_Oil,HYPERLINK(\"#'Table 1 \"&Database!P$11&\"'!$E$35\",\"Warning\"),IF((H78*0.086+H79*0.02388)/H66*-100<Eff_Min_Oil,HYPERLINK(\"#'Table 1 \"&Database!P$11&\"'!$E$35\",\"Warning\"),\"\")))))","v":""},{"$f":"IF(ABS(I70-SUM(I64,I65,I69))>0.002,HYPERLINK(\"#'Table 1 \"&Database!Q$11&\"'!$E$32\",\"Error\"),IF(I78+I79=0, IF(I66<>0,HYPERLINK(\"#'Table 1 \"&Database!Q$11&\"'!$E$32\",\"Error\"),\"\"), IF(I66=0, HYPERLINK(\"#'Table 1 \"&Database!Q$11&\"'!$E$32\",\"Error\"), IF((I78*0.086+I79*0.02388)/I66*-100>Eff_Max_Oil,HYPERLINK(\"#'Table 1 \"&Database!Q$11&\"'!$E$35\",\"Warning\"),IF((I78*0.086+I79*0.02388)/I66*-100<Eff_Min_Oil,HYPERLINK(\"#'Table 1 \"&Database!Q$11&\"'!$E$35\",\"Warning\"),\"\")))))","v":""}]
[]
["Natural gas","Historical Data",null,null,"Data Submission This Cycle",null,null,null,null,"Last Cycle Projections"]
[null,{"$f":"Database!B11","v":2016},{"$f":"Database!C11","v":2017},{"$f":"Database!D11","v":2018},{"$f":"E5","v":"2019P"},2020,2030,2040,2050,"2020.LC","2030.LC",{"$f":"L5","v":"2040.LC"},{"$f":"M5","v":"2050.LC"},null,null,null,null,null,null,null,null,null,null,null,null,1,{"$f":"B83","v":2016},{"$f":"C83","v":2017},{"$f":"D83","v":2018},{"$f":"VALUE(LEFT(E83,4))","v":2019},{"$f":"F83","v":2020},{"$f":"G83","v":2030},{"$f":"H83","v":2040},{"$f":"I83","v":2050},{"$f":"H83","v":2040},{"$f":"I83","v":2050}]
[{"$f":"A6","v":"Production (+)"},{"$f":"Database!J80","v":0},{"$f":"Database!K80","v":0},{"$f":"Database!L80","v":0},0,0,0,0,0,{"$f":"Database!E80","v":0},{"$f":"Database!F80","v":0},{"$f":"Database!G80","v":0},{"$f":"Database!H80","v":0},null,null,null,null,null,null,null,null,null,null,null,null,{"$f":"INDEX(A84:G105,$Z$83,1)","v":"Production (+)"},{"$f":"INDEX(B84:N105,$Z$83,1)","v":0},{"$f":"INDEX(C84:O105,$Z$83,1)","v":0},{"$f":"INDEX(D84:P105,$Z$83,1)","v":0},{"$f":"INDEX(E84:Q105,$Z$83,1)","v":0},{"$f":"IF(AE$3,INDEX(F84:U105,$Z$83,1),NA())","v":{"$error":"#N/A"}},{"$f":"IF(AF$3,INDEX(G84:V105,$Z$83,1),NA())","v":{"$error":"#N/A"}},{"$f":"IF(AG$3,INDEX(H84:W105,$Z$83,1),NA())","v":{"$error":"#N/A"}},{"$f":"IF(AH$3,INDEX(I84:X105,$Z$83,1),NA())","v":{"$error":"#N/A"}},{"$f":"IF(AG$3,INDEX(H84:W105,$Z$83,1),NA())","v":{"$error":"#N/A"}},{"$f":"IF(AH$3,INDEX(I84:X105,$Z$83,1),NA())","v":{"$error":"#N/A"}}]
[{"$f":"A7","v":"Imports (+)"},{"$f":"Database!J81","v":0},{"$f":"Database!K81","v":0},{"$f":"Database!L81","v":0},0,0,0,0,0,{"$f":"Database!E81","v":0},{"$f":"Database!F81","v":0},{"$f":"Database!G81","v":0},{"$f":"Database!H81","v":0}]
["Exports (–)",{"$f":"Database!J82","v":0},{"$f":"Database!K82","v":0},{"$f":"Database!L82","v":0},0,0,0,0,0,{"$f":"Database!E82","v":0},{"$f":"Database!F82","v":0},{"$f":"Database!G82","v":0},{"$f":"Database!H82","v":0}]
["International marine bunkers (–)",{"$f":"Database!J83","v":0},{"$f":"Database!K83","v":0},{"$f":"Database!L83","v":0},0,0,0,0,0,{"$f":"Database!E83","v":0},{"$f":"Database!F83","v":0},{"$f":"Database!G83","v":0},{"$f":"Database!H83","v":0}]
["International aviation bunkers (–)",{"$f":"Database!J84","v":0},{"$f":"Database!K84","v":0},{"$f":"Database!L84","v":0},0,0,0,0,0,{"$f":"Database!E84","v":0},{"$f":"Database!F84","v":0},{"$f":"Database!G84","v":0},{"$f":"Database!H84","v":0}]
["Stock changes (±)",{"$f":"Database!J85","v":0},{"$f":"Database!K85","v":0},{"$f":"Database!L85","v":0},0,0,0,0,0,{"$f":"Database!E85","v":0},{"$f":"Database!F85","v":0},{"$f":"Database!G85","v":0},{"$f":"Database!H85","v":0}]
["Total Energy Supply",{"$f":"Database!J86","v":0},{"$f":"Database!K86","v":0},{"$f":"Database!L86","v":0},{"$f":"SUM(E84:E89)","v":0},{"$f":"SUM(F84:F89)","v":0},0,0,0,{"$f":"Database!E86","v":0},{"$f":"Database!F86","v":0},{"$f":"Database!G86","v":0},{"$f":"Database!H86","v":0}]
["Transformation processes & Energy industry own use",{"$f":"Database!J87","v":0},{"$f":"Database!K87","v":0},{"$f":"Database!L87","v":0},{"$f":"SUM(E92:E94)","v":0},{"$f":"SUM(F92:F94)","v":0},0,0,0,{"$f":"Database!E87","v":0},{"$f":"Database!F87","v":0},{"$f":"Database!G87","v":0},{"$f":"Database!H87","v":0}]
["Electricity, CHP & heat plants (±)",{"$f":"Database!J88","v":0},{"$f":"Database!K88","v":0},{"$f":"Database!L88","v":0},0,0,0,0,0,{"$f":"Database!E88","v":0},{"$f":"Database!F88","v":0},{"$f":"Database!G88","v":0},{"$f":"Database!H88","v":0}]
["Other transformation processes (±)     ",{"$f":"Database!J89","v":0},{"$f":"Database!K89","v":0},{"$f":"Database!L89","v":0},0,0,0,0,0,{"$f":"Database!E89","v":0},{"$f":"Database!F89","v":0},{"$f":"Database!G89","v":0},{"$f":"Database!H89","v":0}]
["Own use and Losses            ",{"$f":"Database!J90","v":0},{"$f":"Database!K90","v":0},{"$f":"Database!L90","v":0},0,0,0,0,0,{"$f":"Database!E90","v":0},{"$f":"Database!F90","v":0},{"$f":"Database!G90","v":0},{"$f":"Database!H90","v":0}]
["Statistical differences (±)",{"$f":"Database!J91","v":0},{"$f":"Database!K91","v":0},{"$f":"Database!L91","v":0},0,0,0,0,0,{"$f":"Database!E91","v":0},{"$f":"Database!F91","v":0},{"$f":"Database!G91","v":0},{"$f":"Database!H91","v":0}]
["Total Final Consumption       ",{"$f":"Database!J92","v":0},{"$f":"Database!K92","v":0},{"$f":"Database!L92","v":0},{"$f":"SUM(E97,E98,E100,E102)","v":0},{"$f":"SUM(F97,F98,F100,F102)","v":0},0,0,0,{"$f":"Database!E92","v":0},{"$f":"Database!F92","v":0},{"$f":"Database!G92","v":0},{"$f":"Database!H92","v":0}]
["Industry (+)",{"$f":"Database!J93","v":0},{"$f":"Database!K93","v":0},{"$f":"Database!L93","v":0},0,0,0,0,0,{"$f":"Database!E93","v":0},{"$f":"Database!F93","v":0},{"$f":"Database!G93","v":0},{"$f":"Database!H93","v":0}]
["Transport (+)",{"$f":"Database!J94","v":0},{"$f":"Database!K94","v":0},{"$f":"Database!L94","v":0},0,0,0,0,0,{"$f":"Database!E94","v":0},{"$f":"Database!F94","v":0},{"$f":"Database!G94","v":0},{"$f":"Database!H94","v":0}]
["of which: Road (+)",{"$f":"Database!J95","v":0},{"$f":"Database!K95","v":0},{"$f":"Database!L95","v":0},0,0,0,0,0,{"$f":"Database!E95","v":0},{"$f":"Database!F95","v":0},{"$f":"Database!G95","v":0},{"$f":"Database!H95","v":0}]
["Other (+)",{"$f":"Database!J96","v":0},{"$f":"Database!K96","v":0},{"$f":"Database!L96","v":0},0,0,0,0,0,{"$f":"Database!E96","v":0},{"$f":"Database!F96","v":0},{"$f":"Database!G96","v":0},{"$f":"Database!H96","v":0}]
["of which: Residential (+) ",{"$f":"Database!J97","v":0},{"$f":"Database!K97","v":0},{"$f":"Database!L97","v":0},0,0,0,0,0,{"$f":"Database!E97","v":0},{"$f":"Database!F97","v":0},{"$f":"Database!G97","v":0},{"$f":"Database!H97","v":0}]
["Non-energy use (+)",{"$f":"Database!J98","v":0},{"$f":"Database!K98","v":0},{"$f":"Database!L98","v":0},0,0,0,0,0,{"$f":"Database!E98","v":0},{"$f":"Database!F98","v":0},{"$f":"Database!G98","v":0},{"$f":"Database!H98","v":0},null,null,null,null,{"$f":"Z84","v":"Production (+)"}]
["of which: chemical/petrochemical (+)",{"$f":"Database!J99","v":0},{"$f":"Database!K99","v":0},{"$f":"Database!L99","v":0},0,0,0,0,0,{"$f":"Database!E99","v":0},{"$f":"Database!F99","v":0},{"$f":"Database!G99","v":0},{"$f":"Database!H99","v":0}]
["Elec. Gen. Exc. Pumped storage (TWh) (+)",{"$f":"Database!J100","v":0},{"$f":"Database!K100","v":0},{"$f":"Database!L100","v":0},0,0,0,0,0,{"$f":"Database!E100","v":0},{"$f":"Database!F100","v":0},{"$f":"Database!G100","v":0},{"$f":"Database!H100","v":0}]
["Heat generated (PJ) (+)",{"$f":"Database!J101","v":0},{"$f":"Database!K101","v":0},{"$f":"Database!L101","v":0},0,0,0,0,0,{"$f":"Database!E101","v":0},{"$f":"Database!F101","v":0},{"$f":"Database!G101","v":0},{"$f":"Database!H101","v":0}]
[null,null,null,null,{"$f":"IF(ABS(E96-SUM(E90,E91,E95))>0.002,HYPERLINK(\"#'Table 1 \"&Database!M$11&\"'!$F$32\",\"Error\"),IF(E104+E105=0, IF(E92<>0,HYPERLINK(\"#'Table 1 \"&Database!M$11&\"'!$F$32\",\"Error\"),\"\"), IF(E92=0, HYPERLINK(\"#'Table 1 \"&Database!M$11&\"'!$F$32\",\"Error\"), IF((E104*0.086+E105*0.02388)/E92*-100>Eff_Max_Gas,HYPERLINK(\"#'Table 1 \"&Database!M$11&\"'!$F$35\",\"Warning\"),IF((E104*0.086+E105*0.02388)/E92*-100<Eff_Min_Gas,HYPERLINK(\"#'Table 1 \"&Database!M$11&\"'!$F$35\",\"Warning\"),\"\")))))","v":""},{"$f":"IF(ABS(F96-SUM(F90,F91,F95))>0.002,HYPERLINK(\"#'Table 1 \"&Database!N$11&\"'!$F$32\",\"Error\"),IF(F104+F105=0, IF(F92<>0,HYPERLINK(\"#'Table 1 \"&Database!N$11&\"'!$F$32\",\"Error\"),\"\"), IF(F92=0, HYPERLINK(\"#'Table 1 \"&Database!N$11&\"'!$F$32\",\"Error\"), IF((F104*0.086+F105*0.02388)/F92*-100>Eff_Max_Gas,HYPERLINK(\"#'Table 1 \"&Database!N$11&\"'!$F$35\",\"Warning\"),IF((F104*0.086+F105*0.02388)/F92*-100<Eff_Min_Gas,HYPERLINK(\"#'Table 1 \"&Database!N$11&\"'!$F$35\",\"Warning\"),\"\")))))","v":""},{"$f":"IF(ABS(G96-SUM(G90,G91,G95))>0.002,HYPERLINK(\"#'Table 1 \"&Database!O$11&\"'!$F$32\",\"Error\"),IF(G104+G105=0, IF(G92<>0,HYPERLINK(\"#'Table 1 \"&Database!O$11&\"'!$F$32\",\"Error\"),\"\"), IF(G92=0, HYPERLINK(\"#'Table 1 \"&Database!O$11&\"'!$F$32\",\"Error\"), IF((G104*0.086+G105*0.02388)/G92*-100>Eff_Max_Gas,HYPERLINK(\"#'Table 1 \"&Database!O$11&\"'!$F$35\",\"Warning\"),IF((G104*0.086+G105*0.02388)/G92*-100<Eff_Min_Gas,HYPERLINK(\"#'Table 1 \"&Database!O$11&\"'!$F$35\",\"Warning\"),\"\")))))","v":""},{"$f":"IF(ABS(H96-SUM(H90,H91,H95))>0.002,HYPERLINK(\"#'Table 1 \"&Database!P$11&\"'!$F$32\",\"Error\"),IF(H104+H105=0, IF(H92<>0,HYPERLINK(\"#'Table 1 \"&Database!P$11&\"'!$F$32\",\"Error\"),\"\"), IF(H92=0, HYPERLINK(\"#'Table 1 \"&Database!P$11&\"'!$F$32\",\"Error\"), IF((H104*0.086+H105*0.02388)/H92*-100>Eff_Max_Gas,HYPERLINK(\"#'Table 1 \"&Database!P$11&\"'!$F$35\",\"Warning\"),IF((H104*0.086+H105*0.02388)/H92*-100<Eff_Min_Gas,HYPERLINK(\"#'Table 1 \"&Database!P$11&\"'!$F$35\",\"Warning\"),\"\")))))","v":""},{"$f":"IF(ABS(I96-SUM(I90,I91,I95))>0.002,HYPERLINK(\"#'Table 1 \"&Database!Q$11&\"'!$F$32\",\"Error\"),IF(I104+I105=0, IF(I92<>0,HYPERLINK(\"#'Table 1 \"&Database!Q$11&\"'!$F$32\",\"Error\"),\"\"), IF(I92=0, HYPERLINK(\"#'Table 1 \"&Database!Q$11&\"'!$F$32\",\"Error\"), IF((I104*0.086+I105*0.02388)/I92*-100>Eff_Max_Gas,HYPERLINK(\"#'Table 1 \"&Database!Q$11&\"'!$F$35\",\"Warning\"),IF((I104*0.086+I105*0.02388)/I92*-100<Eff_Min_Gas,HYPERLINK(\"#'Table 1 \"&Database!Q$11&\"'!$F$35\",\"Warning\"),\"\")))))","v":""}]
[]
["Nuclear","Historical Data",null,null,"Data Submission This Cycle",null,null,null,null,"Last Cycle Projections"]
[null,{"$f":"Database!B11","v":2016},{"$f":"Database!C11","v":2017},{"$f":"Database!D11","v":2018},{"$f":"E5","v":"2019P"},2020,2030,2040,2050,"2020.LC","2030.LC",{"$f":"L5","v":"2040.LC"},{"$f":"M5","v":"2050.LC"},null,null,null,null,null,null,null,null,null,null,null,null,1,{"$f":"B109","v":2016},{"$f":"C109","v":2017},{"$f":"D109","v":2018},{"$f":"VALUE(LEFT(E109,4))","v":2019},{"$f":"F109","v":2020},{"$f":"G109","v":2030},{"$f":"H109","v":2040},{"$f":"I109","v":2050},{"$f":"H109","v":2040},{"$f":"I109","v":2050}]
[{"$f":"A6","v":"Production (+)"},{"$f":"Database!J102","v":0},{"$f":"Database!K102","v":0},{"$f":"Database!L102","v":0},0,0,0,0,0,{"$f":"Database!E102","v":0},{"$f":"Database!F102","v":0},{"$f":"Database!G102","v":0},{"$f":"Database!H102","v":0},null,null,null,null,null,null,null,null,null,null,null,null,{"$f":"INDEX(A110:G131,$Z$116,1)","v":"Production (+)"},{"$f":"INDEX(B110:N131,$Z$116,1)","v":0},{"$f":"INDEX(C110:O131,$Z$116,1)","v":0},{"$f":"INDEX(D110:P131,$Z$116,1)","v":0},{"$f":"INDEX(E110:Q131,$Z$116,1)","v":0},{"$f":"IF(AE$3,INDEX(F110:U131,$Z$116,1),NA())","v":{"$error":"#N/A"}},{"$f":"IF(AF$3,INDEX(G110:V131,$Z$116,1),NA())","v":{"$error":"#N/A"}},{"$f":"IF(AG$3,INDEX(H110:W131,$Z$116,1),NA())","v":{"$error":"#N/A"}},{"$f":"IF(AH$3,INDEX(I110:X131,$Z$116,1),NA())","v":{"$error":"#N/A"}},{"$f":"IF(AG$3,INDEX(H110:W131,$Z$116,1),NA())","v":{"$error":"#N/A"}},{"$f":"IF(AH$3,INDEX(I110:X131,$Z$116,1),NA())","v":{"$error":"#N/A"}}]
["Imports (+)",{"$f":"Database!J103","v":0},{"$f":"Database!K103","v":0},{"$f":"Database!L103","v":0},0,0,0,0,0,{"$f":"Database!E103","v":0},{"$f":"Database!F103","v":0},{"$f":"Database!G103","v":0},{"$f":"Database!H103","v":0}]
["Exports (–)",{"$f":"Database!J104","v":0},{"$f":"Database!K104","v":0},{"$f":"Database!L104","v":0},0,0,0,0,0,{"$f":"Database!E104","v":0},{"$f":"Database!F104","v":0},{"$f":"Database!G104","v":0},{"$f":"Database!H104","v":0}]
["International marine bunkers (–)",{"$f":"Database!J105","v":0},{"$f":"Database!K105","v":0},{"$f":"Database!L105","v":0},0,0,0,0,0,{"$f":"Database!E105","v":0},{"$f":"Database!F105","v":0},{"$f":"Database!G105","v":0},{"$f":"Database!H105","v":0}]
["International aviation bunkers (–)",{"$f":"Database!J106","v":0},{"$f":"Database!K106","v":0},{"$f":"Database!L106","v":0},0,0,0,0,0,{"$f":"Database!E106","v":0},{"$f":"Database!F106","v":0},{"$f":"Database!G106","v":0},{"$f":"Database!H106","v":0}]
["Stock changes (±)",{"$f":"Database!J107","v":0},{"$f":"Database!K107","v":0},{"$f":"Database!L107","v":0},0,0,0,0,0,{"$f":"Database!E107","v":0},{"$f":"Database!F107","v":0},{"$f":"Database!G107","v":0},{"$f":"Database!H107","v":0}]
["Total Energy Supply",{"$f":"Database!J108","v":0},{"$f":"Database!K108","v":0},{"$f":"Database!L108","v":0},{"$f":"SUM(E110:E115)","v":0},{"$f":"SUM(F110:F115)","v":0},0,0,0,{"$f":"Database!E108","v":0},{"$f":"Database!F108","v":0},{"$f":"Database!G108","v":0},{"$f":"Database!H108","v":0},null,null,null,null,null,null,null,null,null,null,null,null,{"$f":"INDEX(Z118:AE118,Z109)","v":1}]
["Transformation processes & Energy industry own use",{"$f":"Database!J109","v":0},{"$f":"Database!K109","v":0},{"$f":"Database!L109","v":0},{"$f":"SUM(E118:E120)","v":0},{"$f":"SUM(F118:F120)","v":0},0,0,0,{"$f":"Database!E109","v":0},{"$f":"Database!F109","v":0},{"$f":"Database!G109","v":0},{"$f":"Database!H109","v":0},null,null,null,null,null,null,null,null,null,null,null,null,1,2,3,4,5,6]
["Electricity, CHP & heat plants (±)",{"$f":"Database!J110","v":0},{"$f":"Database!K110","v":0},{"$f":"Database!L110","v":0},0,0,0,0,0,{"$f":"Database!E110","v":0},{"$f":"Database!F110","v":0},{"$f":"Database!G110","v":0},{"$f":"Database!H110","v":0},null,null,null,null,null,null,null,null,null,null,null,null,1,7,8,9,21,22]
[{"$f":"A15","v":"Other transformation processes (±)     "},{"$f":"Database!J111","v":0},{"$f":"Database!K111","v":0},{"$f":"Database!L111","v":0},0,0,0,0,0,{"$f":"Database!E111","v":0},{"$f":"Database!F111","v":0},{"$f":"Database!G111","v":0},{"$f":"Database!H111","v":0}]
["Own use and Losses            ",{"$f":"Database!J112","v":0},{"$f":"Database!K112","v":0},{"$f":"Database!L112","v":0},0,0,0,0,0,{"$f":"Database!E112","v":0},{"$f":"Database!F112","v":0},{"$f":"Database!G112","v":0},{"$f":"Database!H112","v":0}]
["Statistical differences (±)",{"$f":"Database!J113","v":0},{"$f":"Database!K113","v":0},{"$f":"Database!L113","v":0},0,0,0,0,0,{"$f":"Database!E113","v":0},{"$f":"Database!F113","v":0},{"$f":"Database!G113","v":0},{"$f":"Database!H113","v":0}]
["Total Final Consumption       ",{"$f":"Database!J114","v":0},{"$f":"Database!K114","v":0},{"$f":"Database!L114","v":0},0,0,0,0,0,{"$f":"Database!E114","v":0},{"$f":"Database!F114","v":0},{"$f":"Database!G114","v":0},{"$f":"Database!H114","v":0}]
["Industry (+)",{"$f":"Database!J115","v":0},{"$f":"Database!K115","v":0},{"$f":"Database!L115","v":0},0,0,0,0,0,{"$f":"Database!E115","v":0},{"$f":"Database!F115","v":0},{"$f":"Database!G115","v":0},{"$f":"Database!H115","v":0}]
["Transport (+)",{"$f":"Database!J116","v":0},{"$f":"Database!K116","v":0},{"$f":"Database!L116","v":0},0,0,0,0,0,{"$f":"Database!E116","v":0},{"$f":"Database!F116","v":0},{"$f":"Database!G116","v":0},{"$f":"Database!H116","v":0}]
["of which: Road (+)",{"$f":"Database!J117","v":0},{"$f":"Database!K117","v":0},{"$f":"Database!L117","v":0},0,0,0,0,0,{"$f":"Database!E117","v":0},{"$f":"Database!F117","v":0},{"$f":"Database!G117","v":0},{"$f":"Database!H117","v":0}]
["Other (+)",{"$f":"Database!J118","v":0},{"$f":"Database!K118","v":0},{"$f":"Database!L118","v":0},0,0,0,0,0,{"$f":"Database!E118","v":0},{"$f":"Database!F118","v":0},{"$f":"Database!G118","v":0},{"$f":"Database!H118","v":0}]
["of which: Residential (+) ",{"$f":"Database!J119","v":0},{"$f":"Database!K119","v":0},{"$f":"Database!L119","v":0},0,0,0,0,0,{"$f":"Database!E119","v":0},{"$f":"Database!F119","v":0},{"$f":"Database!G119","v":0},{"$f":"Database!H119","v":0}]
["Non-energy use (+)",{"$f":"Database!J120","v":0},{"$f":"Database!K120","v":0},{"$f":"Database!L120","v":0},0,0,0,0,0,{"$f":"Database!E120","v":0},{"$f":"Database!F120","v":0},{"$f":"Database!G120","v":0},{"$f":"Database!H120","v":0}]
["of which: chemical/petrochemical (+)",{"$f":"Database!J121","v":0},{"$f":"Database!K121","v":0},{"$f":"Database!L121","v":0},0,0,0,0,0,{"$f":"Database!E121","v":0},{"$f":"Database!F121","v":0},{"$f":"Database!G121","v":0},{"$f":"Database!H121","v":0}]
["Elec. Gen. Exc. Pumped storage (TWh) (+)",{"$f":"Database!J122","v":0},{"$f":"Database!K122","v":0},{"$f":"Database!L122","v":0},0,0,0,0,0,{"$f":"Database!E122","v":0},{"$f":"Database!F122","v":0},{"$f":"Database!G122","v":0},{"$f":"Database!H122","v":0}]
[{"$f":"A27","v":"Heat generated (PJ) (+)"},{"$f":"Database!J123","v":0},{"$f":"Database!K123","v":0},{"$f":"Database!L123","v":0},0,0,0,0,0,{"$f":"Database!E123","v":0},{"$f":"Database!F123","v":0},{"$f":"Database!G123","v":0},{"$f":"Database!H123","v":0}]
[null,null,null,null,{"$f":"IF(ABS(E122-SUM(E116,E117,E121))>0.002,HYPERLINK(\"#'Table 1 \"&Database!M$11&\"'!$G$32\",\"Error\"),IF(E130+E131=0, IF(E118<>0,HYPERLINK(\"#'Table 1 \"&Database!M$11&\"'!$G$32\",\"Error\"),\"\"), IF(E118=0, HYPERLINK(\"#'Table 1 \"&Database!M$11&\"'!$G$32\",\"Error\"), IF((E130*0.086+E131*0.02388)/E118*-100>Eff_Max_Nuclear,HYPERLINK(\"#'Table 1 \"&Database!M$11&\"'!$G$35\",\"Warning\"),IF((E130*0.086+E131*0.02388)/E118*-100<Eff_Min_Nuclear,HYPERLINK(\"#'Table 1 \"&Database!M$11&\"'!$G$35\",\"Warning\"),\"\")))))","v":""},{"$f":"IF(ABS(F122-SUM(F116,F117,F121))>0.002,HYPERLINK(\"#'Table 1 \"&Database!N$11&\"'!$G$32\",\"Error\"),IF(F130+F131=0, IF(F118<>0,HYPERLINK(\"#'Table 1 \"&Database!N$11&\"'!$G$32\",\"Error\"),\"\"), IF(F118=0, HYPERLINK(\"#'Table 1 \"&Database!N$11&\"'!$G$32\",\"Error\"), IF((F130*0.086+F131*0.02388)/F118*-100>Eff_Max_Nuclear,HYPERLINK(\"#'Table 1 \"&Database!N$11&\"'!$G$35\",\"Warning\"),IF((F130*0.086+F131*0.02388)/F118*-100<Eff_Min_Nuclear,HYPERLINK(\"#'Table 1 \"&Database!N$11&\"'!$G$35\",\"Warning\"),\"\")))))","v":""},{"$f":"IF(ABS(G122-SUM(G116,G117,G121))>0.002,HYPERLINK(\"#'Table 1 \"&Database!O$11&\"'!$G$32\",\"Error\"),IF(G130+G131=0, IF(G118<>0,HYPERLINK(\"#'Table 1 \"&Database!O$11&\"'!$G$32\",\"Error\"),\"\"), IF(G118=0, HYPERLINK(\"#'Table 1 \"&Database!O$11&\"'!$G$32\",\"Error\"), IF((G130*0.086+G131*0.02388)/G118*-100>Eff_Max_Nuclear,HYPERLINK(\"#'Table 1 \"&Database!O$11&\"'!$G$35\",\"Warning\"),IF((G130*0.086+G131*0.02388)/G118*-100<Eff_Min_Nuclear,HYPERLINK(\"#'Table 1 \"&Database!O$11&\"'!$G$35\",\"Warning\"),\"\")))))","v":""},{"$f":"IF(ABS(H122-SUM(H116,H117,H121))>0.002,HYPERLINK(\"#'Table 1 \"&Database!P$11&\"'!$G$32\",\"Error\"),IF(H130+H131=0, IF(H118<>0,HYPERLINK(\"#'Table 1 \"&Database!P$11&\"'!$G$32\",\"Error\"),\"\"), IF(H118=0, HYPERLINK(\"#'Table 1 \"&Database!P$11&\"'!$G$32\",\"Error\"), IF((H130*0.086+H131*0.02388)/H118*-100>Eff_Max_Nuclear,HYPERLINK(\"#'Table 1 \"&Database!P$11&\"'!$G$35\",\"Warning\"),IF((H130*0.086+H131*0.02388)/H118*-100<Eff_Min_Nuclear,HYPERLINK(\"#'Table 1 \"&Database!P$11&\"'!$G$35\",\"Warning\"),\"\")))))","v":""},{"$f":"IF(ABS(I122-SUM(I116,I117,I121))>0.002,HYPERLINK(\"#'Table 1 \"&Database!Q$11&\"'!$G$32\",\"Error\"),IF(I130+I131=0, IF(I118<>0,HYPERLINK(\"#'Table 1 \"&Database!Q$11&\"'!$G$32\",\"Error\"),\"\"), IF(I118=0, HYPERLINK(\"#'Table 1 \"&Database!Q$11&\"'!$G$32\",\"Error\"), IF((I130*0.086+I131*0.02388)/I118*-100>Eff_Max_Nuclear,HYPERLINK(\"#'Table 1 \"&Database!Q$11&\"'!$G$35\",\"Warning\"),IF((I130*0.086+I131*0.02388)/I118*-100<Eff_Min_Nuclear,HYPERLINK(\"#'Table 1 \"&Database!Q$11&\"'!$G$35\",\"Warning\"),\"\")))))","v":""}]
[]
["Hydro","Historical Data",null,null,"Data Submission This Cycle",null,null,null,null,"Last Cycle Projections"]
[null,{"$f":"Database!B13","v":2016},{"$f":"Database!C13","v":2017},{"$f":"Database!D13","v":2018},{"$f":"E5","v":"2019P"},2020,2030,2040,2050,"2020.LC","2030.LC",{"$f":"L5","v":"2040.LC"},{"$f":"M5","v":"2050.LC"},null,null,null,null,null,null,null,null,null,null,null,null,1,{"$f":"B135","v":2016},{"$f":"C135","v":2017},{"$f":"D135","v":2018},{"$f":"VALUE(LEFT(E135,4))","v":2019},{"$f":"F135","v":2020},{"$f":"G135","v":2030},{"$f":"H135","v":2040},{"$f":"I135","v":2050},{"$f":"H135","v":2040},{"$f":"I135","v":2050}]
[{"$f":"A6","v":"Production (+)"},{"$f":"Database!J124","v":0},{"$f":"Database!K124","v":0},{"$f":"Database!L124","v":0},0,0,0,0,0,{"$f":"Database!E124","v":0},{"$f":"Database!F124","v":0},{"$f":"Database!G124","v":0},{"$f":"Database!H124","v":0},null,null,null,null,null,null,null,null,null,null,null,null,{"$f":"INDEX(A136:G157,$Z$142,1)","v":"Production (+)"},{"$f":"INDEX(B136:N157,$Z$142,1)","v":0},{"$f":"INDEX(C136:O157,$Z$142,1)","v":0},{"$f":"INDEX(D136:P157,$Z$142,1)","v":0},{"$f":"INDEX(E136:Q157,$Z$142,1)","v":0},{"$f":"IF(AE$3,INDEX(F136:U157,$Z$142,1),NA())","v":{"$error":"#N/A"}},{"$f":"IF(AF$3,INDEX(G136:V157,$Z$142,1),NA())","v":{"$error":"#N/A"}},{"$f":"IF(AG$3,INDEX(H136:W157,$Z$142,1),NA())","v":{"$error":"#N/A"}},{"$f":"IF(AH$3,INDEX(I136:X157,$Z$142,1),NA())","v":{"$error":"#N/A"}},{"$f":"IF(AG$3,INDEX(H136:W157,$Z$142,1),NA())","v":{"$error":"#N/A"}},{"$f":"IF(AH$3,INDEX(I136:X157,$Z$142,1),NA())","v":{"$error":"#N/A"}}]
[{"$f":"A7","v":"Imports (+)"},{"$f":"Database!J125","v":0},{"$f":"Database!K125","v":0},{"$f":"Database!L125","v":0},0,0,0,0,0,{"$f":"Database!E125","v":0},{"$f":"Database!F125","v":0},{"$f":"Database!G125","v":0},{"$f":"Database!H125","v":0}]
["Exports (–)",{"$f":"Database!J126","v":0},{"$f":"Database!K126","v":0},{"$f":"Database!L126","v":0},0,0,0,0,0,{"$f":"Database!E126","v":0},{"$f":"Database!F126","v":0},{"$f":"Database!G126","v":0},{"$f":"Database!H126","v":0}]
["International marine bunkers (–)",{"$f":"Database!J127","v":0},{"$f":"Database!K127","v":0},{"$f":"Database!L127","v":0},0,0,0,0,0,{"$f":"Database!E127","v":0},{"$f":"Database!F127","v":0},{"$f":"Database!G127","v":0},{"$f":"Database!H127","v":0}]
["International aviation bunkers (–)",{"$f":"Database!J128","v":0},{"$f":"Database!K128","v":0},{"$f":"Database!L128","v":0},0,0,0,0,0,{"$f":"Database!E128","v":0},{"$f":"Database!F128","v":0},{"$f":"Database!G128","v":0},{"$f":"Database!H128","v":0}]
["Stock changes (±)",{"$f":"Database!J129","v":0},{"$f":"Database!K129","v":0},{"$f":"Database!L129","v":0},0,0,0,0,0,{"$f":"Database!E129","v":0},{"$f":"Database!F129","v":0},{"$f":"Database!G129","v":0},{"$f":"Database!H129","v":0}]
["Total Energy Supply",{"$f":"Database!J130","v":0},{"$f":"Database!K130","v":0},{"$f":"Database!L130","v":0},{"$f":"SUM(E136:E141)","v":0},{"$f":"SUM(F136:F141)","v":0},0,0,0,{"$f":"Database!E130","v":0},{"$f":"Database!F130","v":0},{"$f":"Database!G130","v":0},{"$f":"Database!H130","v":0},null,null,null,null,null,null,null,null,null,null,null,null,{"$f":"INDEX(Z144:AE144,Z135)","v":1}]
["Transformation processes & Energy industry own use",{"$f":"Database!J131","v":0},{"$f":"Database!K131","v":0},{"$f":"Database!L131","v":0},{"$f":"SUM(E144:E146)","v":0},{"$f":"SUM(F144:F146)","v":0},0,0,0,{"$f":"Database!E131","v":0},{"$f":"Database!F131","v":0},{"$f":"Database!G131","v":0},{"$f":"Database!H131","v":0},null,null,null,null,null,null,null,null,null,null,null,null,1,2,3,4,5]
["Electricity, CHP & heat plants (±)",{"$f":"Database!J132","v":0},{"$f":"Database!K132","v":0},{"$f":"Database!L132","v":0},0,0,0,0,0,{"$f":"Database!E132","v":0},{"$f":"Database!F132","v":0},{"$f":"Database!G132","v":0},{"$f":"Database!H132","v":0},null,null,null,null,null,null,null,null,null,null,null,null,1,7,8,9,21]
["Other transformation processes (±)     ",{"$f":"Database!J133","v":0},{"$f":"Database!K133","v":0},{"$f":"Database!L133","v":0},0,0,0,0,0,{"$f":"Database!E133","v":0},{"$f":"Database!F133","v":0},{"$f":"Database!G133","v":0},{"$f":"Database!H133","v":0}]
["Own use and Losses            ",{"$f":"Database!J134","v":0},{"$f":"Database!K134","v":0},{"$f":"Database!L134","v":0},0,0,0,0,0,{"$f":"Database!E134","v":0},{"$f":"Database!F134","v":0},{"$f":"Database!G134","v":0},{"$f":"Database!H134","v":0}]
["Statistical differences (±)",{"$f":"Database!J135","v":0},{"$f":"Database!K135","v":0},{"$f":"Database!L135","v":0},0,0,0,0,0,{"$f":"Database!E135","v":0},{"$f":"Database!F135","v":0},{"$f":"Database!G135","v":0},{"$f":"Database!H135","v":0}]
["Total Final Consumption       ",{"$f":"Database!J136","v":0},{"$f":"Database!K136","v":0},{"$f":"Database!L136","v":0},0,0,0,0,0,{"$f":"Database!E136","v":0},{"$f":"Database!F136","v":0},{"$f":"Database!G136","v":0},{"$f":"Database!H136","v":0}]
["Industry (+)",{"$f":"Database!J137","v":0},{"$f":"Database!K137","v":0},{"$f":"Database!L137","v":0},0,0,0,0,0,{"$f":"Database!E137","v":0},{"$f":"Database!F137","v":0},{"$f":"Database!G137","v":0},{"$f":"Database!H137","v":0}]
["Transport (+)",{"$f":"Database!J138","v":0},{"$f":"Database!K138","v":0},{"$f":"Database!L138","v":0},0,0,0,0,0,{"$f":"Database!E138","v":0},{"$f":"Database!F138","v":0},{"$f":"Database!G138","v":0},{"$f":"Database!H138","v":0}]
["of which: Road (+)",{"$f":"Database!J139","v":0},{"$f":"Database!K139","v":0},{"$f":"Database!L139","v":0},0,0,0,0,0,{"$f":"Database!E139","v":0},{"$f":"Database!F139","v":0},{"$f":"Database!G139","v":0},{"$f":"Database!H139","v":0}]
["Other (+)",{"$f":"Database!J140","v":0},{"$f":"Database!K140","v":0},{"$f":"Database!L140","v":0},0,0,0,0,0,{"$f":"Database!E140","v":0},{"$f":"Database!F140","v":0},{"$f":"Database!G140","v":0},{"$f":"Database!H140","v":0}]
["of which: Residential (+) ",{"$f":"Database!J141","v":0},{"$f":"Database!K141","v":0},{"$f":"Database!L141","v":0},0,0,0,0,0,{"$f":"Database!E141","v":0},{"$f":"Database!F141","v":0},{"$f":"Database!G141","v":0},{"$f":"Database!H141","v":0}]
["Non-energy use (+)",{"$f":"Database!J142","v":0},{"$f":"Database!K142","v":0},{"$f":"Database!L142","v":0},0,0,0,0,0,{"$f":"Database!E142","v":0},{"$f":"Database!F142","v":0},{"$f":"Database!G142","v":0},{"$f":"Database!H142","v":0}]
["of which: chemical/petrochemical (+)",{"$f":"Database!J143","v":0},{"$f":"Database!K143","v":0},{"$f":"Database!L143","v":0},0,0,0,0,0,{"$f":"Database!E143","v":0},{"$f":"Database!F143","v":0},{"$f":"Database!G143","v":0},{"$f":"Database!H143","v":0}]
["Elec. Gen. Exc. Pumped storage (TWh) (+)",{"$f":"Database!J144","v":0},{"$f":"Database!K144","v":0},{"$f":"Database!L144","v":0},0,0,0,0,0,{"$f":"Database!E144","v":0},{"$f":"Database!F144","v":0},{"$f":"Database!G144","v":0},{"$f":"Database!H144","v":0}]
["Heat Generated (PJ)               ",{"$f":"Database!J145","v":0},{"$f":"Database!K145","v":0},{"$f":"Database!L145","v":0},0,0,0,0,0,0,0]
[null,null,null,null,{"$f":"IF(ABS(E148-SUM(E142,E143,E147))>0.002,HYPERLINK(\"#'Table 1 \"&Database!M$11&\"'!$H$32\",\"Error\"),IF(E156+E157=0, IF(E144<>0,HYPERLINK(\"#'Table 1 \"&Database!M$11&\"'!$H$32\",\"Error\"),\"\"), IF(E144=0, HYPERLINK(\"#'Table 1 \"&Database!M$11&\"'!$H$32\",\"Error\"), IF((E156*0.086+E157*0.02388)/E144*-100>Eff_Max_Hydro,HYPERLINK(\"#'Table 1 \"&Database!M$11&\"'!$H$35\",\"Warning\"),IF((E156*0.086+E157*0.02388)/E144*-100<Eff_Min_Hydro,HYPERLINK(\"#'Table 1 \"&Database!M$11&\"'!$H$35\",\"Warning\"),\"\")))))","v":""},{"$f":"IF(ABS(F148-SUM(F142,F143,F147))>0.002,HYPERLINK(\"#'Table 1 \"&Database!N$11&\"'!$H$32\",\"Error\"),IF(F156+F157=0, IF(F144<>0,HYPERLINK(\"#'Table 1 \"&Database!N$11&\"'!$H$32\",\"Error\"),\"\"), IF(F144=0, HYPERLINK(\"#'Table 1 \"&Database!N$11&\"'!$H$32\",\"Error\"), IF((F156*0.086+F157*0.02388)/F144*-100>Eff_Max_Hydro,HYPERLINK(\"#'Table 1 \"&Database!N$11&\"'!$H$35\",\"Warning\"),IF((F156*0.086+F157*0.02388)/F144*-100<Eff_Min_Hydro,HYPERLINK(\"#'Table 1 \"&Database!N$11&\"'!$H$35\",\"Warning\"),\"\")))))","v":""},{"$f":"IF(ABS(G148-SUM(G142,G143,G147))>0.002,HYPERLINK(\"#'Table 1 \"&Database!O$11&\"'!$H$32\",\"Error\"),IF(G156+G157=0, IF(G144<>0,HYPERLINK(\"#'Table 1 \"&Database!O$11&\"'!$H$32\",\"Error\"),\"\"), IF(G144=0, HYPERLINK(\"#'Table 1 \"&Database!O$11&\"'!$H$32\",\"Error\"), IF((G156*0.086+G157*0.02388)/G144*-100>Eff_Max_Hydro,HYPERLINK(\"#'Table 1 \"&Database!O$11&\"'!$H$35\",\"Warning\"),IF((G156*0.086+G157*0.02388)/G144*-100<Eff_Min_Hydro,HYPERLINK(\"#'Table 1 \"&Database!O$11&\"'!$H$35\",\"Warning\"),\"\")))))","v":""},{"$f":"IF(ABS(H148-SUM(H142,H143,H147))>0.002,HYPERLINK(\"#'Table 1 \"&Database!P$11&\"'!$H$32\",\"Error\"),IF(H156+H157=0, IF(H144<>0,HYPERLINK(\"#'Table 1 \"&Database!P$11&\"'!$H$32\",\"Error\"),\"\"), IF(H144=0, HYPERLINK(\"#'Table 1 \"&Database!P$11&\"'!$H$32\",\"Error\"), IF((H156*0.086+H157*0.02388)/H144*-100>Eff_Max_Hydro,HYPERLINK(\"#'Table 1 \"&Database!P$11&\"'!$H$35\",\"Warning\"),IF((H156*0.086+H157*0.02388)/H144*-100<Eff_Min_Hydro,HYPERLINK(\"#'Table 1 \"&Database!P$11&\"'!$H$35\",\"Warning\"),\"\")))))","v":""},{"$f":"IF(ABS(I148-SUM(I142,I143,I147))>0.002,HYPERLINK(\"#'Table 1 \"&Database!Q$11&\"'!$H$32\",\"Error\"),IF(I156+I157=0, IF(I144<>0,HYPERLINK(\"#'Table 1 \"&Database!Q$11&\"'!$H$32\",\"Error\"),\"\"), IF(I144=0, HYPERLINK(\"#'Table 1 \"&Database!Q$11&\"'!$H$32\",\"Error\"), IF((I156*0.086+I157*0.02388)/I144*-100>Eff_Max_Hydro,HYPERLINK(\"#'Table 1 \"&Database!Q$11&\"'!$H$35\",\"Warning\"),IF((I156*0.086+I157*0.02388)/I144*-100<Eff_Min_Hydro,HYPERLINK(\"#'Table 1 \"&Database!Q$11&\"'!$H$35\",\"Warning\"),\"\")))))","v":""}]
[]
["Wind","Historical Data",null,null,"Data Submission This Cycle",null,null,null,null,"Last Cycle Projections"]
[null,{"$f":"Database!B11","v":2016},{"$f":"Database!C11","v":2017},{"$f":"Database!D11","v":2018},{"$f":"E5","v":"2019P"},2020,2030,2040,2050,"2020.LC","2030.LC",{"$f":"L5","v":"2040.LC"},{"$f":"M5","v":"2050.LC"},null,null,null,null,null,null,null,null,null,null,null,null,1,{"$f":"B161","v":2016},{"$f":"C161","v":2017},{"$f":"D161","v":2018},{"$f":"VALUE(LEFT(E161,4))","v":2019},{"$f":"F161","v":2020},{"$f":"G161","v":2030},{"$f":"H161","v":2040},{"$f":"I161","v":2050},{"$f":"H161","v":2040},{"$f":"I161","v":2050}]
[{"$f":"A6","v":"Production (+)"},{"$f":"Database!J146","v":0},{"$f":"Database!K146","v":0},{"$f":"Database!L146","v":0},0,0,0,0,0,{"$f":"Database!E146","v":0},{"$f":"Database!F146","v":0},{"$f":"Database!G146","v":0},{"$f":"Database!H146","v":0},null,null,null,null,null,null,null,null,null,null,null,null,{"$f":"INDEX(A162:G183,$Z$168,1)","v":"Production (+)"},{"$f":"INDEX(B162:N183,$Z$168,1)","v":0},{"$f":"INDEX(C162:O183,$Z$168,1)","v":0},{"$f":"INDEX(D162:P183,$Z$168,1)","v":0},{"$f":"INDEX(E162:Q183,$Z$168,1)","v":0},{"$f":"IF(AE$3,INDEX(F162:U183,$Z$168,1),NA())","v":{"$error":"#N/A"}},{"$f":"IF(AF$3,INDEX(G162:V183,$Z$168,1),NA())","v":{"$error":"#N/A"}},{"$f":"IF(AG$3,INDEX(H162:W183,$Z$168,1),NA())","v":{"$error":"#N/A"}},{"$f":"IF(AH$3,INDEX(I162:X183,$Z$168,1),NA())","v":{"$error":"#N/A"}},{"$f":"IF(AG$3,INDEX(H162:W183,$Z$168,1),NA())","v":{"$error":"#N/A"}},{"$f":"IF(AH$3,INDEX(I162:X183,$Z$168,1),NA())","v":{"$error":"#N/A"}}]
[{"$f":"A7","v":"Imports (+)"},{"$f":"Database!J147","v":0},{"$f":"Database!K147","v":0},{"$f":"Database!L147","v":0},0,0,0,0,0,{"$f":"Database!E147","v":0},{"$f":"Database!F147","v":0},{"$f":"Database!G147","v":0},{"$f":"Database!H147","v":0}]
["Exports (–)",{"$f":"Database!J148","v":0},{"$f":"Database!K148","v":0},{"$f":"Database!L148","v":0},0,0,0,0,0,{"$f":"Database!E148","v":0},{"$f":"Database!F148","v":0},{"$f":"Database!G148","v":0},{"$f":"Database!H148","v":0}]
["International marine bunkers (–)",{"$f":"Database!J149","v":0},{"$f":"Database!K149","v":0},{"$f":"Database!L149","v":0},0,0,0,0,0,{"$f":"Database!E149","v":0},{"$f":"Database!F149","v":0},{"$f":"Database!G149","v":0},{"$f":"Database!H149","v":0}]
["International aviation bunkers (–)",{"$f":"Database!J150","v":0},{"$f":"Database!K150","v":0},{"$f":"Database!L150","v":0},0,0,0,0,0,{"$f":"Database!E150","v":0},{"$f":"Database!F150","v":0},{"$f":"Database!G150","v":0},{"$f":"Database!H150","v":0}]
["Stock changes (±)",{"$f":"Database!J151","v":0},{"$f":"Database!K151","v":0},{"$f":"Database!L151","v":0},0,0,0,0,0,{"$f":"Database!E151","v":0},{"$f":"Database!F151","v":0},{"$f":"Database!G151","v":0},{"$f":"Database!H151","v":0}]
["Total Energy Supply",{"$f":"Database!J152","v":0},{"$f":"Database!K152","v":0},{"$f":"Database!L152","v":0},{"$f":"SUM(E162:E167)","v":0},{"$f":"SUM(F162:F167)","v":0},0,0,0,{"$f":"Database!E152","v":0},{"$f":"Database!F152","v":0},{"$f":"Database!G152","v":0},{"$f":"Database!H152","v":0},null,null,null,null,null,null,null,null,null,null,null,null,{"$f":"INDEX(Z170:AE170,Z161)","v":1}]
["Transformation processes & Energy industry own use",{"$f":"Database!J153","v":0},{"$f":"Database!K153","v":0},{"$f":"Database!L153","v":0},{"$f":"SUM(E170:E172)","v":0},{"$f":"SUM(F170:F172)","v":0},0,0,0,{"$f":"Database!E153","v":0},{"$f":"Database!F153","v":0},{"$f":"Database!G153","v":0},{"$f":"Database!H153","v":0},null,null,null,null,null,null,null,null,null,null,null,null,1,2,3,4,5]
["Electricity, CHP & heat plants (±)",{"$f":"Database!J154","v":0},{"$f":"Database!K154","v":0},{"$f":"Database!L154","v":0},0,0,0,0,0,{"$f":"Database!E154","v":0},{"$f":"Database!F154","v":0},{"$f":"Database!G154","v":0},{"$f":"Database!H154","v":0},null,null,null,null,null,null,null,null,null,null,null,null,1,7,8,9,21]
["Other transformation processes (±)     ",{"$f":"Database!J155","v":0},{"$f":"Database!K155","v":0},{"$f":"Database!L155","v":0},0,0,0,0,0,{"$f":"Database!E155","v":0},{"$f":"Database!F155","v":0},{"$f":"Database!G155","v":0},{"$f":"Database!H155","v":0}]
["Own use and Losses            ",{"$f":"Database!J156","v":0},{"$f":"Database!K156","v":0},{"$f":"Database!L156","v":0},0,0,0,0,0,{"$f":"Database!E156","v":0},{"$f":"Database!F156","v":0},{"$f":"Database!G156","v":0},{"$f":"Database!H156","v":0}]
["Statistical differences (±)",{"$f":"Database!J157","v":0},{"$f":"Database!K157","v":0},{"$f":"Database!L157","v":0},0,0,0,0,0,{"$f":"Database!E157","v":0},{"$f":"Database!F157","v":0},{"$f":"Database!G157","v":0},{"$f":"Database!H157","v":0}]
["Total Final Consumption       ",{"$f":"Database!J158","v":0},{"$f":"Database!K158","v":0},{"$f":"Database!L158","v":0},0,0,0,0,0,{"$f":"Database!E158","v":0},{"$f":"Database!F158","v":0},{"$f":"Database!G158","v":0},{"$f":"Database!H158","v":0}]
["Industry (+)",{"$f":"Database!J159","v":0},{"$f":"Database!K159","v":0},{"$f":"Database!L159","v":0},0,0,0,0,0,{"$f":"Database!E159","v":0},{"$f":"Database!F159","v":0},{"$f":"Database!G159","v":0},{"$f":"Database!H159","v":0}]
["Transport (+)",{"$f":"Database!J160","v":0},{"$f":"Database!K160","v":0},{"$f":"Database!L160","v":0},0,0,0,0,0,{"$f":"Database!E160","v":0},{"$f":"Database!F160","v":0},{"$f":"Database!G160","v":0},{"$f":"Database!H160","v":0}]
["of which: Road (+)",{"$f":"Database!J161","v":0},{"$f":"Database!K161","v":0},{"$f":"Database!L161","v":0},0,0,0,0,0,{"$f":"Database!E161","v":0},{"$f":"Database!F161","v":0},{"$f":"Database!G161","v":0},{"$f":"Database!H161","v":0}]
["Other (+)",{"$f":"Database!J162","v":0},{"$f":"Database!K162","v":0},{"$f":"Database!L162","v":0},0,0,0,0,0,{"$f":"Database!E162","v":0},{"$f":"Database!F162","v":0},{"$f":"Database!G162","v":0},{"$f":"Database!H162","v":0}]
["of which: Residential (+) ",{"$f":"Database!J163","v":0},{"$f":"Database!K163","v":0},{"$f":"Database!L163","v":0},0,0,0,0,0,{"$f":"Database!E163","v":0},{"$f":"Database!F163","v":0},{"$f":"Database!G163","v":0},{"$f":"Database!H163","v":0}]
["Non-energy use (+)",{"$f":"Database!J164","v":0},{"$f":"Database!K164","v":0},{"$f":"Database!L164","v":0},0,0,0,0,0,{"$f":"Database!E164","v":0},{"$f":"Database!F164","v":0},{"$f":"Database!G164","v":0},{"$f":"Database!H164","v":0}]
["of which: chemical/petrochemical (+)",{"$f":"Database!J165","v":0},{"$f":"Database!K165","v":0},{"$f":"Database!L165","v":0},0,0,0,0,0,{"$f":"Database!E165","v":0},{"$f":"Database!F165","v":0},{"$f":"Database!G165","v":0},{"$f":"Database!H165","v":0}]
["Elec. Gen. Exc. Pumped storage (TWh) (+)",{"$f":"Database!J166","v":0},{"$f":"Database!K166","v":0},{"$f":"Database!L166","v":0},0,0,0,0,0,{"$f":"Database!E166","v":0},{"$f":"Database!F166","v":0},{"$f":"Database!G166","v":0},{"$f":"Database!H166","v":0}]
["Heat Generated (PJ)               ",{"$f":"Database!J167","v":0},{"$f":"Database!K167","v":0},{"$f":"Database!L167","v":0},0,0,0,0,0,0,0]
[null,null,null,null,{"$f":"IF(ABS(E174-SUM(E168,E169,E173))>0.002,HYPERLINK(\"#'Table 1 \"&Database!M$11&\"'!$I$32\",\"Error\"),IF(E182+E183=0, IF(E170<>0,HYPERLINK(\"#'Table 1 \"&Database!M$11&\"'!$I$32\",\"Error\"),\"\"), IF(E170=0, HYPERLINK(\"#'Table 1 \"&Database!M$11&\"'!$I$32\",\"Error\"), IF((E182*0.086+E183*0.02388)/E170*-100>Eff_Max_Wind,HYPERLINK(\"#'Table 1 \"&Database!M$11&\"'!$I$35\",\"Warning\"),IF((E182*0.086+E183*0.02388)/E170*-100<Eff_Min_Wind,HYPERLINK(\"#'Table 1 \"&Database!M$11&\"'!$I$35\",\"Warning\"),\"\")))))","v":""},{"$f":"IF(ABS(F174-SUM(F168,F169,F173))>0.002,HYPERLINK(\"#'Table 1 \"&Database!N$11&\"'!$I$32\",\"Error\"),IF(F182+F183=0, IF(F170<>0,HYPERLINK(\"#'Table 1 \"&Database!N$11&\"'!$I$32\",\"Error\"),\"\"), IF(F170=0, HYPERLINK(\"#'Table 1 \"&Database!N$11&\"'!$I$32\",\"Error\"), IF((F182*0.086+F183*0.02388)/F170*-100>Eff_Max_Wind,HYPERLINK(\"#'Table 1 \"&Database!N$11&\"'!$I$35\",\"Warning\"),IF((F182*0.086+F183*0.02388)/F170*-100<Eff_Min_Wind,HYPERLINK(\"#'Table 1 \"&Database!N$11&\"'!$I$35\",\"Warning\"),\"\")))))","v":""},{"$f":"IF(ABS(G174-SUM(G168,G169,G173))>0.002,HYPERLINK(\"#'Table 1 \"&Database!O$11&\"'!$I$32\",\"Error\"),IF(G182+G183=0, IF(G170<>0,HYPERLINK(\"#'Table 1 \"&Database!O$11&\"'!$I$32\",\"Error\"),\"\"), IF(G170=0, HYPERLINK(\"#'Table 1 \"&Database!O$11&\"'!$I$32\",\"Error\"), IF((G182*0.086+G183*0.02388)/G170*-100>Eff_Max_Wind,HYPERLINK(\"#'Table 1 \"&Database!O$11&\"'!$I$35\",\"Warning\"),IF((G182*0.086+G183*0.02388)/G170*-100<Eff_Min_Wind,HYPERLINK(\"#'Table 1 \"&Database!O$11&\"'!$I$35\",\"Warning\"),\"\")))))","v":""},{"$f":"IF(ABS(H174-SUM(H168,H169,H173))>0.002,HYPERLINK(\"#'Table 1 \"&Database!P$11&\"'!$I$32\",\"Error\"),IF(H182+H183=0, IF(H170<>0,HYPERLINK(\"#'Table 1 \"&Database!P$11&\"'!$I$32\",\"Error\"),\"\"), IF(H170=0, HYPERLINK(\"#'Table 1 \"&Database!P$11&\"'!$I$32\",\"Error\"), IF((H182*0.086+H183*0.02388)/H170*-100>Eff_Max_Wind,HYPERLINK(\"#'Table 1 \"&Database!P$11&\"'!$I$35\",\"Warning\"),IF((H182*0.086+H183*0.02388)/H170*-100<Eff_Min_Wind,HYPERLINK(\"#'Table 1 \"&Database!P$11&\"'!$I$35\",\"Warning\"),\"\")))))","v":""},{"$f":"IF(ABS(I174-SUM(I168,I169,I173))>0.002,HYPERLINK(\"#'Table 1 \"&Database!Q$11&\"'!$I$32\",\"Error\"),IF(I182+I183=0, IF(I170<>0,HYPERLINK(\"#'Table 1 \"&Database!Q$11&\"'!$I$32\",\"Error\"),\"\"), IF(I170=0, HYPERLINK(\"#'Table 1 \"&Database!Q$11&\"'!$I$32\",\"Error\"), IF((I182*0.086+I183*0.02388)/I170*-100>Eff_Max_Wind,HYPERLINK(\"#'Table 1 \"&Database!Q$11&\"'!$I$35\",\"Warning\"),IF((I182*0.086+I183*0.02388)/I170*-100<Eff_Min_Wind,HYPERLINK(\"#'Table 1 \"&Database!Q$11&\"'!$I$35\",\"Warning\"),\"\")))))","v":""}]
[]
["Geothermal","Historical Data",null,null,"Data Submission This Cycle",null,null,null,null,"Last Cycle Projections"]
[null,{"$f":"Database!B11","v":2016},{"$f":"Database!C11","v":2017},{"$f":"Database!D11","v":2018},{"$f":"E5","v":"2019P"},2020,2030,2040,2050,"2020.LC","2030.LC",{"$f":"L5","v":"2040.LC"},{"$f":"M5","v":"2050.LC"},null,null,null,null,null,null,null,null,null,null,null,null,1,{"$f":"B187","v":2016},{"$f":"C187","v":2017},{"$f":"D187","v":2018},{"$f":"VALUE(LEFT(E187,4))","v":2019},{"$f":"F187","v":2020},{"$f":"G187","v":2030},{"$f":"H187","v":2040},{"$f":"I187","v":2050},{"$f":"H187","v":2040},{"$f":"I187","v":2050}]
[{"$f":"A6","v":"Production (+)"},{"$f":"Database!J168","v":0},{"$f":"Database!K168","v":0},{"$f":"Database!L168","v":0},0,0,0,0,0,{"$f":"Database!E168","v":0},{"$f":"Database!F168","v":0},{"$f":"Database!G168","v":0},{"$f":"Database!H168","v":0},null,null,null,null,null,null,null,null,null,null,null,null,{"$f":"INDEX(A188:G209,$Z$194,1)","v":"Production (+)"},{"$f":"INDEX(B188:N209,$Z$194,1)","v":0},{"$f":"INDEX(C188:O209,$Z$194,1)","v":0},{"$f":"INDEX(D188:P209,$Z$194,1)","v":0},{"$f":"INDEX(E188:Q209,$Z$194,1)","v":0},{"$f":"IF(AE$3,INDEX(F188:U209,$Z$194,1),NA())","v":{"$error":"#N/A"}},{"$f":"IF(AF$3,INDEX(G188:V209,$Z$194,1),NA())","v":{"$error":"#N/A"}},{"$f":"IF(AG$3,INDEX(H188:W209,$Z$194,1),NA())","v":{"$error":"#N/A"}},{"$f":"IF(AH$3,INDEX(I188:X209,$Z$194,1),NA())","v":{"$error":"#N/A"}},{"$f":"IF(AG$3,INDEX(H188:W209,$Z$194,1),NA())","v":{"$error":"#N/A"}},{"$f":"IF(AH$3,INDEX(I188:X209,$Z$194,1),NA())","v":{"$error":"#N/A"}}]
[{"$f":"A7","v":"Imports (+)"},{"$f":"Database!J169","v":0},{"$f":"Database!K169","v":0},{"$f":"Database!L169","v":0},0,0,0,0,0,{"$f":"Database!E169","v":0},{"$f":"Database!F169","v":0},{"$f":"Database!G169","v":0},{"$f":"Database!H169","v":0}]
["Exports (–)",{"$f":"Database!J170","v":0},{"$f":"Database!K170","v":0},{"$f":"Database!L170","v":0},0,0,0,0,0,{"$f":"Database!E170","v":0},{"$f":"Database!F170","v":0},{"$f":"Database!G170","v":0},{"$f":"Database!H170","v":0}]
["International marine bunkers (–)",{"$f":"Database!J171","v":0},{"$f":"Database!K171","v":0},{"$f":"Database!L171","v":0},0,0,0,0,0,{"$f":"Database!E171","v":0},{"$f":"Database!F171","v":0},{"$f":"Database!G171","v":0},{"$f":"Database!H171","v":0}]
["International aviation bunkers (–)",{"$f":"Database!J172","v":0},{"$f":"Database!K172","v":0},{"$f":"Database!L172","v":0},0,0,0,0,0,{"$f":"Database!E172","v":0},{"$f":"Database!F172","v":0},{"$f":"Database!G172","v":0},{"$f":"Database!H172","v":0}]
["Stock changes (±)",{"$f":"Database!J173","v":0},{"$f":"Database!K173","v":0},{"$f":"Database!L173","v":0},0,0,0,0,0,{"$f":"Database!E173","v":0},{"$f":"Database!F173","v":0},{"$f":"Database!G173","v":0},{"$f":"Database!H173","v":0}]
["Total Energy Supply",{"$f":"Database!J174","v":0},{"$f":"Database!K174","v":0},{"$f":"Database!L174","v":0},{"$f":"SUM(E188:E193)","v":0},{"$f":"SUM(F188:F193)","v":0},0,0,0,{"$f":"Database!E174","v":0},{"$f":"Database!F174","v":0},{"$f":"Database!G174","v":0},{"$f":"Database!H174","v":0},null,null,null,null,null,null,null,null,null,null,null,null,{"$f":"INDEX(Z196:AK196,Z187)","v":1}]
["Transformation processes & Energy industry own use",{"$f":"Database!J175","v":0},{"$f":"Database!K175","v":0},{"$f":"Database!L175","v":0},{"$f":"SUM(E196:E198)","v":0},{"$f":"SUM(F196:F198)","v":0},0,0,0,{"$f":"Database!E175","v":0},{"$f":"Database!F175","v":0},{"$f":"Database!G175","v":0},{"$f":"Database!H175","v":0},null,null,null,null,null,null,null,null,null,null,null,null,1,2,3,4,5,6,7,8,9,10,11,12]
["Electricity, CHP & heat plants (±)",{"$f":"Database!J176","v":0},{"$f":"Database!K176","v":0},{"$f":"Database!L176","v":0},0,0,0,0,0,{"$f":"Database!E176","v":0},{"$f":"Database!F176","v":0},{"$f":"Database!G176","v":0},{"$f":"Database!H176","v":0},null,null,null,null,null,null,null,null,null,null,null,null,1,7,8,9,11,{"$f":"AD196+1","v":12},{"$f":"AE196+1","v":13},17,{"$f":"AG196+1","v":18},{"$f":"AH196+1","v":19},21,22]
["Other transformation processes (±)     ",{"$f":"Database!J177","v":0},{"$f":"Database!K177","v":0},{"$f":"Database!L177","v":0},0,0,0,0,0,{"$f":"Database!E177","v":0},{"$f":"Database!F177","v":0},{"$f":"Database!G177","v":0},{"$f":"Database!H177","v":0}]
["Own use and Losses            ",{"$f":"Database!J178","v":0},{"$f":"Database!K178","v":0},{"$f":"Database!L178","v":0},0,0,0,0,0,{"$f":"Database!E178","v":0},{"$f":"Database!F178","v":0},{"$f":"Database!G178","v":0},{"$f":"Database!H178","v":0}]
["Statistical differences (±)",{"$f":"Database!J179","v":0},{"$f":"Database!K179","v":0},{"$f":"Database!L179","v":0},0,0,0,0,0,{"$f":"Database!E179","v":0},{"$f":"Database!F179","v":0},{"$f":"Database!G179","v":0},{"$f":"Database!H179","v":0}]
["Total Final Consumption       ",{"$f":"Database!J180","v":0},{"$f":"Database!K180","v":0},{"$f":"Database!L180","v":0},{"$f":"SUM(E201,E202,E204,E206)","v":0},{"$f":"SUM(F201,F202,F204,F206)","v":0},0,0,0,{"$f":"Database!E180","v":0},{"$f":"Database!F180","v":0},{"$f":"Database!G180","v":0},{"$f":"Database!H180","v":0}]
["Industry (+)",{"$f":"Database!J181","v":0},{"$f":"Database!K181","v":0},{"$f":"Database!L181","v":0},0,0,0,0,0,{"$f":"Database!E181","v":0},{"$f":"Database!F181","v":0},{"$f":"Database!G181","v":0},{"$f":"Database!H181","v":0}]
["Transport (+)",{"$f":"Database!J182","v":0},{"$f":"Database!K182","v":0},{"$f":"Database!L182","v":0},0,0,0,0,0,{"$f":"Database!E182","v":0},{"$f":"Database!F182","v":0},{"$f":"Database!G182","v":0},{"$f":"Database!H182","v":0}]
["of which: Road (+)",{"$f":"Database!J183","v":0},{"$f":"Database!K183","v":0},{"$f":"Database!L183","v":0},0,0,0,0,0,{"$f":"Database!E183","v":0},{"$f":"Database!F183","v":0},{"$f":"Database!G183","v":0},{"$f":"Database!H183","v":0}]
["Other (+)",{"$f":"Database!J184","v":0},{"$f":"Database!K184","v":0},{"$f":"Database!L184","v":0},0,0,0,0,0,{"$f":"Database!E184","v":0},{"$f":"Database!F184","v":0},{"$f":"Database!G184","v":0},{"$f":"Database!H184","v":0}]
["of which: Residential (+) ",{"$f":"Database!J185","v":0},{"$f":"Database!K185","v":0},{"$f":"Database!L185","v":0},0,0,0,0,0,{"$f":"Database!E185","v":0},{"$f":"Database!F185","v":0},{"$f":"Database!G185","v":0},{"$f":"Database!H185","v":0}]
["Non-energy use (+)",{"$f":"Database!J186","v":0},{"$f":"Database!K186","v":0},{"$f":"Database!L186","v":0},0,0,0,0,0,{"$f":"Database!E186","v":0},{"$f":"Database!F186","v":0},{"$f":"Database!G186","v":0},{"$f":"Database!H186","v":0}]
["of which: chemical/petrochemical (+)",{"$f":"Database!J187","v":0},{"$f":"Database!K187","v":0},{"$f":"Database!L187","v":0},0,0,0,0,0,{"$f":"Database!E187","v":0},{"$f":"Database!F187","v":0},{"$f":"Database!G187","v":0},{"$f":"Database!H187","v":0}]
["Elec. Gen. Exc. Pumped storage (TWh) (+)",{"$f":"Database!J188","v":0},{"$f":"Database!K188","v":0},{"$f":"Database!L188","v":0},0,0,0,0,0,{"$f":"Database!E188","v":0},{"$f":"Database!F188","v":0},{"$f":"Database!G188","v":0},{"$f":"Database!H188","v":0}]
["Heat generated (PJ) (+)",{"$f":"Database!J189","v":0},{"$f":"Database!K189","v":0},{"$f":"Database!L189","v":0},0,0,0,0,0,{"$f":"Database!E189","v":0},{"$f":"Database!F189","v":0},{"$f":"Database!G189","v":0},{"$f":"Database!H189","v":0},null,null,null,null,{"$f":"$Z$188","v":"Production (+)"}]
[null,null,null,null,{"$f":"IF(ABS(E200-SUM(E194,E195,E199))>0.002,HYPERLINK(\"#'Table 1 \"&Database!M$11&\"'!$J$32\",\"Error\"),IF(E208+E209=0, IF(E196<>0,HYPERLINK(\"#'Table 1 \"&Database!M$11&\"'!$J$32\",\"Error\"),\"\"), IF(E196=0, HYPERLINK(\"#'Table 1 \"&Database!M$11&\"'!$J$32\",\"Error\"), IF((E208*0.086+E209*0.02388)/E196*-100>Eff_Max_Geo,HYPERLINK(\"#'Table 1 \"&Database!M$11&\"'!$J$35\",\"Warning\"),IF((E208*0.086+E209*0.02388)/E196*-100<Eff_Min_Geo,HYPERLINK(\"#'Table 1 \"&Database!M$11&\"'!$J$35\",\"Warning\"),\"\")))))","v":""},{"$f":"IF(ABS(F200-SUM(F194,F195,F199))>0.002,HYPERLINK(\"#'Table 1 \"&Database!N$11&\"'!$J$32\",\"Error\"),IF(F208+F209=0, IF(F196<>0,HYPERLINK(\"#'Table 1 \"&Database!N$11&\"'!$J$32\",\"Error\"),\"\"), IF(F196=0, HYPERLINK(\"#'Table 1 \"&Database!N$11&\"'!$J$32\",\"Error\"), IF((F208*0.086+F209*0.02388)/F196*-100>Eff_Max_Geo,HYPERLINK(\"#'Table 1 \"&Database!N$11&\"'!$J$35\",\"Warning\"),IF((F208*0.086+F209*0.02388)/F196*-100<Eff_Min_Geo,HYPERLINK(\"#'Table 1 \"&Database!N$11&\"'!$J$35\",\"Warning\"),\"\")))))","v":""},{"$f":"IF(ABS(G200-SUM(G194,G195,G199))>0.002,HYPERLINK(\"#'Table 1 \"&Database!O$11&\"'!$J$32\",\"Error\"),IF(G208+G209=0, IF(G196<>0,HYPERLINK(\"#'Table 1 \"&Database!O$11&\"'!$J$32\",\"Error\"),\"\"), IF(G196=0, HYPERLINK(\"#'Table 1 \"&Database!O$11&\"'!$J$32\",\"Error\"), IF((G208*0.086+G209*0.02388)/G196*-100>Eff_Max_Geo,HYPERLINK(\"#'Table 1 \"&Database!O$11&\"'!$J$35\",\"Warning\"),IF((G208*0.086+G209*0.02388)/G196*-100<Eff_Min_Geo,HYPERLINK(\"#'Table 1 \"&Database!O$11&\"'!$J$35\",\"Warning\"),\"\")))))","v":""},{"$f":"IF(ABS(H200-SUM(H194,H195,H199))>0.002,HYPERLINK(\"#'Table 1 \"&Database!P$11&\"'!$J$32\",\"Error\"),IF(H208+H209=0, IF(H196<>0,HYPERLINK(\"#'Table 1 \"&Database!P$11&\"'!$J$32\",\"Error\"),\"\"), IF(H196=0, HYPERLINK(\"#'Table 1 \"&Database!P$11&\"'!$J$32\",\"Error\"), IF((H208*0.086+H209*0.02388)/H196*-100>Eff_Max_Geo,HYPERLINK(\"#'Table 1 \"&Database!P$11&\"'!$J$35\",\"Warning\"),IF((H208*0.086+H209*0.02388)/H196*-100<Eff_Min_Geo,HYPERLINK(\"#'Table 1 \"&Database!P$11&\"'!$J$35\",\"Warning\"),\"\")))))","v":""},{"$f":"IF(ABS(I200-SUM(I194,I195,I199))>0.002,HYPERLINK(\"#'Table 1 \"&Database!Q$11&\"'!$J$32\",\"Error\"),IF(I208+I209=0, IF(I196<>0,HYPERLINK(\"#'Table 1 \"&Database!Q$11&\"'!$J$32\",\"Error\"),\"\"), IF(I196=0, HYPERLINK(\"#'Table 1 \"&Database!Q$11&\"'!$J$32\",\"Error\"), IF((I208*0.086+I209*0.02388)/I196*-100>Eff_Max_Geo,HYPERLINK(\"#'Table 1 \"&Database!Q$11&\"'!$J$35\",\"Warning\"),IF((I208*0.086+I209*0.02388)/I196*-100<Eff_Min_Geo,HYPERLINK(\"#'Table 1 \"&Database!Q$11&\"'!$J$35\",\"Warning\"),\"\")))))","v":""}]
[]
["Solar","Historical Data",null,null,"Data Submission This Cycle",null,null,null,null,"Last Cycle Projections"]
[null,{"$f":"Database!B11","v":2016},{"$f":"Database!C11","v":2017},{"$f":"Database!D11","v":2018},{"$f":"E5","v":"2019P"},2020,2030,2040,2050,"2020.LC","2030.LC",{"$f":"L5","v":"2040.LC"},{"$f":"M5","v":"2050.LC"},null,null,null,null,null,null,null,null,null,null,null,null,1,{"$f":"B213","v":2016},{"$f":"C213","v":2017},{"$f":"D213","v":2018},{"$f":"VALUE(LEFT(E213,4))","v":2019},{"$f":"F213","v":2020},{"$f":"G213","v":2030},{"$f":"H213","v":2040},{"$f":"I213","v":2050},{"$f":"H213","v":2040},{"$f":"I213","v":2050}]
[{"$f":"A6","v":"Production (+)"},{"$f":"Database!J190","v":0},{"$f":"Database!K190","v":0},{"$f":"Database!L190","v":0},0,0,0,0,0,{"$f":"Database!E190","v":0},{"$f":"Database!F190","v":0},{"$f":"Database!G190","v":0},{"$f":"Database!H190","v":0},null,null,null,null,null,null,null,null,null,null,null,null,{"$f":"INDEX(A214:G235,$Z$220,1)","v":"Production (+)"},{"$f":"INDEX(B214:N235,$Z$220,1)","v":0},{"$f":"INDEX(C214:O235,$Z$220,1)","v":0},{"$f":"INDEX(D214:P235,$Z$220,1)","v":0},{"$f":"INDEX(E214:Q235,$Z$220,1)","v":0},{"$f":"IF(AE$3,INDEX(F214:U235,$Z$220,1),NA())","v":{"$error":"#N/A"}},{"$f":"IF(AF$3,INDEX(G214:V235,$Z$220,1),NA())","v":{"$error":"#N/A"}},{"$f":"IF(AG$3,INDEX(H214:W235,$Z$220,1),NA())","v":{"$error":"#N/A"}},{"$f":"IF(AH$3,INDEX(I214:X235,$Z$220,1),NA())","v":{"$error":"#N/A"}},{"$f":"IF(AG$3,INDEX(H214:W235,$Z$220,1),NA())","v":{"$error":"#N/A"}},{"$f":"IF(AH$3,INDEX(I214:X235,$Z$220,1),NA())","v":{"$error":"#N/A"}}]
[{"$f":"A7","v":"Imports (+)"},{"$f":"Database!J191","v":0},{"$f":"Database!K191","v":0},{"$f":"Database!L191","v":0},0,0,0,0,0,{"$f":"Database!E191","v":0},{"$f":"Database!F191","v":0},{"$f":"Database!G191","v":0},{"$f":"Database!H191","v":0}]
["Exports (–)",{"$f":"Database!J192","v":0},{"$f":"Database!K192","v":0},{"$f":"Database!L192","v":0},0,0,0,0,0,{"$f":"Database!E192","v":0},{"$f":"Database!F192","v":0},{"$f":"Database!G192","v":0},{"$f":"Database!H192","v":0}]
["International marine bunkers (–)",{"$f":"Database!J193","v":0},{"$f":"Database!K193","v":0},{"$f":"Database!L193","v":0},0,0,0,0,0,{"$f":"Database!E193","v":0},{"$f":"Database!F193","v":0},{"$f":"Database!G193","v":0},{"$f":"Database!H193","v":0}]
["International aviation bunkers (–)",{"$f":"Database!J194","v":0},{"$f":"Database!K194","v":0},{"$f":"Database!L194","v":0},0,0,0,0,0,{"$f":"Database!E194","v":0},{"$f":"Database!F194","v":0},{"$f":"Database!G194","v":0},{"$f":"Database!H194","v":0}]
["Stock changes (±)",{"$f":"Database!J195","v":0},{"$f":"Database!K195","v":0},{"$f":"Database!L195","v":0},0,0,0,0,0,{"$f":"Database!E195","v":0},{"$f":"Database!F195","v":0},{"$f":"Database!G195","v":0},{"$f":"Database!H195","v":0}]
["Total Energy Supply",{"$f":"Database!J196","v":0},{"$f":"Database!K196","v":0},{"$f":"Database!L196","v":0},{"$f":"SUM(E214:E219)","v":0},{"$f":"SUM(F214:F219)","v":0},{"$f":"SUM(G214:G219)","v":0},0,0,{"$f":"Database!E196","v":0},{"$f":"Database!F196","v":0},{"$f":"Database!G196","v":0},{"$f":"Database!H196","v":0},null,null,null,null,null,null,null,null,null,null,null,null,{"$f":"INDEX(Z222:AM222,Z213)","v":1}]
["Transformation processes & Energy industry own use",{"$f":"Database!J197","v":0},{"$f":"Database!K197","v":0},{"$f":"Database!L197","v":0},{"$f":"SUM(E222:E224)","v":0},{"$f":"SUM(F222:F224)","v":0},0,0,0,{"$f":"Database!E197","v":0},{"$f":"Database!F197","v":0},{"$f":"Database!G197","v":0},{"$f":"Database!H197","v":0},null,null,null,null,null,null,null,null,null,null,null,null,1,2,3,4,5,6,7,8,9,10,11,13,14,15]
["Electricity, CHP & heat plants (±)",{"$f":"Database!J198","v":0},{"$f":"Database!K198","v":0},{"$f":"Database!L198","v":0},0,0,0,0,0,{"$f":"Database!E198","v":0},{"$f":"Database!F198","v":0},{"$f":"Database!G198","v":0},{"$f":"Database!H198","v":0},null,null,null,null,null,null,null,null,null,null,null,null,1,7,8,9,11,{"$f":"AD222+1","v":12},{"$f":"AE222+1","v":13},14,15,{"$f":"AH222+1","v":16},{"$f":"AI222+1","v":17},18,21,22]
["Other transformation processes (±)     ",{"$f":"Database!J199","v":0},{"$f":"Database!K199","v":0},{"$f":"Database!L199","v":0},0,0,0,0,0,{"$f":"Database!E199","v":0},{"$f":"Database!F199","v":0},{"$f":"Database!G199","v":0},{"$f":"Database!H199","v":0}]
["Own use and Losses            ",{"$f":"Database!J200","v":0},{"$f":"Database!K200","v":0},{"$f":"Database!L200","v":0},0,0,0,0,0,{"$f":"Database!E200","v":0},{"$f":"Database!F200","v":0},{"$f":"Database!G200","v":0},{"$f":"Database!H200","v":0}]
["Statistical differences (±)",{"$f":"Database!J201","v":0},{"$f":"Database!K201","v":0},{"$f":"Database!L201","v":0},0,0,0,0,0,{"$f":"Database!E201","v":0},{"$f":"Database!F201","v":0},{"$f":"Database!G201","v":0},{"$f":"Database!H201","v":0}]
["Total Final Consumption       ",{"$f":"Database!J202","v":0},{"$f":"Database!K202","v":0},{"$f":"Database!L202","v":0},{"$f":"SUM(E227,E228,E230,E232)","v":0},{"$f":"SUM(F227,F228,F230,F232)","v":0},0,0,0,{"$f":"Database!E202","v":0},{"$f":"Database!F202","v":0},{"$f":"Database!G202","v":0},{"$f":"Database!H202","v":0}]
["Industry (+)",{"$f":"Database!J203","v":0},{"$f":"Database!K203","v":0},{"$f":"Database!L203","v":0},0,0,0,0,0,{"$f":"Database!E203","v":0},{"$f":"Database!F203","v":0},{"$f":"Database!G203","v":0},{"$f":"Database!H203","v":0}]
["Transport (+)",{"$f":"Database!J204","v":0},{"$f":"Database!K204","v":0},{"$f":"Database!L204","v":0},0,0,0,0,0,{"$f":"Database!E204","v":0},{"$f":"Database!F204","v":0},{"$f":"Database!G204","v":0},{"$f":"Database!H204","v":0}]
["of which: Road (+)",{"$f":"Database!J205","v":0},{"$f":"Database!K205","v":0},{"$f":"Database!L205","v":0},0,0,0,0,0,{"$f":"Database!E205","v":0},{"$f":"Database!F205","v":0},{"$f":"Database!G205","v":0},{"$f":"Database!H205","v":0}]
["Other (+)",{"$f":"Database!J206","v":0},{"$f":"Database!K206","v":0},{"$f":"Database!L206","v":0},0,0,0,0,0,{"$f":"Database!E206","v":0},{"$f":"Database!F206","v":0},{"$f":"Database!G206","v":0},{"$f":"Database!H206","v":0}]
["of which: Residential (+) ",{"$f":"Database!J207","v":0},{"$f":"Database!K207","v":0},{"$f":"Database!L207","v":0},0,0,0,0,0,{"$f":"Database!E207","v":0},{"$f":"Database!F207","v":0},{"$f":"Database!G207","v":0},{"$f":"Database!H207","v":0}]
["Non-energy use (+)",{"$f":"Database!J208","v":0},{"$f":"Database!K208","v":0},{"$f":"Database!L208","v":0},0,0,0,0,0,{"$f":"Database!E208","v":0},{"$f":"Database!F208","v":0},{"$f":"Database!G208","v":0},{"$f":"Database!H208","v":0}]
["of which: chemical/petrochemical (+)",{"$f":"Database!J209","v":0},{"$f":"Database!K209","v":0},{"$f":"Database!L209","v":0},0,0,0,0,0,{"$f":"Database!E209","v":0},{"$f":"Database!F209","v":0},{"$f":"Database!G209","v":0},{"$f":"Database!H209","v":0}]
["Elec. Gen. Exc. Pumped storage (TWh) (+)",{"$f":"Database!J210","v":0},{"$f":"Database!K210","v":0},{"$f":"Database!L210","v":0},0,0,0,0,0,{"$f":"Database!E210","v":0},{"$f":"Database!F210","v":0},{"$f":"Database!G210","v":0},{"$f":"Database!H210","v":0},null,null,null,null,{"$f":"$Z$214","v":"Production (+)"}]
["Heat generated (PJ) (+)",{"$f":"Database!J211","v":0},{"$f":"Database!K211","v":0},{"$f":"Database!L211","v":0},0,0,0,0,0,{"$f":"Database!E211","v":0},{"$f":"Database!F211","v":0},{"$f":"Database!G211","v":0},{"$f":"Database!H211","v":0}]
[2,null,null,null,{"$f":"IF(ABS(E226-SUM(E220,E221,E225))>0.002,HYPERLINK(\"#'Table 1 \"&Database!M$11&\"'!$K$32\",\"Error\"),IF(E234+E235=0, IF(E222<>0,HYPERLINK(\"#'Table 1 \"&Database!M$11&\"'!$K$32\",\"Error\"),\"\"), IF(E222=0, HYPERLINK(\"#'Table 1 \"&Database!M$11&\"'!$K$32\",\"Error\"), IF((E234*0.086+E235*0.02388)/E222*-100>Eff_Max_Solar,HYPERLINK(\"#'Table 1 \"&Database!M$11&\"'!$K$35\",\"Warning\"),IF((E234*0.086+E235*0.02388)/E222*-100<Eff_Min_Solar,HYPERLINK(\"#'Table 1 \"&Database!M$11&\"'!$K$35\",\"Warning\"),\"\")))))","v":""},{"$f":"IF(ABS(F226-SUM(F220,F221,F225))>0.002,HYPERLINK(\"#'Table 1 \"&Database!N$11&\"'!$K$32\",\"Error\"),IF(F234+F235=0, IF(F222<>0,HYPERLINK(\"#'Table 1 \"&Database!N$11&\"'!$K$32\",\"Error\"),\"\"), IF(F222=0, HYPERLINK(\"#'Table 1 \"&Database!N$11&\"'!$K$32\",\"Error\"), IF((F234*0.086+F235*0.02388)/F222*-100>Eff_Max_Solar,HYPERLINK(\"#'Table 1 \"&Database!N$11&\"'!$K$35\",\"Warning\"),IF((F234*0.086+F235*0.02388)/F222*-100<Eff_Min_Solar,HYPERLINK(\"#'Table 1 \"&Database!N$11&\"'!$K$35\",\"Warning\"),\"\")))))","v":""},{"$f":"IF(ABS(G226-SUM(G220,G221,G225))>0.002,HYPERLINK(\"#'Table 1 \"&Database!O$11&\"'!$K$32\",\"Error\"),IF(G234+G235=0, IF(G222<>0,HYPERLINK(\"#'Table 1 \"&Database!O$11&\"'!$K$32\",\"Error\"),\"\"), IF(G222=0, HYPERLINK(\"#'Table 1 \"&Database!O$11&\"'!$K$32\",\"Error\"), IF((G234*0.086+G235*0.02388)/G222*-100>Eff_Max_Solar,HYPERLINK(\"#'Table 1 \"&Database!O$11&\"'!$K$35\",\"Warning\"),IF((G234*0.086+G235*0.02388)/G222*-100<Eff_Min_Solar,HYPERLINK(\"#'Table 1 \"&Database!O$11&\"'!$K$35\",\"Warning\"),\"\")))))","v":""},{"$f":"IF(ABS(H226-SUM(H220,H221,H225))>0.002,HYPERLINK(\"#'Table 1 \"&Database!P$11&\"'!$K$32\",\"Error\"),IF(H234+H235=0, IF(H222<>0,HYPERLINK(\"#'Table 1 \"&Database!P$11&\"'!$K$32\",\"Error\"),\"\"), IF(H222=0, HYPERLINK(\"#'Table 1 \"&Database!P$11&\"'!$K$32\",\"Error\"), IF((H234*0.086+H235*0.02388)/H222*-100>Eff_Max_Solar,HYPERLINK(\"#'Table 1 \"&Database!P$11&\"'!$K$35\",\"Warning\"),IF((H234*0.086+H235*0.02388)/H222*-100<Eff_Min_Solar,HYPERLINK(\"#'Table 1 \"&Database!P$11&\"'!$K$35\",\"Warning\"),\"\")))))","v":""},{"$f":"IF(ABS(I226-SUM(I220,I221,I225))>0.002,HYPERLINK(\"#'Table 1 \"&Database!Q$11&\"'!$K$32\",\"Error\"),IF(I234+I235=0, IF(I222<>0,HYPERLINK(\"#'Table 1 \"&Database!Q$11&\"'!$K$32\",\"Error\"),\"\"), IF(I222=0, HYPERLINK(\"#'Table 1 \"&Database!Q$11&\"'!$K$32\",\"Error\"), IF((I234*0.086+I235*0.02388)/I222*-100>Eff_Max_Solar,HYPERLINK(\"#'Table 1 \"&Database!Q$11&\"'!$K$35\",\"Warning\"),IF((I234*0.086+I235*0.02388)/I222*-100<Eff_Min_Solar,HYPERLINK(\"#'Table 1 \"&Database!Q$11&\"'!$K$35\",\"Warning\"),\"\")))))","v":""}]
[]
["Tide, etc…","Historical Data",null,null,"Data Submission This Cycle",null,null,null,null,"Last Cycle Projections"]
[null,{"$f":"Database!B11","v":2016},{"$f":"Database!C11","v":2017},{"$f":"Database!D11","v":2018},{"$f":"E5","v":"2019P"},2020,2030,2040,2050,"2020.LC","2030.LC","2040.LC","2050.LC",null,null,null,null,null,null,null,null,null,null,null,null,1,{"$f":"B239","v":2016},{"$f":"C239","v":2017},{"$f":"D239","v":2018},{"$f":"VALUE(LEFT(E239,4))","v":2019},{"$f":"F239","v":2020},{"$f":"G239","v":2030},{"$f":"H239","v":2040},{"$f":"I239","v":2050},{"$f":"H239","v":2040},{"$f":"I239","v":2050}]
[{"$f":"A32","v":"Production (+)"},{"$f":"Database!J212","v":0},{"$f":"Database!K212","v":0},{"$f":"Database!L212","v":0},0,0,0,0,0,{"$f":"Database!E212","v":0},{"$f":"Database!F212","v":0},{"$f":"Database!G212","v":0},{"$f":"Database!H212","v":0},null,null,null,null,null,null,null,null,null,null,null,null,{"$f":"INDEX(A240:G261,$Z$246,1)","v":"Production (+)"},{"$f":"INDEX(B240:N261,$Z$246,1)","v":0},{"$f":"INDEX(C240:O261,$Z$246,1)","v":0},{"$f":"INDEX(D240:P261,$Z$246,1)","v":0},{"$f":"INDEX(E240:Q261,$Z$246,1)","v":0},{"$f":"IF(AE$3,INDEX(F240:U261,$Z$246,1),NA())","v":{"$error":"#N/A"}},{"$f":"IF(AF$3,INDEX(G240:V261,$Z$246,1),NA())","v":{"$error":"#N/A"}},{"$f":"IF(AG$3,INDEX(H240:W261,$Z$246,1),NA())","v":{"$error":"#N/A"}},{"$f":"IF(AH$3,INDEX(I240:X261,$Z$246,1),NA())","v":{"$error":"#N/A"}},{"$f":"IF(AG$3,INDEX(H240:W261,$Z$246,1),NA())","v":{"$error":"#N/A"}},{"$f":"IF(AH$3,INDEX(I240:X261,$Z$246,1),NA())","v":{"$error":"#N/A"}}]
[{"$f":"A33","v":"Imports (+)"},{"$f":"Database!J213","v":0},{"$f":"Database!K213","v":0},{"$f":"Database!L213","v":0},0,0,0,0,0,{"$f":"Database!E213","v":0},{"$f":"Database!F213","v":0},{"$f":"Database!G213","v":0},{"$f":"Database!H213","v":0}]
["Exports (–)",{"$f":"Database!J214","v":0},{"$f":"Database!K214","v":0},{"$f":"Database!L214","v":0},0,0,0,0,0,{"$f":"Database!E214","v":0},{"$f":"Database!F214","v":0},{"$f":"Database!G214","v":0},{"$f":"Database!H214","v":0}]
["International marine bunkers (–)",{"$f":"Database!J215","v":0},{"$f":"Database!K215","v":0},{"$f":"Database!L215","v":0},0,0,0,0,0,{"$f":"Database!E215","v":0},{"$f":"Database!F215","v":0},{"$f":"Database!G215","v":0},{"$f":"Database!H215","v":0}]
["International aviation bunkers (–)",{"$f":"Database!J216","v":0},{"$f":"Database!K216","v":0},{"$f":"Database!L216","v":0},0,0,0,0,0,{"$f":"Database!E216","v":0},{"$f":"Database!F216","v":0},{"$f":"Database!G216","v":0},{"$f":"Database!H216","v":0}]
["Stock changes (±)",{"$f":"Database!J217","v":0},{"$f":"Database!K217","v":0},{"$f":"Database!L217","v":0},0,0,0,0,0,{"$f":"Database!E217","v":0},{"$f":"Database!F217","v":0},{"$f":"Database!G217","v":0},{"$f":"Database!H217","v":0}]
["Total Energy Supply",{"$f":"Database!J218","v":0},{"$f":"Database!K218","v":0},{"$f":"Database!L218","v":0},{"$f":"SUM(E240:E245)","v":0},0,{"$f":"SUM(G240:G245)","v":0},0,0,{"$f":"Database!E218","v":0},{"$f":"Database!F218","v":0},{"$f":"Database!G218","v":0},{"$f":"Database!H218","v":0},null,null,null,null,null,null,null,null,null,null,null,null,{"$f":"INDEX(Z248:AM248,Z239)","v":1}]
["Transformation processes & Energy industry own use",{"$f":"Database!J219","v":0},{"$f":"Database!K219","v":0},{"$f":"Database!L219","v":0},{"$f":"SUM(E248:E250)","v":0},0,0,0,0,{"$f":"Database!E219","v":0},{"$f":"Database!F219","v":0},{"$f":"Database!G219","v":0},{"$f":"Database!H219","v":0},null,null,null,null,null,null,null,null,null,null,null,null,1,2,3,4,5,6,7,8,9,10,11,13,14,15]
["Electricity, CHP & heat plants (±)",{"$f":"Database!J220","v":0},{"$f":"Database!K220","v":0},{"$f":"Database!L220","v":0},0,0,0,0,0,{"$f":"Database!E220","v":0},{"$f":"Database!F220","v":0},{"$f":"Database!G220","v":0},{"$f":"Database!H220","v":0},null,null,null,null,null,null,null,null,null,null,null,null,1,7,8,9,11,{"$f":"AD248+1","v":12},{"$f":"AE248+1","v":13},{"$f":"AF248+1","v":14},{"$f":"AG248+1","v":15},{"$f":"AH248+1","v":16},{"$f":"AI248+1","v":17},{"$f":"AJ248+1","v":18},21,22]
["Other transformation processes (±)     ",{"$f":"Database!J225","v":0},{"$f":"Database!K225","v":0},{"$f":"Database!L225","v":0},0,0,0,0,0,{"$f":"Database!E225","v":0},{"$f":"Database!F225","v":0},{"$f":"Database!G225","v":0},{"$f":"Database!H225","v":0}]
["Own use and Losses            ",{"$f":"Database!J222","v":0},{"$f":"Database!K222","v":0},{"$f":"Database!L222","v":0},0,0,0,0,0,{"$f":"Database!E222","v":0},{"$f":"Database!F222","v":0},{"$f":"Database!G222","v":0},{"$f":"Database!H222","v":0}]
["Statistical differences (±)",{"$f":"Database!J223","v":0},{"$f":"Database!K223","v":0},{"$f":"Database!L223","v":0},0,0,0,0,0,{"$f":"Database!E223","v":0},{"$f":"Database!F223","v":0},{"$f":"Database!G223","v":0},{"$f":"Database!H223","v":0}]
["Total Final Consumption       ",{"$f":"Database!J224","v":0},{"$f":"Database!K224","v":0},{"$f":"Database!L224","v":0},{"$f":"SUM(E253,E254,E256,E258)","v":0},0,0,0,0,{"$f":"Database!E224","v":0},{"$f":"Database!F224","v":0},{"$f":"Database!G224","v":0},{"$f":"Database!H224","v":0}]
["Industry (+)",{"$f":"Database!J225","v":0},{"$f":"Database!K225","v":0},{"$f":"Database!L225","v":0},0,0,0,0,0,{"$f":"Database!E225","v":0},{"$f":"Database!F225","v":0},{"$f":"Database!G225","v":0},{"$f":"Database!H225","v":0}]
["Transport (+)",{"$f":"Database!J226","v":0},{"$f":"Database!K226","v":0},{"$f":"Database!L226","v":0},0,0,0,0,0,{"$f":"Database!E226","v":0},{"$f":"Database!F226","v":0},{"$f":"Database!G226","v":0},{"$f":"Database!H226","v":0}]
["of which: Road (+)",{"$f":"Database!J227","v":0},{"$f":"Database!K227","v":0},{"$f":"Database!L227","v":0},0,0,0,0,0,{"$f":"Database!E227","v":0},{"$f":"Database!F227","v":0},{"$f":"Database!G227","v":0},{"$f":"Database!H227","v":0}]
["Other (+)",{"$f":"Database!J228","v":0},{"$f":"Database!K228","v":0},{"$f":"Database!L228","v":0},0,0,0,0,0,{"$f":"Database!E228","v":0},{"$f":"Database!F228","v":0},{"$f":"Database!G228","v":0},{"$f":"Database!H228","v":0}]
["of which: Residential (+) ",{"$f":"Database!J229","v":0},{"$f":"Database!K229","v":0},{"$f":"Database!L229","v":0},0,0,0,0,0,{"$f":"Database!E229","v":0},{"$f":"Database!F229","v":0},{"$f":"Database!G229","v":0},{"$f":"Database!H229","v":0}]
["Non-energy use (+)",{"$f":"Database!J234","v":0},{"$f":"Database!K234","v":0},{"$f":"Database!L234","v":0},0,0,0,0,0,{"$f":"Database!E234","v":0},{"$f":"Database!F234","v":0},{"$f":"Database!G234","v":0},{"$f":"Database!H234","v":0}]
["of which: chemical/petrochemical (+)",{"$f":"Database!J235","v":0},{"$f":"Database!K235","v":0},{"$f":"Database!L235","v":0},0,0,0,0,0,{"$f":"Database!E235","v":0},{"$f":"Database!F235","v":0},{"$f":"Database!G235","v":0},{"$f":"Database!H235","v":0}]
["Elec. Gen. Exc. Pumped storage (TWh) (+)",{"$f":"Database!J232","v":0},{"$f":"Database!K232","v":0},{"$f":"Database!L232","v":0},0,0,0,0,0,{"$f":"Database!E232","v":0},{"$f":"Database!F232","v":0},{"$f":"Database!G232","v":0},{"$f":"Database!H232","v":0},null,null,null,null,{"$f":"$Z$240","v":"Production (+)"}]
["Heat generated (PJ) (+)",{"$f":"Database!J233","v":0},{"$f":"Database!K233","v":0},{"$f":"Database!L233","v":0},0,0,0,0,0,{"$f":"Database!E233","v":0},{"$f":"Database!F233","v":0},{"$f":"Database!G233","v":0},{"$f":"Database!H233","v":0}]
[2,null,null,null,{"$f":"IF(ABS(E252-SUM(E246,E247,E251))>0.002,HYPERLINK(\"#'Table 1 \"&Database!M$11&\"'!$K$32\",\"Error\"),IF(E260+E261=0, IF(E248<>0,HYPERLINK(\"#'Table 1 \"&Database!M$11&\"'!$K$32\",\"Error\"),\"\"), IF(E248=0, HYPERLINK(\"#'Table 1 \"&Database!M$11&\"'!$K$32\",\"Error\"), IF((E260*0.086+E261*0.02388)/E248*-100>Eff_Max_Solar,HYPERLINK(\"#'Table 1 \"&Database!M$11&\"'!$K$35\",\"Warning\"),IF((E260*0.086+E261*0.02388)/E248*-100<Eff_Min_Solar,HYPERLINK(\"#'Table 1 \"&Database!M$11&\"'!$K$35\",\"Warning\"),\"\")))))","v":""},{"$f":"IF(ABS(F252-SUM(F246,F247,F251))>0.002,HYPERLINK(\"#'Table 1 \"&Database!N$11&\"'!$K$32\",\"Error\"),IF(F260+F261=0, IF(F248<>0,HYPERLINK(\"#'Table 1 \"&Database!N$11&\"'!$K$32\",\"Error\"),\"\"), IF(F248=0, HYPERLINK(\"#'Table 1 \"&Database!N$11&\"'!$K$32\",\"Error\"), IF((F260*0.086+F261*0.02388)/F248*-100>Eff_Max_Solar,HYPERLINK(\"#'Table 1 \"&Database!N$11&\"'!$K$35\",\"Warning\"),IF((F260*0.086+F261*0.02388)/F248*-100<Eff_Min_Solar,HYPERLINK(\"#'Table 1 \"&Database!N$11&\"'!$K$35\",\"Warning\"),\"\")))))","v":""},{"$f":"IF(ABS(G252-SUM(G246,G247,G251))>0.002,HYPERLINK(\"#'Table 1 \"&Database!O$11&\"'!$K$32\",\"Error\"),IF(G260+G261=0, IF(G248<>0,HYPERLINK(\"#'Table 1 \"&Database!O$11&\"'!$K$32\",\"Error\"),\"\"), IF(G248=0, HYPERLINK(\"#'Table 1 \"&Database!O$11&\"'!$K$32\",\"Error\"), IF((G260*0.086+G261*0.02388)/G248*-100>Eff_Max_Solar,HYPERLINK(\"#'Table 1 \"&Database!O$11&\"'!$K$35\",\"Warning\"),IF((G260*0.086+G261*0.02388)/G248*-100<Eff_Min_Solar,HYPERLINK(\"#'Table 1 \"&Database!O$11&\"'!$K$35\",\"Warning\"),\"\")))))","v":""},{"$f":"IF(ABS(H252-SUM(H246,H247,H251))>0.002,HYPERLINK(\"#'Table 1 \"&Database!P$11&\"'!$K$32\",\"Error\"),IF(H260+H261=0, IF(H248<>0,HYPERLINK(\"#'Table 1 \"&Database!P$11&\"'!$K$32\",\"Error\"),\"\"), IF(H248=0, HYPERLINK(\"#'Table 1 \"&Database!P$11&\"'!$K$32\",\"Error\"), IF((H260*0.086+H261*0.02388)/H248*-100>Eff_Max_Solar,HYPERLINK(\"#'Table 1 \"&Database!P$11&\"'!$K$35\",\"Warning\"),IF((H260*0.086+H261*0.02388)/H248*-100<Eff_Min_Solar,HYPERLINK(\"#'Table 1 \"&Database!P$11&\"'!$K$35\",\"Warning\"),\"\")))))","v":""},{"$f":"IF(ABS(I252-SUM(I246,I247,I251))>0.002,HYPERLINK(\"#'Table 1 \"&Database!Q$11&\"'!$K$32\",\"Error\"),IF(I260+I261=0, IF(I248<>0,HYPERLINK(\"#'Table 1 \"&Database!Q$11&\"'!$K$32\",\"Error\"),\"\"), IF(I248=0, HYPERLINK(\"#'Table 1 \"&Database!Q$11&\"'!$K$32\",\"Error\"), IF((I260*0.086+I261*0.02388)/I248*-100>Eff_Max_Solar,HYPERLINK(\"#'Table 1 \"&Database!Q$11&\"'!$K$35\",\"Warning\"),IF((I260*0.086+I261*0.02388)/I248*-100<Eff_Min_Solar,HYPERLINK(\"#'Table 1 \"&Database!Q$11&\"'!$K$35\",\"Warning\"),\"\")))))","v":""}]
[]
["Biofuels & waste","Historical Data",null,null,"Data Submission This Cycle",null,null,null,null,"Last Cycle Projections"]
[null,{"$f":"Database!B11","v":2016},{"$f":"Database!C11","v":2017},{"$f":"Database!D11","v":2018},{"$f":"E5","v":"2019P"},2020,2030,2040,2050,"2020.LC","2030.LC",{"$f":"L5","v":"2040.LC"},{"$f":"M5","v":"2050.LC"},null,null,null,null,null,null,null,null,null,null,null,null,1,{"$f":"B265","v":2016},{"$f":"C265","v":2017},{"$f":"D265","v":2018},{"$f":"VALUE(LEFT(E265,4))","v":2019},{"$f":"F265","v":2020},{"$f":"G265","v":2030},{"$f":"H265","v":2040},{"$f":"I265","v":2050},{"$f":"H265","v":2040},{"$f":"I265","v":2050}]
[{"$f":"A6","v":"Production (+)"},{"$f":"Database!J234","v":0},{"$f":"Database!K234","v":0},{"$f":"Database!L234","v":0},0,0,0,0,0,{"$f":"Database!E234","v":0},{"$f":"Database!F234","v":0},{"$f":"Database!G234","v":0},{"$f":"Database!H234","v":0},null,null,null,null,null,null,null,null,null,null,null,null,{"$f":"INDEX(A266:G287,$Z$267,1)","v":"Production (+)"},{"$f":"INDEX(B266:N287,$Z$265,1)","v":0},{"$f":"INDEX(C266:O287,$Z$265,1)","v":0},{"$f":"INDEX(D266:P287,$Z$265,1)","v":0},{"$f":"INDEX(E266:Q287,$Z$265,1)","v":0},{"$f":"IF(AE$3,INDEX(F266:U287,$Z$265,1),NA())","v":{"$error":"#N/A"}},{"$f":"IF(AF$3,INDEX(G266:V287,$Z$265,1),NA())","v":{"$error":"#N/A"}},{"$f":"IF(AG$3,INDEX(H266:W287,$Z$265,1),NA())","v":{"$error":"#N/A"}},{"$f":"IF(AH$3,INDEX(I266:X287,$Z$265,1),NA())","v":{"$error":"#N/A"}},{"$f":"IF(AG$3,INDEX(H266:W287,$Z$265,1),NA())","v":{"$error":"#N/A"}},{"$f":"IF(AH$3,INDEX(I266:X287,$Z$265,1),NA())","v":{"$error":"#N/A"}}]
["Imports (+)",{"$f":"Database!J235","v":0},{"$f":"Database!K235","v":0},{"$f":"Database!L235","v":0},0,0,0,0,0,{"$f":"Database!E235","v":0},{"$f":"Database!F235","v":0},{"$f":"Database!G235","v":0},{"$f":"Database!H235","v":0},null,null,null,null,null,null,null,null,null,null,null,null,{"$f":"INDEX(Z269:AS269,Z265)","v":1}]
["Exports (–)",{"$f":"Database!J236","v":0},{"$f":"Database!K236","v":0},{"$f":"Database!L236","v":0},0,0,0,0,0,{"$f":"Database!E236","v":0},{"$f":"Database!F236","v":0},{"$f":"Database!G236","v":0},{"$f":"Database!H236","v":0},null,null,null,null,null,null,null,null,null,null,null,null,1,2,3,4,5,6,7,8,9,10,11,12,13,14,15,16,17,18,19,20]
["International marine bunkers (–)",{"$f":"Database!J237","v":0},{"$f":"Database!K237","v":0},{"$f":"Database!L237","v":0},0,0,0,0,0,{"$f":"Database!E237","v":0},{"$f":"Database!F237","v":0},{"$f":"Database!G237","v":0},{"$f":"Database!H237","v":0},null,null,null,null,null,null,null,null,null,null,null,null,1,2,3,4,5,6,7,8,9,10,11,12,13,14,15,16,17,18,21,22]
["International aviation bunkers (–)",{"$f":"Database!J238","v":0},{"$f":"Database!K238","v":0},{"$f":"Database!L238","v":0},0,0,0,0,0,{"$f":"Database!E238","v":0},{"$f":"Database!F238","v":0},{"$f":"Database!G238","v":0},{"$f":"Database!H238","v":0}]
["Stock changes (±)",{"$f":"Database!J239","v":0},{"$f":"Database!K239","v":0},{"$f":"Database!L239","v":0},0,0,0,0,null,{"$f":"Database!E239","v":0},{"$f":"Database!F239","v":0},{"$f":"Database!G239","v":0},{"$f":"Database!H239","v":0}]
["Total Energy Supply",{"$f":"Database!J240","v":0},{"$f":"Database!K240","v":0},{"$f":"Database!L240","v":0},{"$f":"SUM(E266:E271)","v":0},{"$f":"SUM(F266:F271)","v":0},{"$f":"SUM(G266:G271)","v":0},{"$f":"SUM(H266:H271)","v":0},{"$f":"SUM(I266:I271)","v":0},{"$f":"Database!E240","v":0},{"$f":"Database!F240","v":0},{"$f":"Database!G240","v":0},{"$f":"Database!H240","v":0}]
["Transformation processes & Energy industry own use",{"$f":"Database!J241","v":0},{"$f":"Database!K241","v":0},{"$f":"Database!L241","v":0},{"$f":"SUM(E274:E276)","v":0},{"$f":"SUM(F274:F276)","v":0},{"$f":"SUM(G274:G276)","v":0},{"$f":"SUM(H274:H276)","v":0},{"$f":"SUM(I274:I276)","v":0},{"$f":"Database!E241","v":0},{"$f":"Database!F241","v":0},{"$f":"Database!G241","v":0},{"$f":"Database!H241","v":0}]
["Electricity, CHP & heat plants (±)",{"$f":"Database!J242","v":0},{"$f":"Database!K242","v":0},{"$f":"Database!L242","v":0},0,0,0,0,0,{"$f":"Database!E242","v":0},{"$f":"Database!F242","v":0},{"$f":"Database!G242","v":0},{"$f":"Database!H242","v":0}]
["Other transformation processes (±)     ",{"$f":"Database!J243","v":0},{"$f":"Database!K243","v":0},{"$f":"Database!L243","v":0},0,0,0,0,0,{"$f":"Database!E243","v":0},{"$f":"Database!F243","v":0},{"$f":"Database!G243","v":0},{"$f":"Database!H243","v":0}]
["Own use and Losses            ",{"$f":"Database!J244","v":0},{"$f":"Database!K244","v":0},{"$f":"Database!L244","v":0},0,0,0,0,0,{"$f":"Database!E244","v":0},{"$f":"Database!F244","v":0},{"$f":"Database!G244","v":0},{"$f":"Database!H244","v":0}]
["Statistical differences (±)",{"$f":"Database!J245","v":0},{"$f":"Database!K245","v":0},{"$f":"Database!L245","v":0},0,0,0,0,0,{"$f":"Database!E245","v":0},{"$f":"Database!F245","v":0},{"$f":"Database!G245","v":0},{"$f":"Database!H245","v":0}]
["Total Final Consumption       ",{"$f":"Database!J246","v":0},{"$f":"Database!K246","v":0},{"$f":"Database!L246","v":0},{"$f":"SUM(E279,E280,E282,E284)","v":0},{"$f":"SUM(F279,F280,F282,F284)","v":0},{"$f":"SUM(G279,G280,G282,G284)","v":0},{"$f":"SUM(H279,H280,H282,H284)","v":0},{"$f":"SUM(I279,I280,I282,I284)","v":0},{"$f":"Database!E246","v":0},{"$f":"Database!F246","v":0},{"$f":"Database!G246","v":0},{"$f":"Database!H246","v":0}]
["Industry (+)",{"$f":"Database!J247","v":0},{"$f":"Database!K247","v":0},{"$f":"Database!L247","v":0},0,0,0,0,0,{"$f":"Database!E247","v":0},{"$f":"Database!F247","v":0},{"$f":"Database!G247","v":0},{"$f":"Database!H247","v":0}]
["Transport (+)",{"$f":"Database!J248","v":0},{"$f":"Database!K248","v":0},{"$f":"Database!L248","v":0},0,0,0,0,0,{"$f":"Database!E248","v":0},{"$f":"Database!F248","v":0},{"$f":"Database!G248","v":0},{"$f":"Database!H248","v":0}]
["of which: Road (+)",{"$f":"Database!J249","v":0},{"$f":"Database!K249","v":0},{"$f":"Database!L249","v":0},0,0,0,0,0,{"$f":"Database!E249","v":0},{"$f":"Database!F249","v":0},{"$f":"Database!G249","v":0},{"$f":"Database!H249","v":0}]
["Other (+)",{"$f":"Database!J250","v":0},{"$f":"Database!K250","v":0},{"$f":"Database!L250","v":0},0,0,0,0,0,{"$f":"Database!E250","v":0},{"$f":"Database!F250","v":0},{"$f":"Database!G250","v":0},{"$f":"Database!H250","v":0}]
["of which: Residential (+) ",{"$f":"Database!J251","v":0},{"$f":"Database!K251","v":0},{"$f":"Database!L251","v":0},0,0,0,0,0,{"$f":"Database!E251","v":0},{"$f":"Database!F251","v":0},{"$f":"Database!G251","v":0},{"$f":"Database!H251","v":0}]
["Non-energy use (+)",{"$f":"Database!J230","v":0},{"$f":"Database!K230","v":0},{"$f":"Database!L230","v":0},0,0,0,0,0,{"$f":"Database!E230","v":0},{"$f":"Database!F230","v":0},{"$f":"Database!G230","v":0},{"$f":"Database!H230","v":0}]
["of which: chemical/petrochemical (+)",{"$f":"Database!J231","v":0},{"$f":"Database!K231","v":0},{"$f":"Database!L231","v":0},0,0,0,0,0,{"$f":"Database!E231","v":0},{"$f":"Database!F231","v":0},{"$f":"Database!G231","v":0},{"$f":"Database!H231","v":0}]
["Elec. Gen. Exc. Pumped storage (TWh) (+)",{"$f":"Database!J254","v":0},{"$f":"Database!K254","v":0},{"$f":"Database!L254","v":0},0,0,0,0,0,{"$f":"Database!E254","v":0},{"$f":"Database!F254","v":0},{"$f":"Database!G254","v":0},{"$f":"Database!H254","v":0}]
["Heat generated (PJ) (+)",{"$f":"Database!J255","v":0},{"$f":"Database!K255","v":0},{"$f":"Database!L255","v":0},0,0,0,0,0,{"$f":"Database!E255","v":0},{"$f":"Database!F255","v":0},{"$f":"Database!G255","v":0},{"$f":"Database!H255","v":0},null,null,null,null,{"$f":"Z266","v":"Production (+)"}]
[null,null,null,null,{"$f":"IF(ABS(E278-SUM(E272,E273,E277))>0.002,HYPERLINK(\"#'Table 1 \"&Database!M$11&\"'!$L$32\",\"Error\"),IF(E286+E287=0, IF(E274<>0,HYPERLINK(\"#'Table 1 \"&Database!M$11&\"'!$L$32\",\"Error\"),\"\"), IF(E274=0, HYPERLINK(\"#'Table 1 \"&Database!M$11&\"'!$L$32\",\"Error\"), IF((E286*0.086+E287*0.02388)/E274*-100>Eff_Max_CombRenew,HYPERLINK(\"#'Table 1 \"&Database!M$11&\"'!$L$35\",\"Warning\"),IF((E286*0.086+E287*0.02388)/E274*-100<Eff_Min_CombRenew,HYPERLINK(\"#'Table 1 \"&Database!M$11&\"'!$L$35\",\"Warning\"),\"\")))))","v":""},{"$f":"IF(ABS(F278-SUM(F272,F273,F277))>0.002,HYPERLINK(\"#'Table 1 \"&Database!N$11&\"'!$L$32\",\"Error\"),IF(F286+F287=0, IF(F274<>0,HYPERLINK(\"#'Table 1 \"&Database!N$11&\"'!$L$32\",\"Error\"),\"\"), IF(F274=0, HYPERLINK(\"#'Table 1 \"&Database!N$11&\"'!$L$32\",\"Error\"), IF((F286*0.086+F287*0.02388)/F274*-100>Eff_Max_CombRenew,HYPERLINK(\"#'Table 1 \"&Database!N$11&\"'!$L$35\",\"Warning\"),IF((F286*0.086+F287*0.02388)/F274*-100<Eff_Min_CombRenew,HYPERLINK(\"#'Table 1 \"&Database!N$11&\"'!$L$35\",\"Warning\"),\"\")))))","v":""},{"$f":"IF(ABS(G278-SUM(G272,G273,G277))>0.002,HYPERLINK(\"#'Table 1 \"&Database!O$11&\"'!$L$32\",\"Error\"),IF(G286+G287=0, IF(G274<>0,HYPERLINK(\"#'Table 1 \"&Database!O$11&\"'!$L$32\",\"Error\"),\"\"), IF(G274=0, HYPERLINK(\"#'Table 1 \"&Database!O$11&\"'!$L$32\",\"Error\"), IF((G286*0.086+G287*0.02388)/G274*-100>Eff_Max_CombRenew,HYPERLINK(\"#'Table 1 \"&Database!O$11&\"'!$L$35\",\"Warning\"),IF((G286*0.086+G287*0.02388)/G274*-100<Eff_Min_CombRenew,HYPERLINK(\"#'Table 1 \"&Database!O$11&\"'!$L$35\",\"Warning\"),\"\")))))","v":""},{"$f":"IF(ABS(H278-SUM(H272,H273,H277))>0.002,HYPERLINK(\"#'Table 1 \"&Database!P$11&\"'!$L$32\",\"Error\"),IF(H286+H287=0, IF(H274<>0,HYPERLINK(\"#'Table 1 \"&Database!P$11&\"'!$L$32\",\"Error\"),\"\"), IF(H274=0, HYPERLINK(\"#'Table 1 \"&Database!P$11&\"'!$L$32\",\"Error\"), IF((H286*0.086+H287*0.02388)/H274*-100>Eff_Max_CombRenew,HYPERLINK(\"#'Table 1 \"&Database!P$11&\"'!$L$35\",\"Warning\"),IF((H286*0.086+H287*0.02388)/H274*-100<Eff_Min_CombRenew,HYPERLINK(\"#'Table 1 \"&Database!P$11&\"'!$L$35\",\"Warning\"),\"\")))))","v":""},{"$f":"IF(ABS(I278-SUM(I272,I273,I277))>0.002,HYPERLINK(\"#'Table 1 \"&Database!Q$11&\"'!$L$32\",\"Error\"),IF(I286+I287=0, IF(I274<>0,HYPERLINK(\"#'Table 1 \"&Database!Q$11&\"'!$L$32\",\"Error\"),\"\"), IF(I274=0, HYPERLINK(\"#'Table 1 \"&Database!Q$11&\"'!$L$32\",\"Error\"), IF((I286*0.086+I287*0.02388)/I274*-100>Eff_Max_CombRenew,HYPERLINK(\"#'Table 1 \"&Database!Q$11&\"'!$L$35\",\"Warning\"),IF((I286*0.086+I287*0.02388)/I274*-100<Eff_Min_CombRenew,HYPERLINK(\"#'Table 1 \"&Database!Q$11&\"'!$L$35\",\"Warning\"),\"\")))))","v":""}]
[]
["Electricity","Historical Data",null,null,"Data Submission This Cycle",null,null,null,null,"Last Cycle Projections"]
[null,{"$f":"Database!B11","v":2016},{"$f":"Database!C11","v":2017},{"$f":"Database!D11","v":2018},{"$f":"E5","v":"2019P"},2020,2030,2040,2050,"2020.LC","2030.LC","2040.LC","2050.LC",null,null,null,null,null,null,null,null,null,null,null,null,1,{"$f":"B291","v":2016},{"$f":"C291","v":2017},{"$f":"D291","v":2018},{"$f":"VALUE(LEFT(E291,4))","v":2019},{"$f":"F291","v":2020},{"$f":"G291","v":2030},{"$f":"H291","v":2040},{"$f":"I291","v":2050},{"$f":"H291","v":2040},{"$f":"I291","v":2050}]
[{"$f":"A6","v":"Production (+)"},{"$f":"Database!J256","v":0},{"$f":"Database!K256","v":0},{"$f":"Database!L256","v":0},0,0,0,0,0,{"$f":"Database!E256","v":0},{"$f":"Database!F256","v":0},{"$f":"Database!G256","v":0},{"$f":"Database!H256","v":0}]
["Imports (+)",{"$f":"Database!J257","v":0},{"$f":"Database!K257","v":0},{"$f":"Database!L257","v":0},0,0,0,0,0,{"$f":"Database!E257","v":0},{"$f":"Database!F257","v":0},{"$f":"Database!G257","v":0},{"$f":"Database!H257","v":0},null,null,null,null,null,null,null,null,null,null,null,null,{"$f":"INDEX(A292:G313,$Z$298,1)","v":"Production (+)"},{"$f":"INDEX(B292:N313,$Z$298,1)","v":0},{"$f":"INDEX(C292:O313,$Z$298,1)","v":0},{"$f":"INDEX(D292:P313,$Z$298,1)","v":0},{"$f":"INDEX(E292:Q313,$Z$298,1)","v":0},{"$f":"IF(AE$3,INDEX(F293:U314,$Z$298,1),NA())","v":{"$error":"#N/A"}},{"$f":"IF(AF$3,INDEX(G293:V314,$Z$298,1),NA())","v":{"$error":"#N/A"}},{"$f":"IF(AG$3,INDEX(H293:W314,$Z$298,1),NA())","v":{"$error":"#N/A"}},{"$f":"IF(AH$3,INDEX(I293:X314,$Z$298,1),NA())","v":{"$error":"#N/A"}},{"$f":"IF(AG$3,INDEX(H293:W314,$Z$298,1),NA())","v":{"$error":"#N/A"}},{"$f":"IF(AH$3,INDEX(I293:X314,$Z$298,1),NA())","v":{"$error":"#N/A"}}]
["Exports (–)",{"$f":"Database!J258","v":0},{"$f":"Database!K258","v":0},{"$f":"Database!L258","v":0},0,0,0,0,0,{"$f":"Database!E258","v":0},{"$f":"Database!F258","v":0},{"$f":"Database!G258","v":0},{"$f":"Database!H258","v":0}]
["International marine bunkers (–)",{"$f":"Database!J259","v":0},{"$f":"Database!K259","v":0},{"$f":"Database!L259","v":0},0,0,0,0,0,{"$f":"Database!E259","v":0},{"$f":"Database!F259","v":0},{"$f":"Database!G259","v":0},{"$f":"Database!H259","v":0}]
["International aviation bunkers (–)",{"$f":"Database!J260","v":0},{"$f":"Database!K260","v":0},{"$f":"Database!L260","v":0},0,0,0,0,0,{"$f":"Database!E260","v":0},{"$f":"Database!F260","v":0},{"$f":"Database!G260","v":0},{"$f":"Database!H260","v":0}]
["Stock changes (±)",{"$f":"Database!J261","v":0},{"$f":"Database!K261","v":0},{"$f":"Database!L261","v":0},0,0,0,0,0,{"$f":"Database!E261","v":0},{"$f":"Database!F261","v":0},{"$f":"Database!G261","v":0},{"$f":"Database!H261","v":0}]
["Total Energy Supply",{"$f":"Database!J262","v":0},{"$f":"Database!K262","v":0},{"$f":"Database!L262","v":0},{"$f":"SUM(E292:E297)","v":0},{"$f":"SUM(F292:F297)","v":0},0,0,0,{"$f":"Database!E262","v":0},{"$f":"Database!F262","v":0},{"$f":"Database!G262","v":0},{"$f":"Database!H262","v":0},null,null,null,null,null,null,null,null,null,null,null,null,{"$f":"INDEX(Z300:AR300,Z291)","v":1}]
["Transformation processes & Energy industry own use",{"$f":"Database!J263","v":0},{"$f":"Database!K263","v":0},{"$f":"Database!L263","v":0},{"$f":"SUM(E300:E302)","v":0},{"$f":"SUM(F300:F302)","v":0},0,0,0,{"$f":"Database!E263","v":0},{"$f":"Database!F263","v":0},{"$f":"Database!G263","v":0},{"$f":"Database!H263","v":0},null,null,null,null,null,null,null,null,null,null,null,null,1,2,3,4,5,6,7,8,9,10,11,12,13]
["Electricity, CHP & heat plants (±)",{"$f":"Database!J264","v":0},{"$f":"Database!K264","v":0},{"$f":"Database!L264","v":0},0,0,0,0,0,{"$f":"Database!E264","v":0},{"$f":"Database!F264","v":0},{"$f":"Database!G264","v":0},{"$f":"Database!H264","v":0},null,null,null,null,null,null,null,null,null,null,null,null,1,2,3,7,8,9,11,{"$f":"AF300+1","v":12},{"$f":"AG300+1","v":13},{"$f":"AH300+1","v":14},{"$f":"AI300+1","v":15},{"$f":"AJ300+1","v":16},{"$f":"AK300+1","v":17}]
["Other transformation processes (±)     ",{"$f":"Database!J243","v":0},{"$f":"Database!K243","v":0},{"$f":"Database!L243","v":0},0,0,0,0,0,{"$f":"Database!E243","v":0},{"$f":"Database!F243","v":0},{"$f":"Database!G243","v":0},{"$f":"Database!H243","v":0}]
["Own use and Losses            ",{"$f":"Database!J266","v":0},{"$f":"Database!K266","v":0},{"$f":"Database!L266","v":0},0,0,0,0,0,{"$f":"Database!E266","v":0},{"$f":"Database!F266","v":0},{"$f":"Database!G266","v":0},{"$f":"Database!H266","v":0}]
["Statistical differences (±)",{"$f":"Database!J267","v":0},{"$f":"Database!K267","v":0},{"$f":"Database!L267","v":0},0,0,0,0,0,{"$f":"Database!E267","v":0},{"$f":"Database!F267","v":0},{"$f":"Database!G267","v":0},{"$f":"Database!H267","v":0}]
["Total Final Consumption       ",{"$f":"Database!J268","v":0},{"$f":"Database!K268","v":0},{"$f":"Database!L268","v":0},{"$f":"SUM(E305,E306,E308,E310)","v":0},{"$f":"SUM(F305,F306,F308,F310)","v":0},0,0,0,{"$f":"Database!E268","v":0},{"$f":"Database!F268","v":0},{"$f":"Database!G268","v":0},{"$f":"Database!H268","v":0}]
["Industry (+)",{"$f":"Database!J269","v":0},{"$f":"Database!K269","v":0},{"$f":"Database!L269","v":0},0,0,0,0,0,{"$f":"Database!E269","v":0},{"$f":"Database!F269","v":0},{"$f":"Database!G269","v":0},{"$f":"Database!H269","v":0}]
["Transport (+)",{"$f":"Database!J270","v":0},{"$f":"Database!K270","v":0},{"$f":"Database!L270","v":0},0,0,0,0,0,{"$f":"Database!E270","v":0},{"$f":"Database!F270","v":0},{"$f":"Database!G270","v":0},{"$f":"Database!H270","v":0}]
["of which: Road (+)",{"$f":"Database!J271","v":0},{"$f":"Database!K271","v":0},{"$f":"Database!L271","v":0},0,0,0,0,0,{"$f":"Database!E271","v":0},{"$f":"Database!F271","v":0},{"$f":"Database!G271","v":0},{"$f":"Database!H271","v":0}]
["Other (+)",{"$f":"Database!J272","v":0},{"$f":"Database!K272","v":0},{"$f":"Database!L272","v":0},0,0,0,0,0,{"$f":"Database!E272","v":0},{"$f":"Database!F272","v":0},{"$f":"Database!G272","v":0},{"$f":"Database!H272","v":0}]
["of which: Residential (+) ",{"$f":"Database!J273","v":0},{"$f":"Database!K273","v":0},{"$f":"Database!L273","v":0},0,0,0,0,0,{"$f":"Database!E273","v":0},{"$f":"Database!F273","v":0},{"$f":"Database!G273","v":0},{"$f":"Database!H273","v":0},null,null,null,null,{"$f":"$Z$293","v":"Production (+)"}]
["Non-energy use (+)",{"$f":"Database!J252","v":0},{"$f":"Database!K252","v":0},{"$f":"Database!L252","v":0},0,0,0,0,0,{"$f":"Database!E252","v":0},{"$f":"Database!F252","v":0},{"$f":"Database!G252","v":0},{"$f":"Database!H252","v":0}]
["of which: chemical/petrochemical (+)",{"$f":"Database!J253","v":0},{"$f":"Database!K253","v":0},{"$f":"Database!L253","v":0},0,0,0,0,0,{"$f":"Database!E253","v":0},{"$f":"Database!F253","v":0},{"$f":"Database!G253","v":0},{"$f":"Database!H253","v":0}]
["Elec. Gen. Exc. Pumped storage (TWh) (+)",{"$f":"Database!J254","v":0},{"$f":"Database!K254","v":0},{"$f":"Database!L254","v":0},0,0,0,0,0,{"$f":"Database!E254","v":0},{"$f":"Database!F254","v":0},{"$f":"Database!G254","v":0},{"$f":"Database!H254","v":0}]
["Heat generated (PJ) (+)",{"$f":"Database!J277","v":0},{"$f":"Database!K277","v":0},{"$f":"Database!L277","v":0},0,0,0,0,0,{"$f":"Database!E277","v":0},{"$f":"Database!F277","v":0},{"$f":"Database!G277","v":0},{"$f":"Database!H277","v":0}]
[null,null,null,null,{"$f":"IF(ABS(E304-SUM(E298,E299,E303))>0.002,HYPERLINK(\"#'Table 1 \"&Database!M$11&\"'!$M$32\",\"Error\"),\"\")","v":""},{"$f":"IF(ABS(F304-SUM(F298,F299,F303))>0.002,HYPERLINK(\"#'Table 1 \"&Database!N$11&\"'!$M$32\",\"Error\"),\"\")","v":""},{"$f":"IF(ABS(G304-SUM(G298,G299,G303))>0.002,HYPERLINK(\"#'Table 1 \"&Database!O$11&\"'!$M$32\",\"Error\"),\"\")","v":""},{"$f":"IF(ABS(H304-SUM(H298,H299,H303))>0.002,HYPERLINK(\"#'Table 1 \"&Database!P$11&\"'!$M$32\",\"Error\"),\"\")","v":""},{"$f":"IF(ABS(I304-SUM(I298,I299,I303))>0.002,HYPERLINK(\"#'Table 1 \"&Database!Q$11&\"'!$M$32\",\"Error\"),\"\")","v":""}]
[]
["Heat","Historical Data",null,null,"Data Submission This Cycle",null,null,null,null,"Last Cycle Projections"]
[null,{"$f":"Database!B11","v":2016},{"$f":"Database!C11","v":2017},{"$f":"Database!D11","v":2018},{"$f":"E5","v":"2019P"},2020,2030,2040,2050,"2020.LC","2030.LC",{"$f":"L5","v":"2040.LC"},{"$f":"M5","v":"2050.LC"},null,null,null,null,null,null,null,null,null,null,null,null,1,{"$f":"B317","v":2016},{"$f":"C317","v":2017},{"$f":"D317","v":2018},{"$f":"VALUE(LEFT(E317,4))","v":2019},{"$f":"F317","v":2020},{"$f":"G317","v":2030},{"$f":"H317","v":2040},{"$f":"I317","v":2050},{"$f":"H317","v":2040},{"$f":"I317","v":2050}]
[{"$f":"A6","v":"Production (+)"},{"$f":"Database!J278","v":0},{"$f":"Database!K278","v":0},{"$f":"Database!L278","v":0},0,0,0,0,0,{"$f":"Database!E278","v":0},{"$f":"Database!F278","v":0},{"$f":"Database!G278","v":0},{"$f":"Database!H278","v":0},null,null,null,null,null,null,null,null,null,null,null,null,{"$f":"INDEX(A318:G339,$Z$324,1)","v":"Production (+)"},{"$f":"INDEX(B318:N339,$Z$324,1)","v":0},{"$f":"INDEX(C318:O339,$Z$324,1)","v":0},{"$f":"INDEX(D318:P339,$Z$324,1)","v":0},{"$f":"INDEX(E318:Q339,$Z$324,1)","v":0},{"$f":"IF(AE$3,INDEX(F318:U339,$Z$324,1),NA())","v":{"$error":"#N/A"}},{"$f":"IF(AF$3,INDEX(G318:V339,$Z$324,1),NA())","v":{"$error":"#N/A"}},{"$f":"IF(AG$3,INDEX(H318:W339,$Z$324,1),NA())","v":{"$error":"#N/A"}},{"$f":"IF(AH$3,INDEX(I318:X339,$Z$324,1),NA())","v":{"$error":"#N/A"}},{"$f":"IF(AG$3,INDEX(H318:W339,$Z$324,1),NA())","v":{"$error":"#N/A"}},{"$f":"IF(AH$3,INDEX(I318:X339,$Z$324,1),NA())","v":{"$error":"#N/A"}}]
["Imports (+)",{"$f":"Database!J279","v":0},{"$f":"Database!K279","v":0},{"$f":"Database!L279","v":0},0,0,0,0,0,{"$f":"Database!E279","v":0},{"$f":"Database!F279","v":0},{"$f":"Database!G279","v":0},{"$f":"Database!H279","v":0}]
["Exports (–)",{"$f":"Database!J280","v":0},{"$f":"Database!K280","v":0},{"$f":"Database!L280","v":0},0,0,0,0,0,{"$f":"Database!E280","v":0},{"$f":"Database!F280","v":0},{"$f":"Database!G280","v":0},{"$f":"Database!H280","v":0}]
["International marine bunkers (–)",{"$f":"Database!J281","v":0},{"$f":"Database!K281","v":0},{"$f":"Database!L281","v":0},0,0,0,0,0,{"$f":"Database!E281","v":0},{"$f":"Database!F281","v":0},{"$f":"Database!G281","v":0},{"$f":"Database!H281","v":0}]
["International aviation bunkers (–)",{"$f":"Database!J282","v":0},{"$f":"Database!K282","v":0},{"$f":"Database!L282","v":0},0,0,0,0,0,{"$f":"Database!E282","v":0},{"$f":"Database!F282","v":0},{"$f":"Database!G282","v":0},{"$f":"Database!H282","v":0}]
["Stock changes (±)",{"$f":"Database!J283","v":0},{"$f":"Database!K283","v":0},{"$f":"Database!L283","v":0},0,0,0,0,0,{"$f":"Database!E283","v":0},{"$f":"Database!F283","v":0},{"$f":"Database!G283","v":0},{"$f":"Database!H283","v":0}]
["Total Energy Supply",{"$f":"Database!J284","v":0},{"$f":"Database!K284","v":0},{"$f":"Database!L284","v":0},{"$f":"SUM(E318:E323)","v":0},{"$f":"SUM(F318:F323)","v":0},0,0,0,{"$f":"Database!E284","v":0},{"$f":"Database!F284","v":0},{"$f":"Database!G284","v":0},{"$f":"Database!H284","v":0},null,null,null,null,null,null,null,null,null,null,null,null,{"$f":"INDEX(Z326:AR326,Z317)","v":1}]
["Transformation processes & Energy industry own use",{"$f":"Database!J285","v":0},{"$f":"Database!K285","v":0},{"$f":"Database!L285","v":0},{"$f":"SUM(E326:E328)","v":0},{"$f":"SUM(F326:F328)","v":0},0,0,0,{"$f":"Database!E285","v":0},{"$f":"Database!F285","v":0},{"$f":"Database!G285","v":0},{"$f":"Database!H285","v":0},null,null,null,null,null,null,null,null,null,null,null,null,1,2,3,4,5,6,7,8,9,10,11,12,13,14,15]
["Electricity, CHP & heat plants (±)",{"$f":"Database!J286","v":0},{"$f":"Database!K286","v":0},{"$f":"Database!L286","v":0},0,0,0,0,0,{"$f":"Database!E286","v":0},{"$f":"Database!F286","v":0},{"$f":"Database!G286","v":0},{"$f":"Database!H286","v":0},null,null,null,null,null,null,null,null,null,null,null,null,1,2,3,7,8,9,11,{"$f":"AF326+1","v":12},13,{"$f":"AH326+1","v":14},{"$f":"AI326+1","v":15},16,17,21,22]
["Other transformation processes (±)     ",{"$f":"Database!J265","v":0},{"$f":"Database!K265","v":0},{"$f":"Database!L265","v":0},0,0,0,0,0,{"$f":"Database!E265","v":0},{"$f":"Database!F265","v":0},{"$f":"Database!G265","v":0},{"$f":"Database!H265","v":0}]
["Own use and Losses            ",{"$f":"Database!J288","v":0},{"$f":"Database!K288","v":0},{"$f":"Database!L288","v":0},0,0,0,0,0,{"$f":"Database!E288","v":0},{"$f":"Database!F288","v":0},{"$f":"Database!G288","v":0},{"$f":"Database!H288","v":0}]
["Statistical differences (±)",{"$f":"Database!J289","v":0},{"$f":"Database!K289","v":0},{"$f":"Database!L289","v":0},0,0,0,0,0,{"$f":"Database!E289","v":0},{"$f":"Database!F289","v":0},{"$f":"Database!G289","v":0},{"$f":"Database!H289","v":0}]
["Total Final Consumption       ",{"$f":"Database!J290","v":0},{"$f":"Database!K290","v":0},{"$f":"Database!L290","v":0},{"$f":"SUM(E331,E332,E334,E336)","v":0},{"$f":"SUM(F331,F332,F334,F336)","v":0},0,0,0,{"$f":"Database!E290","v":0},{"$f":"Database!F290","v":0},{"$f":"Database!G290","v":0},{"$f":"Database!H290","v":0}]
["Industry (+)",{"$f":"Database!J291","v":0},{"$f":"Database!K291","v":0},{"$f":"Database!L291","v":0},0,0,0,0,0,{"$f":"Database!E291","v":0},{"$f":"Database!F291","v":0},{"$f":"Database!G291","v":0},{"$f":"Database!H291","v":0}]
["Transport (+)",{"$f":"Database!J292","v":0},{"$f":"Database!K292","v":0},{"$f":"Database!L292","v":0},0,0,0,0,0,{"$f":"Database!E292","v":0},{"$f":"Database!F292","v":0},{"$f":"Database!G292","v":0},{"$f":"Database!H292","v":0}]
["of which: Road (+)",{"$f":"Database!J293","v":0},{"$f":"Database!K293","v":0},{"$f":"Database!L293","v":0},0,0,0,0,0,{"$f":"Database!E293","v":0},{"$f":"Database!F293","v":0},{"$f":"Database!G293","v":0},{"$f":"Database!H293","v":0}]
["Other (+)",{"$f":"Database!J294","v":0},{"$f":"Database!K294","v":0},{"$f":"Database!L294","v":0},0,0,0,0,0,{"$f":"Database!E294","v":0},{"$f":"Database!F294","v":0},{"$f":"Database!G294","v":0},{"$f":"Database!H294","v":0}]
["of which: Residential (+) ",{"$f":"Database!J295","v":0},{"$f":"Database!K295","v":0},{"$f":"Database!L295","v":0},0,0,0,0,0,{"$f":"Database!E295","v":0},{"$f":"Database!F295","v":0},{"$f":"Database!G295","v":0},{"$f":"Database!H295","v":0}]
["Non-energy use (+)",{"$f":"Database!J274","v":0},{"$f":"Database!K274","v":0},{"$f":"Database!L274","v":0},0,0,0,0,0,{"$f":"Database!E274","v":0},{"$f":"Database!F274","v":0},{"$f":"Database!G274","v":0},{"$f":"Database!H274","v":0}]
["of which: chemical/petrochemical (+)",{"$f":"Database!J275","v":0},{"$f":"Database!K275","v":0},{"$f":"Database!L275","v":0},0,0,0,0,0,{"$f":"Database!E275","v":0},{"$f":"Database!F275","v":0},{"$f":"Database!G275","v":0},{"$f":"Database!H275","v":0}]
["Elec. Gen. Exc. Pumped storage (TWh) (+)",{"$f":"Database!J298","v":0},{"$f":"Database!K298","v":0},{"$f":"Database!L298","v":0},0,0,0,0,0,{"$f":"Database!E298","v":0},{"$f":"Database!F298","v":0},{"$f":"Database!G298","v":0},{"$f":"Database!H298","v":0},null,null,null,null,{"$f":"$Z$318","v":"Production (+)"}]
["Heat generated (PJ) (+)",{"$f":"Database!J299","v":0},{"$f":"Database!K299","v":0},{"$f":"Database!L299","v":0},0,0,0,0,0,{"$f":"Database!E299","v":0},{"$f":"Database!F299","v":0},{"$f":"Database!G299","v":0},{"$f":"Database!H299","v":0}]
[null,null,null,null,{"$f":"IF(ABS(E330-SUM(E324,E325,E329))>0.002,HYPERLINK(\"#'Table 1 \"&Database!M$11&\"'!$N$32\",\"Error\"),\"\")","v":""},{"$f":"IF(ABS(F330-SUM(F324,F325,F329))>0.002,HYPERLINK(\"#'Table 1 \"&Database!N$11&\"'!$N$32\",\"Error\"),\"\")","v":""},{"$f":"IF(ABS(G330-SUM(G324,G325,G329))>0.002,HYPERLINK(\"#'Table 1 \"&Database!O$11&\"'!$N$32\",\"Error\"),\"\")","v":""},{"$f":"IF(ABS(H330-SUM(H324,H325,H329))>0.002,HYPERLINK(\"#'Table 1 \"&Database!P$11&\"'!$N$32\",\"Error\"),\"\")","v":""},{"$f":"IF(ABS(I330-SUM(I324,I325,I329))>0.002,HYPERLINK(\"#'Table 1 \"&Database!Q$11&\"'!$N$32\",\"Error\"),\"\")","v":""}]
[]
["Total","Historical Data",null,null,"Data Submission This Cycle",null,null,null,null,"Last Cycle Projections"]
[null,{"$f":"Database!B11","v":2016},{"$f":"Database!C11","v":2017},{"$f":"Database!D11","v":2018},{"$f":"E5","v":"2019P"},2020,2030,2040,2050,"2020.LC","2030.LC",{"$f":"L5","v":"2040.LC"},{"$f":"M5","v":"2050.LC"},null,null,null,null,null,null,null,null,null,null,null,null,1,{"$f":"B343","v":2016},{"$f":"C343","v":2017},{"$f":"D343","v":2018},{"$f":"VALUE(LEFT(E343,4))","v":2019},{"$f":"F343","v":2020},{"$f":"G343","v":2030},{"$f":"H343","v":2040},{"$f":"I343","v":2050},{"$f":"H343","v":2040},{"$f":"I343","v":2050}]
[{"$f":"A6","v":"Production (+)"},{"$f":"Database!J300","v":0},{"$f":"Database!K300","v":0},{"$f":"Database!L300","v":0},{"$f":"SUM(E6,E32,E58,E84,E110,E136,E162,E188,E214,E266,E292,E318)","v":0},0,0,0,0,{"$f":"Database!E300","v":0},{"$f":"Database!F300","v":0},{"$f":"Database!G300","v":0},{"$f":"Database!H300","v":0},null,null,null,null,null,null,null,null,null,null,null,null,{"$f":"INDEX(A344:G365,$Z$343,1)","v":"Production (+)"},{"$f":"INDEX(B344:N365,$Z$343,1)","v":0},{"$f":"INDEX(C344:O365,$Z$343,1)","v":0},{"$f":"INDEX(D344:P365,$Z$343,1)","v":0},{"$f":"INDEX(E344:Q365,$Z$343,1)","v":0},{"$f":"IF(AE$3,INDEX(F344:U365,$Z$343,1),NA())","v":{"$error":"#N/A"}},{"$f":"IF(AF$3,INDEX(G344:V365,$Z$343,1),NA())","v":{"$error":"#N/A"}},{"$f":"IF(AG$3,INDEX(H344:W365,$Z$343,1),NA())","v":{"$error":"#N/A"}},{"$f":"IF(AH$3,INDEX(I344:X365,$Z$343,1),NA())","v":{"$error":"#N/A"}},{"$f":"IF(AG$3,INDEX(H344:W365,$Z$343,1),NA())","v":{"$error":"#N/A"}},{"$f":"IF(AH$3,INDEX(I344:X365,$Z$343,1),NA())","v":{"$error":"#N/A"}}]
["Imports (+)",{"$f":"Database!J301","v":0},{"$f":"Database!K301","v":0},{"$f":"Database!L301","v":0},0,0,0,0,0,{"$f":"Database!E301","v":0},{"$f":"Database!F301","v":0},{"$f":"Database!G301","v":0},{"$f":"Database!H301","v":0}]
["Exports (–)",{"$f":"Database!J302","v":0},{"$f":"Database!K302","v":0},{"$f":"Database!L302","v":0},0,0,0,0,0,{"$f":"Database!E302","v":0},{"$f":"Database!F302","v":0},{"$f":"Database!G302","v":0},{"$f":"Database!H302","v":0}]
["International marine bunkers (–)",{"$f":"Database!J303","v":0},{"$f":"Database!K303","v":0},{"$f":"Database!L303","v":0},0,0,0,0,0,{"$f":"Database!E303","v":0},{"$f":"Database!F303","v":0},{"$f":"Database!G303","v":0},{"$f":"Database!H303","v":0}]
["International aviation bunkers (–)",{"$f":"Database!J304","v":0},{"$f":"Database!K304","v":0},{"$f":"Database!L304","v":0},0,0,0,0,0,{"$f":"Database!E304","v":0},{"$f":"Database!F304","v":0},{"$f":"Database!G304","v":0},{"$f":"Database!H304","v":0}]
["Stock changes (±)",{"$f":"Database!J305","v":0},{"$f":"Database!K305","v":0},{"$f":"Database!L305","v":0},0,0,0,0,0,{"$f":"Database!E305","v":0},{"$f":"Database!F305","v":0},{"$f":"Database!G305","v":0},{"$f":"Database!H305","v":0}]
["Total Energy Supply",{"$f":"Database!J306","v":0},{"$f":"Database!K306","v":0},{"$f":"Database!L306","v":0},{"$f":"SUM(E344:E349)","v":0},{"$f":"SUM(F344:F349)","v":0},{"$f":"SUM(G344:G349)","v":0},{"$f":"SUM(H344:H349)","v":0},{"$f":"SUM(I344:I349)","v":0},{"$f":"Database!E306","v":0},{"$f":"Database!F306","v":0},{"$f":"Database!G306","v":0},{"$f":"Database!H306","v":0}]
["Transformation processes & Energy industry own use",{"$f":"Database!J307","v":0},{"$f":"Database!K307","v":0},{"$f":"Database!L307","v":0},{"$f":"SUM(E352:E354)","v":0},{"$f":"SUM(F352:F354)","v":0},{"$f":"SUM(G352:G354)","v":0},{"$f":"SUM(H352:H354)","v":0},{"$f":"SUM(I352:I354)","v":0},{"$f":"Database!E307","v":0},{"$f":"Database!F307","v":0},{"$f":"Database!G307","v":0},{"$f":"Database!H307","v":0}]
["Electricity, CHP & heat plants (±)",{"$f":"Database!J308","v":0},{"$f":"Database!K308","v":0},{"$f":"Database!L308","v":0},{"$f":"SUM(E14,E40,E66,E92,E118,E144,E170,E196,E222,E274,E300,E326)","v":0},0,0,0,0,{"$f":"Database!E308","v":0},{"$f":"Database!F308","v":0},{"$f":"Database!G308","v":0},{"$f":"Database!H308","v":0}]
["Other transformation processes (±)     ",{"$f":"Database!J309","v":0},{"$f":"Database!K309","v":0},{"$f":"Database!L309","v":0},0,0,0,0,0,{"$f":"Database!E309","v":0},{"$f":"Database!F309","v":0},{"$f":"Database!G309","v":0},{"$f":"Database!H309","v":0}]
["Own use and Losses            ",{"$f":"Database!J310","v":0},{"$f":"Database!K310","v":0},{"$f":"Database!L310","v":0},0,0,0,0,0,{"$f":"Database!E310","v":0},{"$f":"Database!F310","v":0},{"$f":"Database!G310","v":0},{"$f":"Database!H310","v":0}]
["Statistical differences (±)",{"$f":"Database!J311","v":0},{"$f":"Database!K311","v":0},{"$f":"Database!L311","v":0},0,0,0,0,0,{"$f":"Database!E311","v":0},{"$f":"Database!F311","v":0},{"$f":"Database!G311","v":0},{"$f":"Database!H311","v":0}]
["Total Final Consumption       ",{"$f":"Database!J312","v":0},{"$f":"Database!K312","v":0},{"$f":"Database!L312","v":0},{"$f":"SUM(E357,E358,E360,E362)","v":0},{"$f":"SUM(F357,F358,F360,F362)","v":0},{"$f":"SUM(G357,G358,G360,G362)","v":0},{"$f":"SUM(H357,H358,H360,H362)","v":0},{"$f":"SUM(I357,I358,I360,I362)","v":0},{"$f":"Database!E312","v":0},{"$f":"Database!F312","v":0},{"$f":"Database!G312","v":0},{"$f":"Database!H312","v":0}]
["Industry (+)",{"$f":"Database!J313","v":0},{"$f":"Database!K313","v":0},{"$f":"Database!L313","v":0},{"$f":"SUM(E19,E45,E71,E97,E123,E149,E175,E201,E227,E279,E305,E331)","v":0},0,0,0,0,{"$f":"Database!E313","v":0},{"$f":"Database!F313","v":0},{"$f":"Database!G313","v":0},{"$f":"Database!H313","v":0}]
["Transport (+)",{"$f":"Database!J314","v":0},{"$f":"Database!K314","v":0},{"$f":"Database!L314","v":0},0,0,0,0,0,{"$f":"Database!E314","v":0},{"$f":"Database!F314","v":0},{"$f":"Database!G314","v":0},{"$f":"Database!H314","v":0}]
["of which: Road (+)",{"$f":"Database!J315","v":0},{"$f":"Database!K315","v":0},{"$f":"Database!L315","v":0},0,0,0,0,0,{"$f":"Database!E315","v":0},{"$f":"Database!F315","v":0},{"$f":"Database!G315","v":0},{"$f":"Database!H315","v":0}]
["Other (+)",{"$f":"Database!J316","v":0},{"$f":"Database!K316","v":0},{"$f":"Database!L316","v":0},0,0,0,0,0,{"$f":"Database!E316","v":0},{"$f":"Database!F316","v":0},{"$f":"Database!G316","v":0},{"$f":"Database!H316","v":0}]
["of which: Residential (+) ",{"$f":"Database!J317","v":0},{"$f":"Database!K317","v":0},{"$f":"Database!L317","v":0},0,0,0,0,0,{"$f":"Database!E317","v":0},{"$f":"Database!F317","v":0},{"$f":"Database!G317","v":0},{"$f":"Database!H317","v":0}]
["Non-energy use (+)",{"$f":"Database!J318","v":0},{"$f":"Database!K318","v":0},{"$f":"Database!L318","v":0},0,0,0,0,0,{"$f":"Database!E318","v":0},{"$f":"Database!F318","v":0},{"$f":"Database!G318","v":0},{"$f":"Database!H318","v":0}]
["of which: chemical/petrochemical (+)",{"$f":"Database!J319","v":0},{"$f":"Database!K319","v":0},{"$f":"Database!L319","v":0},0,0,0,0,0,{"$f":"Database!E319","v":0},{"$f":"Database!F319","v":0},{"$f":"Database!G319","v":0},{"$f":"Database!H319","v":0},null,null,null,null,{"$f":"Z344","v":"Production (+)"}]
["Elec. Gen. Exc. Pumped storage (TWh) (+)",{"$f":"Database!J320","v":0},{"$f":"Database!K320","v":0},{"$f":"Database!L320","v":0},0,0,0,0,0,{"$f":"Database!E320","v":0},{"$f":"Database!F320","v":0},{"$f":"Database!G320","v":0},{"$f":"Database!H320","v":0}]
["Heat generated (PJ) (+)",{"$f":"Database!J321","v":0},{"$f":"Database!K321","v":0},{"$f":"Database!L321","v":0},0,0,0,0,0,{"$f":"Database!E321","v":0},{"$f":"Database!F321","v":0},{"$f":"Database!G321","v":0},{"$f":"Database!H321","v":0}]
[null,null,null,null,{"$f":"IF(ABS(E356-SUM(E350,E351,E355))>0.002,HYPERLINK(\"#'Table 1 \"&Database!M$11&\"'!$O$32\",\"Error\"),IF(E364+E365=0, IF((E352-E326-E300)<>0,HYPERLINK(\"#'Table 1 \"&Database!M$11&\"'!$O$32\",\"Error\"),\"\"), IF((E352-E326-E300)=0, HYPERLINK(\"#'Table 1 \"&Database!M$11&\"'!$O$32\",\"Error\"), IF((E364*0.086+E365*0.02388)/(E352-E326-E300)*-100>100,HYPERLINK(\"#'Table 1 \"&Database!M$11&\"'!$O$35\",\"Warning\"),IF((E364*0.086+E365*0.02388)/(E352-E326-E300)*-100<0,HYPERLINK(\"#'Table 1 \"&Database!M$11&\"'!$O$35\",\"Warning\"),\"\")))))","v":""},{"$f":"IF(ABS(F356-SUM(F350,F351,F355))>0.002,HYPERLINK(\"#'Table 1 \"&Database!N$11&\"'!$O$32\",\"Error\"),IF(F364+F365=0, IF((F352-F326-F300)<>0,HYPERLINK(\"#'Table 1 \"&Database!N$11&\"'!$O$32\",\"Error\"),\"\"), IF((F352-F326-F300)=0, HYPERLINK(\"#'Table 1 \"&Database!N$11&\"'!$O$32\",\"Error\"), IF((F364*0.086+F365*0.02388)/(F352-F326-F300)*-100>100,HYPERLINK(\"#'Table 1 \"&Database!N$11&\"'!$O$35\",\"Warning\"),IF((F364*0.086+F365*0.02388)/(F352-F326-F300)*-100<0,HYPERLINK(\"#'Table 1 \"&Database!N$11&\"'!$O$35\",\"Warning\"),\"\")))))","v":""},{"$f":"IF(ABS(G356-SUM(G350,G351,G355))>0.002,HYPERLINK(\"#'Table 1 \"&Database!O$11&\"'!$O$32\",\"Error\"),IF(G364+G365=0, IF((G352-G326-G300)<>0,HYPERLINK(\"#'Table 1 \"&Database!O$11&\"'!$O$32\",\"Error\"),\"\"), IF((G352-G326-G300)=0, HYPERLINK(\"#'Table 1 \"&Database!O$11&\"'!$O$32\",\"Error\"), IF((G364*0.086+G365*0.02388)/(G352-G326-G300)*-100>100,HYPERLINK(\"#'Table 1 \"&Database!O$11&\"'!$O$35\",\"Warning\"),IF((G364*0.086+G365*0.02388)/(G352-G326-G300)*-100<0,HYPERLINK(\"#'Table 1 \"&Database!O$11&\"'!$O$35\",\"Warning\"),\"\")))))","v":""},{"$f":"IF(ABS(H356-SUM(H350,H351,H355))>0.002,HYPERLINK(\"#'Table 1 \"&Database!P$11&\"'!$O$32\",\"Error\"),IF(H364+H365=0, IF((H352-H326-H300)<>0,HYPERLINK(\"#'Table 1 \"&Database!P$11&\"'!$O$32\",\"Error\"),\"\"), IF((H352-H326-H300)=0, HYPERLINK(\"#'Table 1 \"&Database!P$11&\"'!$O$32\",\"Error\"), IF((H364*0.086+H365*0.02388)/(H352-H326-H300)*-100>100,HYPERLINK(\"#'Table 1 \"&Database!P$11&\"'!$O$35\",\"Warning\"),IF((H364*0.086+H365*0.02388)/(H352-H326-H300)*-100<0,HYPERLINK(\"#'Table 1 \"&Database!P$11&\"'!$O$35\",\"Warning\"),\"\")))))","v":""},{"$f":"IF(ABS(I356-SUM(I350,I351,I355))>0.002,HYPERLINK(\"#'Table 1 \"&Database!Q$11&\"'!$O$32\",\"Error\"),IF(I364+I365=0, IF((I352-I326-I300)<>0,HYPERLINK(\"#'Table 1 \"&Database!Q$11&\"'!$O$32\",\"Error\"),\"\"), IF((I352-I326-I300)=0, HYPERLINK(\"#'Table 1 \"&Database!Q$11&\"'!$O$32\",\"Error\"), IF((I364*0.086+I365*0.02388)/(I352-I326-I300)*-100>100,HYPERLINK(\"#'Table 1 \"&Database!Q$11&\"'!$O$35\",\"Warning\"),IF((I364*0.086+I365*0.02388)/(I352-I326-I300)*-100<0,HYPERLINK(\"#'Table 1 \"&Database!Q$11&\"'!$O$35\",\"Warning\"),\"\")))))","v":""}]
[]
[]
["TES by fuel",{"$f":"B343","v":2016},{"$f":"C343","v":2017},2018,"2019P",2020,2030,2040,2050]
[{"$f":"A4","v":"Coal / Oil shale"},{"$f":"B12","v":0},{"$f":"C12","v":0},0,0,0,0,0,0]
[{"$f":"A30","v":"Peat"},{"$f":"B38","v":0},{"$f":"C38","v":0},0,0,0,0,0,0]
[{"$f":"A56","v":"Oil "},{"$f":"B64","v":0},{"$f":"C64","v":0},0,0,0,0,0,0]
[{"$f":"A82","v":"Natural gas"},{"$f":"B90","v":0},{"$f":"C90","v":0},0,0,0,0,0,0]
[{"$f":"A108","v":"Nuclear"},{"$f":"B116","v":0},{"$f":"C116","v":0},0,0,0,0,0,0]
[{"$f":"A134","v":"Hydro"},{"$f":"B142","v":0},{"$f":"C142","v":0},0,0,0,0,0,0]
[{"$f":"A160","v":"Wind"},{"$f":"B168","v":0},{"$f":"C168","v":0},0,0,0,0,0,0]
[{"$f":"A186","v":"Geothermal"},{"$f":"B194","v":0},{"$f":"C194","v":0},0,0,0,0,0,0]
[{"$f":"A212","v":"Solar"},{"$f":"B220","v":0},{"$f":"C220","v":0},0,0,0,0,0,0]
[{"$f":"A238","v":"Tide, etc…"},{"$f":"B246","v":0},{"$f":"C246","v":0},0,0,0,0,0,0]
[{"$f":"A264","v":"Biofuels & waste"},{"$f":"B272","v":0},{"$f":"C272","v":0},0,0,0,0,0,0]
[]
[]
[]
[]
["Share of electricity output by source",{"$f":"B369","v":2016},{"$f":"C369","v":2017},2018,"2019P",2020,2030,2040,2050]
[{"$f":"A370","v":"Coal / Oil shale"},{"$f":"B26","v":0},{"$f":"C26","v":0},0,0,0,0,0,0]
["Peat",{"$f":"B52","v":0},{"$f":"C52","v":0},0,0,0,0,0,0]
["Oil ",{"$f":"B78","v":0},{"$f":"C78","v":0},0,0,0,0,0,0]
["Natural gas",{"$f":"B104","v":0},{"$f":"C104","v":0},0,0,0,0,0,0]
["Nuclear",{"$f":"B130","v":0},{"$f":"C130","v":0},0,0,0,0,0,0]
["Hydro",{"$f":"B156","v":0},{"$f":"C156","v":0},0,0,0,0,0,0]
["Wind",{"$f":"B182","v":0},{"$f":"C182","v":0},0,0,0,0,0,0]
["Geothermal",{"$f":"B208","v":0},{"$f":"C208","v":0},0,0,0,0,0,0]
["Solar",{"$f":"B234","v":0},{"$f":"C234","v":0},0,0,0,0,0,0]
["Tide, etc…",{"$f":"B260","v":0},{"$f":"C260","v":0},0,0,0,0,0,0]
[{"$f":"A380","v":"Biofuels & waste"},{"$f":"B286","v":0},{"$f":"C286","v":0},0,0,0,0,0,0]

{"sheet":"2018","index":4,"n_rows":35,"n_cols":16,"rows_kept":35,"cut":false,"hidden":false,"merged":[[30,0,30,1]]}
["IEA Historical Energy Balance (Mtoe)"]
[{"$f":"Database!B12&\" \"&Database!D11","v":"Australia 2018"}]
[]
[null,null,"Coal / Oil shale","Peat","Oil","Natural gas","Nuclear","Hydro","Wind","Geothermal","Solar","Tide, Etc.","Biofuels & waste","Electricity","Heat","Total"]
[null,null,"A","B","C","D","E","F","G","H","I","J","K","L","M","N"]
[{"$f":"'Energy Balance Time Series'!A6","v":"Production (+)"},"A",{"$f":"Database!L14","v":0},{"$f":"Database!L36","v":0},{"$f":"Database!L58","v":0},{"$f":"Database!L80","v":0},{"$f":"Database!L102","v":0},{"$f":"Database!L124","v":0},{"$f":"Database!L146","v":0},{"$f":"Database!L168","v":0},{"$f":"Database!L190","v":0},{"$f":"Database!L212","v":0},{"$f":"Database!L234","v":0},0,{"$f":"Database!L278","v":0},{"$f":"Database!L300","v":0}]
[{"$f":"'Energy Balance Time Series'!A7","v":"Imports (+)"},"B",{"$f":"Database!L15","v":0},{"$f":"Database!L37","v":0},{"$f":"Database!L59","v":0},{"$f":"Database!L81","v":0},0,0,0,0,0,null,{"$f":"Database!L235","v":0},{"$f":"Database!L257","v":0},{"$f":"Database!L279","v":0},{"$f":"Database!L301","v":0}]
[{"$f":"'Energy Balance Time Series'!A8","v":"Exports (–)"},"C",{"$f":"Database!L16","v":0},{"$f":"Database!L38","v":0},{"$f":"Database!L60","v":0},{"$f":"Database!L82","v":0},0,0,0,0,0,null,{"$f":"Database!L236","v":0},{"$f":"Database!L258","v":0},{"$f":"Database!L280","v":0},{"$f":"Database!L302","v":0}]
[{"$f":"'Energy Balance Time Series'!A9","v":"International marine bunkers (–)"},"D",{"$f":"Database!L17","v":0},{"$f":"Database!L39","v":0},{"$f":"Database!L61","v":0},{"$f":"Database!L83","v":0},0,0,0,0,0,null,{"$f":"Database!L237","v":0},0,0,{"$f":"Database!L303","v":0}]
[{"$f":"'Energy Balance Time Series'!A10","v":"International aviation bunkers (–)"},"E",{"$f":"Database!L18","v":0},{"$f":"Database!L40","v":0},{"$f":"Database!L62","v":0},{"$f":"Database!L84","v":0},0,0,0,0,0,null,{"$f":"Database!L238","v":0},0,0,{"$f":"Database!L304","v":0}]
[{"$f":"'Energy Balance Time Series'!A11","v":"Stock changes (±)"},"F",{"$f":"Database!L19","v":0},{"$f":"Database!L41","v":0},{"$f":"Database!L63","v":0},{"$f":"Database!L85","v":0},0,0,0,0,0,null,{"$f":"Database!L239","v":0},0,0,{"$f":"Database!L305","v":0}]
[{"$f":"'Energy Balance Time Series'!A12","v":"Total Energy Supply"},"G",{"$f":"Database!L20","v":0},{"$f":"Database!L42","v":0},{"$f":"Database!L64","v":0},{"$f":"Database!L86","v":0},{"$f":"Database!L108","v":0},{"$f":"Database!L130","v":0},{"$f":"Database!L152","v":0},{"$f":"Database!L174","v":0},{"$f":"Database!L196","v":0},{"$f":"Database!L218","v":0},{"$f":"Database!L240","v":0},{"$f":"Database!L262","v":0},{"$f":"Database!L284","v":0},{"$f":"Database!L306","v":0}]
[{"$f":"'Energy Balance Time Series'!A13","v":"Transformation processes & Energy industry own use"},"H",{"$f":"Database!L21","v":0},{"$f":"Database!L43","v":0},{"$f":"Database!L65","v":0},{"$f":"Database!L87","v":0},{"$f":"Database!L109","v":0},{"$f":"Database!L131","v":0},{"$f":"Database!L153","v":0},{"$f":"Database!L175","v":0},{"$f":"Database!L197","v":0},{"$f":"Database!L219","v":0},{"$f":"Database!L241","v":0},{"$f":"Database!L263","v":0},{"$f":"Database!L285","v":0},{"$f":"Database!L307","v":0}]
[{"$f":"'Energy Balance Time Series'!A14","v":"Electricity, CHP & heat plants (±)"},"I",{"$f":"Database!L22","v":0},{"$f":"Database!L44","v":0},{"$f":"Database!L66","v":0},{"$f":"Database!L88","v":0},{"$f":"Database!L110","v":0},{"$f":"Database!L132","v":0},{"$f":"Database!L154","v":0},{"$f":"Database!L176","v":0},{"$f":"Database!L198","v":0},{"$f":"Database!L220","v":0},{"$f":"Database!L242","v":0},{"$f":"Database!L264","v":0},{"$f":"Database!L286","v":0},{"$f":"Database!L308","v":0}]
[{"$f":"'Energy Balance Time Series'!A15","v":"Other transformation processes (±)     "},"J",{"$f":"Database!L23","v":0},{"$f":"Database!L45","v":0},{"$f":"Database!L67","v":0},{"$f":"Database!L89","v":0},0,0,0,0,0,0,{"$f":"Database!L243","v":0},0,0,{"$f":"Database!L309","v":0}]
[{"$f":"'Energy Balance Time Series'!A16","v":"Own use and Losses            "},"K",{"$f":"Database!L24","v":0},{"$f":"Database!L46","v":0},{"$f":"Database!L68","v":0},{"$f":"Database!L90","v":0},0,0,0,{"$f":"Database!L178","v":0},{"$f":"Database!L200","v":0},{"$f":"Database!L222","v":0},{"$f":"Database!L244","v":0},{"$f":"Database!L266","v":0},{"$f":"Database!L288","v":0},{"$f":"Database!L310","v":0}]
[{"$f":"'Energy Balance Time Series'!A17","v":"Statistical differences (±)"},"L",{"$f":"Database!L25","v":0},{"$f":"Database!L47","v":0},{"$f":"Database!L69","v":0},{"$f":"Database!L91","v":0},0,0,0,{"$f":"Database!L179","v":0},{"$f":"Database!L201","v":0},{"$f":"Database!L223","v":0},{"$f":"Database!L245","v":0},{"$f":"Database!L267","v":0},{"$f":"Database!L289","v":0},{"$f":"Database!L311","v":0}]
[{"$f":"'Energy Balance Time Series'!A18","v":"Total Final Consumption       "},"M",{"$f":"Database!L26","v":0},{"$f":"Database!L48","v":0},{"$f":"Database!L70","v":0},{"$f":"Database!L92","v":0},0,0,0,{"$f":"Database!L180","v":0},{"$f":"Database!L202","v":0},{"$f":"Database!L224","v":0},{"$f":"Database!L246","v":0},{"$f":"Database!L268","v":0},{"$f":"Database!L290","v":0},{"$f":"Database!L312","v":0}]
[{"$f":"'Energy Balance Time Series'!A19","v":"Industry (+)"},"N",{"$f":"Database!L27","v":0},{"$f":"Database!L49","v":0},{"$f":"Database!L71","v":0},{"$f":"Database!L93","v":0},0,0,0,{"$f":"Database!L181","v":0},{"$f":"Database!L203","v":0},{"$f":"Database!L225","v":0},{"$f":"Database!L247","v":0},{"$f":"Database!L269","v":0},{"$f":"Database!L291","v":0},{"$f":"Database!L313","v":0}]
[{"$f":"'Energy Balance Time Series'!A20","v":"Transport (+)"},"O",{"$f":"Database!L28","v":0},{"$f":"Database!L50","v":0},{"$f":"Database!L72","v":0},{"$f":"Database!L94","v":0},0,0,0,0,{"$f":"Database!L204","v":0},{"$f":"Database!L226","v":0},{"$f":"Database!L248","v":0},{"$f":"Database!L270","v":0},{"$f":"Database!L292","v":0},{"$f":"Database!L314","v":0}]
[{"$f":"'Energy Balance Time Series'!A21","v":"of which: Road (+)"},"P",{"$f":"Database!L29","v":0},{"$f":"Database!L51","v":0},{"$f":"Database!L73","v":0},{"$f":"Database!L95","v":0},0,0,0,0,{"$f":"Database!L205","v":0},{"$f":"Database!L227","v":0},{"$f":"Database!L249","v":0},{"$f":"Database!L271","v":0},{"$f":"Database!L293","v":0},{"$f":"Database!L315","v":0}]
[{"$f":"'Energy Balance Time Series'!A22","v":"Other (+)"},"Q",{"$f":"Database!L30","v":0},{"$f":"Database!L52","v":0},{"$f":"Database!L74","v":0},{"$f":"Database!L96","v":0},0,0,0,{"$f":"Database!L184","v":0},{"$f":"Database!L206","v":0},{"$f":"Database!L228","v":0},{"$f":"Database!L250","v":0},{"$f":"Database!L272","v":0},{"$f":"Database!L294","v":0},{"$f":"Database!L316","v":0}]
[{"$f":"'Energy Balance Time Series'!A23","v":"of which: Residential (+) "},"R",{"$f":"Database!L31","v":0},{"$f":"Database!L53","v":0},{"$f":"Database!L75","v":0},{"$f":"Database!L97","v":0},0,0,0,{"$f":"Database!L185","v":0},{"$f":"Database!L207","v":0},{"$f":"Database!L229","v":0},{"$f":"Database!L251","v":0},{"$f":"Database!L273","v":0},{"$f":"Database!L295","v":0},{"$f":"Database!L317","v":0}]
[{"$f":"'Energy Balance Time Series'!A24","v":"Non-energy use (+)"},"S",{"$f":"Database!L32","v":0},{"$f":"Database!L54","v":0},{"$f":"Database!L76","v":0},{"$f":"Database!L98","v":0},0,0,0,0,0,0,0,0,0,{"$f":"Database!L318","v":0}]
[{"$f":"'Energy Balance Time Series'!A25","v":"of which: chemical/petrochemical (+)"},"T",{"$f":"Database!L33","v":0},{"$f":"Database!L55","v":0},{"$f":"Database!L77","v":0},{"$f":"Database!L99","v":0},0,0,0,0,0,0,0,0,0,{"$f":"Database!L319","v":0}]
[{"$f":"'Energy Balance Time Series'!A26","v":"Elec. Gen. Exc. Pumped storage (TWh) (+)"},"U",{"$f":"Database!L34","v":0},{"$f":"Database!L56","v":0},{"$f":"Database!L78","v":0},{"$f":"Database!L100","v":0},{"$f":"Database!L122","v":0},{"$f":"Database!L144","v":0},{"$f":"Database!L166","v":0},{"$f":"Database!L188","v":0},{"$f":"Database!L210","v":0},{"$f":"Database!L232","v":0},{"$f":"Database!L254","v":0},0,{"$f":"Database!L298","v":0},{"$f":"Database!L320","v":0}]
[{"$f":"'Energy Balance Time Series'!A27","v":"Heat generated (PJ) (+)"},"V",{"$f":"Database!L35","v":0},{"$f":"Database!L57","v":0},{"$f":"Database!L79","v":0},{"$f":"Database!L101","v":0},{"$f":"Database!L123","v":0},0,0,{"$f":"Database!L189","v":0},{"$f":"Database!L211","v":0},{"$f":"Database!L233","v":0},{"$f":"Database!L255","v":0},{"$f":"Database!L277","v":0},{"$f":"Database!L299","v":0},{"$f":"Database!L321","v":0}]
[]
[]
[{"$f":"\"Table 1 checks for \" & Database!B12&\" \"&Database!D11","v":"Table 1 checks for Australia 2018"}]
["Checksums (should be zero)"]
["TFC > sum of TPES, Transf., Stat.Diff.",null,{"$f":"ROUND(C18-(C12+C13+C17),3)","v":0},{"$f":"ROUND(D18-(D12+D13+D17),3)","v":0},0,0,0,0,0,0,0,0,0,{"$f":"ROUND(N18-(N12+N13+N17),3)","v":0},0,0]
["Conversion Mtoe to TWh",null,{"$f":"ROUND(P26*0.086-N14-N27/41.868-O27/41.868+O6,3)","v":0}]
["Conversion Mtoe to PJ",null,{"$f":"ROUND(P27*0.02388-O14-O6,3)","v":0}]
["Calculated efficiency (%)",null,{"$f":"IF(C26+C27=0, IF(C14<>0,\"Error\",0 ), IF( C14=0, \"Error\", (C26*0.086+C27*0.02388)/C14*-100))","v":0},{"$f":"IF(  D26+D27=0, IF(  D14<>0,\"Error\",0 ), IF( D14=0, \"Error\", (D26*0.086+D27*0.02388)/D14*-100) )","v":0},0,0,0,0,0,0,0,0,0,"not applic.","not applic.",{"$f":"IF(  P26+P27=0, IF(  SUM(C14:M14)<>0,\"Error\",0 ), IF( SUM(C14:M14)=0, \"Error\", (P26*0.086+P27*0.02388)/SUM(C14:M14)*-100) )","v":0}]

{"sheet":"Table 1 2019P","index":5,"n_rows":35,"n_cols":16,"rows_kept":35,"cut":false,"hidden":false,"merged":[[30,0,30,1]]}
["Table 1 - Energy Balances (Mtoe)"]
[{"$f":"Database!B12&\" \"&LEFT(Database!M11,4)&\"  Provisional (Optional: will be updated with \"&Database!D11+1&\" data submitted through the 5 fuel questionnaires)\"","v":"Australia 2019  Provisional (Optional: will be updated with 2019 data submitted through the 5 fuel questionnaires)"}]
[]
[null,null,{"$f":"'2018'!C4","v":"Coal / Oil shale"},{"$f":"'2018'!D4","v":"Peat"},{"$f":"'2018'!E4","v":"Oil"},{"$f":"'2018'!F4","v":"Natural gas"},{"$f":"'2018'!G4","v":"Nuclear"},{"$f":"'2018'!H4","v":"Hydro"},{"$f":"'2018'!I4","v":"Wind"},{"$f":"'2018'!J4","v":"Geothermal"},{"$f":"'2018'!K4","v":"Solar"},{"$f":"'2018'!L4","v":"Tide, Etc."},{"$f":"'2018'!M4","v":"Biofuels & waste"},{"$f":"'2018'!N4","v":"Electricity"},{"$f":"'2018'!O4","v":"Heat"},{"$f":"'2018'!P4","v":"Total"}]
[null,null,"A","B","C","D","E","F","G","H","I","J","K","L","M","N"]
[{"$f":"'Energy Balance Time Series'!A6","v":"Production (+)"},"A",0,0,0,0,0,0,0,0,0,0,0,0,0,{"$f":"SUM(C6:O6)","v":0}]
[{"$f":"'Energy Balance Time Series'!A7","v":"Imports (+)"},"B",0,0,0,0,0,0,0,0,0,0,0,0,0,0]
[{"$f":"'Energy Balance Time Series'!A8","v":"Exports (–)"},"C",0,0,0,0,0,0,0,0,0,0,0,0,0,0]
[{"$f":"'Energy Balance Time Series'!A9","v":"International marine bunkers (–)"},"D",0,0,0,0,0,0,0,0,0,0,0,0,0,0]
[{"$f":"'Energy Balance Time Series'!A10","v":"International aviation bunkers (–)"},"E",0,0,0,0,0,0,0,0,0,0,0,0,0,0]
[{"$f":"'Energy Balance Time Series'!A11","v":"Stock changes (±)"},"F",0,0,0,0,0,0,0,0,0,0,0,0,0,0]
[{"$f":"'Energy Balance Time Series'!A12","v":"Total Energy Supply"},"G",{"$f":"SUM(C6:C11)","v":0},{"$f":"SUM(D6:D11)","v":0},0,0,0,0,0,0,0,0,0,0,{"$f":"SUM(O6:O11)","v":0},0]
[{"$f":"'Energy Balance Time Series'!A13","v":"Transformation processes & Energy industry own use"},"H",{"$f":"SUM(C14:C16)","v":0},{"$f":"SUM(D14:D16)","v":0},0,0,0,0,0,0,0,0,0,0,{"$f":"SUM(O14:O16)","v":0},0]
[{"$f":"'Energy Balance Time Series'!A14","v":"Electricity, CHP & heat plants (±)"},"I",0,0,0,0,0,0,0,0,0,0,0,0,0,0]
[{"$f":"'Energy Balance Time Series'!A15","v":"Other transformation processes (±)     "},"J",0,0,0,0,0,0,0,0,0,0,0,0,0,0]
[{"$f":"'Energy Balance Time Series'!A16","v":"Own use and Losses            "},"K",0,0,0,0,0,0,0,0,0,0,0,0,0,0]
[{"$f":"'Energy Balance Time Series'!A17","v":"Statistical differences (±)"},"L",0,0,0,0,0,0,0,0,0,0,0,0,0,0]
[{"$f":"'Energy Balance Time Series'!A18","v":"Total Final Consumption       "},"M",{"$f":"SUM(C19,C20,C22,C24)","v":0},{"$f":"SUM(D19,D20,D22,D24)","v":0},0,0,0,0,0,0,0,0,0,0,{"$f":"SUM(O19,O20,O22,O24)","v":0},{"$f":"P19+P20+P22+P24","v":0}]
[{"$f":"'Energy Balance Time Series'!A19","v":"Industry (+)"},"N",0,0,0,0,0,0,0,0,0,0,0,0,0,{"$f":"SUM(C19:O19)","v":0}]
[{"$f":"'Energy Balance Time Series'!A20","v":"Transport (+)"},"O",0,0,0,0,0,0,0,0,0,0,0,0,0,0]
[{"$f":"'Energy Balance Time Series'!A21","v":"of which: Road (+)"},"P",0,0,0,0,0,0,0,0,0,0,0,0,0,0]
[{"$f":"'Energy Balance Time Series'!A22","v":"Other (+)"},"Q",0,0,0,0,0,0,0,0,0,0,0,0,0,0]
[{"$f":"'Energy Balance Time Series'!A23","v":"of which: Residential (+) "},"R",0,0,0,0,0,0,0,0,0,0,0,0,0,0]
[{"$f":"'Energy Balance Time Series'!A24","v":"Non-energy use (+)"},"S",0,0,0,0,0,0,0,0,0,0,0,0,0,0]
[{"$f":"'Energy Balance Time Series'!A25","v":"of which: chemical/petrochemical (+)"},"T",0,0,0,0,0,0,0,0,0,0,0,0,0,0]
[{"$f":"'Energy Balance Time Series'!A26","v":"Elec. Gen. Exc. Pumped storage (TWh) (+)"},"U",0,0,0,0,0,0,0,0,0,0,0,0,0,0]
[{"$f":"'Energy Balance Time Series'!A27","v":"Heat generated (PJ) (+)"},"V",0,0,0,0,0,0,0,0,0,0,0,0,0,0]
[]
[]
[{"$f":"\"Table 1 checks for \" & Database!B12&\" \"&LEFT(Database!M11,4)&\" Prov.\"","v":"Table 1 checks for Australia 2019 Prov."}]
["Checksums (should be zero)"]
["TFC > sum of TPES, Transf., Stat.Diff.",null,{"$f":"ROUND(C18-(C12+C13+C17),3)","v":0},{"$f":"ROUND(D18-(D12+D13+D17),3)","v":0},0,0,0,0,0,0,0,{"$f":"ROUND(L18-(L12+L13+L17),3)","v":0},0,0,0,{"$f":"P18-(P12+P13+P17)","v":0}]
["Conversion Mtoe to TWh",null,{"$f":"ROUND(P26*0.0859845228-N14-N27/41.868-O27/41.868+O6,3)","v":0}]
["Conversion Mtoe to PJ",null,{"$f":"ROUND(P27*0.0238845897-O14-O6,3)","v":0}]
["Calculated efficiency (%)",null,{"$f":"IF(  C26+C27=0, IF(  C14<>0,\"Error\",0 ), IF( C14=0, \"Error\", (C26*0.086+C27*0.02388)/C14*-100) )","v":0},0,{"$f":"IF(  E26+E27=0, IF(  E14<>0,\"Error\",0 ), IF( E14=0, \"Error\", (E26*0.086+E27*0.02388)/E14*-100) )","v":0},0,0,0,0,0,0,{"$f":"IF(  L26+L27=0, IF(  L14<>0,\"Error\",0 ), IF( L14=0, \"Error\", (L26*0.086+L27*0.02388)/L14*-100) )","v":0},0,"not applic.","not applic.",{"$f":"IF(  P26+P27=0, IF(  SUM(C14:M14)<>0,\"Error\",0 ), IF( SUM(C14:M14)=0, \"Error\", (P26*0.086+P27*0.02388)/SUM(C14:M14)*-100) )","v":0}]

{"sheet":"Table 1 2020","index":6,"n_rows":35,"n_cols":16,"rows_kept":35,"cut":false,"hidden":false,"merged":[[30,0,30,1]]}
["Table 1 - Energy Balances (Mtoe)"]
[{"$f":"Database!B12&\" \"&Database!N11","v":"Australia 2020"}]
[]
[null,null,{"$f":"'2018'!C4","v":"Coal / Oil shale"},{"$f":"'2018'!D4","v":"Peat"},{"$f":"'2018'!E4","v":"Oil"},{"$f":"'2018'!F4","v":"Natural gas"},{"$f":"'2018'!G4","v":"Nuclear"},{"$f":"'2018'!H4","v":"Hydro"},{"$f":"'2018'!I4","v":"Wind"},{"$f":"'2018'!J4","v":"Geothermal"},{"$f":"'2018'!K4","v":"Solar"},{"$f":"'2018'!L4","v":"Tide, Etc."},{"$f":"'2018'!M4","v":"Biofuels & waste"},{"$f":"'2018'!N4","v":"Electricity"},{"$f":"'2018'!O4","v":"Heat"},{"$f":"'2018'!P4","v":"Total"}]
[null,null,"A","B","C","D","E","F","G","H","I","J","K","L","M","N"]
[{"$f":"'Energy Balance Time Series'!A6","v":"Production (+)"},"A",0,0,0,0,0,0,0,0,0,0,0,0,0,{"$f":"SUM(C6:O6)","v":0}]
[{"$f":"'Energy Balance Time Series'!A7","v":"Imports (+)"},"B",0,0,0,0,0,0,0,0,0,0,0,0,0,{"$f":"SUM(C7:O7)","v":0}]
[{"$f":"'Energy Balance Time Series'!A8","v":"Exports (–)"},"C",0,0,0,0,0,0,0,0,0,0,0,0,0,0]
[{"$f":"'Energy Balance Time Series'!A9","v":"International marine bunkers (–)"},"D",0,0,0,0,0,0,0,0,0,0,0,0,0,0]
[{"$f":"'Energy Balance Time Series'!A10","v":"International aviation bunkers (–)"},"E",0,0,0,0,0,0,0,0,0,0,0,0,0,0]
[{"$f":"'Energy Balance Time Series'!A11","v":"Stock changes (±)"},"F",0,0,0,0,0,0,0,0,0,0,0,0,0,0]
[{"$f":"'Energy Balance Time Series'!A12","v":"Total Energy Supply"},"G",{"$f":"SUM(C6:C11)","v":0},{"$f":"SUM(D6:D11)","v":0},0,0,0,0,0,0,0,0,0,0,{"$f":"SUM(O6:O11)","v":0},0]
[{"$f":"'Energy Balance Time Series'!A13","v":"Transformation processes & Energy industry own use"},"H",{"$f":"SUM(C14:C16)","v":0},{"$f":"SUM(D14:D16)","v":0},0,0,0,0,0,0,0,0,0,0,{"$f":"SUM(O14:O16)","v":0},0]
[{"$f":"'Energy Balance Time Series'!A14","v":"Electricity, CHP & heat plants (±)"},"I",0,0,0,0,0,0,0,0,0,0,0,0,0,0]
[{"$f":"'Energy Balance Time Series'!A15","v":"Other transformation processes (±)     "},"J",0,0,0,0,0,0,0,0,0,0,0,0,0,0]
[{"$f":"'Energy Balance Time Series'!A16","v":"Own use and Losses            "},"K",0,0,0,0,0,0,0,0,0,0,0,0,0,0]
[{"$f":"'Energy Balance Time Series'!A17","v":"Statistical differences (±)"},"L",0,0,0,0,0,0,0,0,0,0,0,0,0,0]
[{"$f":"'Energy Balance Time Series'!A18","v":"Total Final Consumption       "},"M",{"$f":"SUM(C19,C20,C22,C24)","v":0},{"$f":"SUM(D19,D20,D22,D24)","v":0},0,0,0,0,0,0,0,0,0,0,{"$f":"SUM(O19,O20,O22,O24)","v":0},0]
[{"$f":"'Energy Balance Time Series'!A19","v":"Industry (+)"},"N",0,0,0,0,0,0,0,0,0,0,0,0,0,0]
[{"$f":"'Energy Balance Time Series'!A20","v":"Transport (+)"},"O",0,0,0,0,0,0,0,0,0,0,0,0,0,0]
[{"$f":"'Energy Balance Time Series'!A21","v":"of which: Road (+)"},"P",0,0,0,0,0,0,0,0,0,0,0,0,0,0]
[{"$f":"'Energy Balance Time Series'!A22","v":"Other (+)"},"Q",0,0,0,0,0,0,0,0,0,0,0,0,0,0]
[{"$f":"'Energy Balance Time Series'!A23","v":"of which: Residential (+) "},"R",0,0,0,0,0,0,0,0,0,0,0,0,0,0]
[{"$f":"'Energy Balance Time Series'!A24","v":"Non-energy use (+)"},"S",0,0,0,0,0,0,0,0,0,0,0,0,0,0]
[{"$f":"'Energy Balance Time Series'!A25","v":"of which: chemical/petrochemical (+)"},"T",0,0,0,0,0,0,0,0,0,0,0,0,0,0]
[{"$f":"'Energy Balance Time Series'!A26","v":"Elec. Gen. Exc. Pumped storage (TWh) (+)"},"U",0,0,0,0,0,0,0,0,0,0,0,0,0,0]
[{"$f":"'Energy Balance Time Series'!A27","v":"Heat generated (PJ) (+)"},"V",0,0,0,0,0,0,0,0,0,0,0,0,0,0]
[]
[]
[{"$f":"\"Table 1 checks for \" & Database!B12&\" \"&Database!N11","v":"Table 1 checks for Australia 2020"}]
["Checksums (should be zero)"]
["TFC > sum of TPES, Transf., Stat.Diff.",null,{"$f":"ROUND(C18-(C12+C13+C17),3)","v":0},{"$f":"ROUND(D18-(D12+D13+D17),3)","v":0},0,0,0,0,0,0,0,{"$f":"ROUND(L18-(L12+L13+L17),3)","v":0},0,0,0,0]
["Conversion Mtoe to TWh",null,{"$f":"ROUND(P26*0.0859845228-N14-N27/41.868-O27/41.868+O6,3)","v":0}]
["Conversion Mtoe to PJ",null,{"$f":"ROUND(P27*0.0238845897-O14-O6,3)","v":0}]
["Calculated efficiency (%)",null,{"$f":"IF(  C26+C27=0, IF(  C14<>0,\"Error\",0 ), IF( C14=0, \"Error\", (C26*0.086+C27*0.02388)/C14*-100) )","v":0},0,0,0,0,0,0,0,0,{"$f":"IF(  L26+L27=0, IF(  L14<>0,\"Error\",0 ), IF( L14=0, \"Error\", (L26*0.086+L27*0.02388)/L14*-100) )","v":0},0,"not applic.","not applic.",{"$f":"IF(  P26+P27=0, IF(  SUM(C14:M14)<>0,\"Error\",0 ), IF( SUM(C14:M14)=0, \"Error\", (P26*0.086+P27*0.02388)/SUM(C14:M14)*-100) )","v":0}]

{"sheet":"Table 1 2030","index":7,"n_rows":35,"n_cols":16,"rows_kept":35,"cut":false,"hidden":false,"merged":[[30,0,30,1]]}
["Table 1 - Energy Balances (Mtoe)"]
[{"$f":"Database!B12&\" \"&Database!O11","v":"Australia 2030"}]
[]
[null,null,{"$f":"'2018'!C4","v":"Coal / Oil shale"},{"$f":"'2018'!D4","v":"Peat"},{"$f":"'2018'!E4","v":"Oil"},{"$f":"'2018'!F4","v":"Natural gas"},{"$f":"'2018'!G4","v":"Nuclear"},{"$f":"'2018'!H4","v":"Hydro"},{"$f":"'2018'!I4","v":"Wind"},{"$f":"'2018'!J4","v":"Geothermal"},{"$f":"'2018'!K4","v":"Solar"},{"$f":"'2018'!L4","v":"Tide, Etc."},{"$f":"'2018'!M4","v":"Biofuels & waste"},{"$f":"'2018'!N4","v":"Electricity"},{"$f":"'2018'!O4","v":"Heat"},{"$f":"'2018'!P4","v":"Total"}]
[null,null,"A","B","C","D","E","F","G","H","I","J","K","L","M","N"]
[{"$f":"'Energy Balance Time Series'!A6","v":"Production (+)"},"A",0,0,0,0,0,0,0,0,0,0,0,0,0,{"$f":"SUM(C6:O6)","v":0}]
[{"$f":"'Energy Balance Time Series'!A7","v":"Imports (+)"},"B",0,0,0,0,0,0,0,0,0,0,0,0,0,{"$f":"SUM(C7:O7)","v":0}]
[{"$f":"'Energy Balance Time Series'!A8","v":"Exports (–)"},"C",0,0,0,0,0,0,0,0,0,0,0,0,0,0]
[{"$f":"'Energy Balance Time Series'!A9","v":"International marine bunkers (–)"},"D",0,0,0,0,0,0,0,0,0,0,0,0,0,0]
[{"$f":"'Energy Balance Time Series'!A10","v":"International aviation bunkers (–)"},"E",0,0,0,0,0,0,0,0,0,0,0,0,0,0]
[{"$f":"'Energy Balance Time Series'!A11","v":"Stock changes (±)"},"F",0,0,0,0,0,0,0,0,0,0,0,0,0,0]
[{"$f":"'Energy Balance Time Series'!A12","v":"Total Energy Supply"},"G",{"$f":"SUM(C6:C11)","v":0},{"$f":"SUM(D6:D11)","v":0},0,0,0,0,0,0,0,0,0,0,{"$f":"SUM(O6:O11)","v":0},0]
[{"$f":"'Energy Balance Time Series'!A13","v":"Transformation processes & Energy industry own use"},"H",{"$f":"SUM(C14:C16)","v":0},{"$f":"SUM(D14:D16)","v":0},0,0,0,0,0,0,0,0,0,0,{"$f":"SUM(O14:O16)","v":0},0]
[{"$f":"'Energy Balance Time Series'!A14","v":"Electricity, CHP & heat plants (±)"},"I",0,0,0,0,0,0,0,0,0,0,0,0,0,0]
[{"$f":"'Energy Balance Time Series'!A15","v":"Other transformation processes (±)     "},"J",0,0,0,0,0,0,0,0,0,0,0,0,0,0]
[{"$f":"'Energy Balance Time Series'!A16","v":"Own use and Losses            "},"K",0,0,0,0,0,0,0,0,0,0,0,0,0,0]
[{"$f":"'Energy Balance Time Series'!A17","v":"Statistical differences (±)"},"L",0,0,0,0,0,0,0,0,0,0,0,0,0,0]
[{"$f":"'Energy Balance Time Series'!A18","v":"Total Final Consumption       "},"M",{"$f":"SUM(C19,C20,C22,C24)","v":0},{"$f":"SUM(D19,D20,D22,D24)","v":0},0,0,0,0,0,0,0,0,0,0,{"$f":"SUM(O19,O20,O22,O24)","v":0},0]
[{"$f":"'Energy Balance Time Series'!A19","v":"Industry (+)"},"N",0,0,0,0,0,0,0,0,0,0,0,0,0,0]
[{"$f":"'Energy Balance Time Series'!A20","v":"Transport (+)"},"O",0,0,0,0,0,0,0,0,0,0,0,0,0,0]
[{"$f":"'Energy Balance Time Series'!A21","v":"of which: Road (+)"},"P",0,0,0,0,0,0,0,0,0,0,0,0,0,0]
[{"$f":"'Energy Balance Time Series'!A22","v":"Other (+)"},"Q",0,0,0,0,0,0,0,0,0,0,0,0,0,0]
[{"$f":"'Energy Balance Time Series'!A23","v":"of which: Residential (+) "},"R",0,0,0,0,0,0,0,0,0,0,0,0,0,0]
[{"$f":"'Energy Balance Time Series'!A24","v":"Non-energy use (+)"},"S",0,0,0,0,0,0,0,0,0,0,0,0,0,0]
[{"$f":"'Energy Balance Time Series'!A25","v":"of which: chemical/petrochemical (+)"},"T",0,0,0,0,0,0,0,0,0,0,0,0,0,0]
[{"$f":"'Energy Balance Time Series'!A26","v":"Elec. Gen. Exc. Pumped storage (TWh) (+)"},"U",0,0,0,0,0,0,0,0,0,0,0,0,0,0]
[{"$f":"'Energy Balance Time Series'!A27","v":"Heat generated (PJ) (+)"},"V",0,0,0,0,0,0,0,0,0,0,0,0,0,0]
[]
[]
[{"$f":"\"Table 1 checks for \" & Database!B12&\" \"&Database!O11","v":"Table 1 checks for Australia 2030"}]
["Checksums (should be zero)"]
["TFC > sum of TPES, Transf., Stat.Diff.",null,{"$f":"ROUND(C18-(C12+C13+C17),3)","v":0},{"$f":"ROUND(D18-(D12+D13+D17),3)","v":0},0,0,0,0,0,0,0,{"$f":"ROUND(L18-(L12+L13+L17),3)","v":0},0,0,0,0]
["Conversion Mtoe to TWh",null,{"$f":"ROUND(P26*0.0859845228-N14-N27/41.868-O27/41.868+O6,3)","v":0}]
["Conversion Mtoe to PJ",null,{"$f":"ROUND(P27*0.0238845897-O14-O6,3)","v":0}]
["Calculated efficiency (%)",null,{"$f":"IF(  C26+C27=0, IF(  C14<>0,\"Error\",0 ), IF( C14=0, \"Error\", (C26*0.086+C27*0.02388)/C14*-100) )","v":0},0,0,0,0,0,0,0,0,{"$f":"IF(  L26+L27=0, IF(  L14<>0,\"Error\",0 ), IF( L14=0, \"Error\", (L26*0.086+L27*0.02388)/L14*-100) )","v":0},0,"not applic.","not applic.",{"$f":"IF(  P26+P27=0, IF(  SUM(C14:M14)<>0,\"Error\",0 ), IF( SUM(C14:M14)=0, \"Error\", (P26*0.086+P27*0.02388)/SUM(C14:M14)*-100) )","v":0}]

{"sheet":"Table 1 2040","index":8,"n_rows":35,"n_cols":16,"rows_kept":35,"cut":false,"hidden":false,"merged":[[30,0,30,1]]}
["Table 1 - Energy Balances (Mtoe)"]
[{"$f":"Database!B12&\" \"&Database!P11","v":"Australia 2040"}]
[]
[null,null,{"$f":"'2018'!C4","v":"Coal / Oil shale"},{"$f":"'2018'!D4","v":"Peat"},{"$f":"'2018'!E4","v":"Oil"},{"$f":"'2018'!F4","v":"Natural gas"},{"$f":"'2018'!G4","v":"Nuclear"},{"$f":"'2018'!H4","v":"Hydro"},{"$f":"'2018'!I4","v":"Wind"},{"$f":"'2018'!J4","v":"Geothermal"},{"$f":"'2018'!K4","v":"Solar"},{"$f":"'2018'!L4","v":"Tide, Etc."},{"$f":"'2018'!M4","v":"Biofuels & waste"},{"$f":"'2018'!N4","v":"Electricity"},{"$f":"'2018'!O4","v":"Heat"},{"$f":"'2018'!P4","v":"Total"}]
[null,null,"A","B","C","D","E","F","G","H","I","J","K","L","M","N"]
[{"$f":"'Energy Balance Time Series'!A6","v":"Production (+)"},"A",0,0,0,0,0,0,0,0,0,0,0,0,0,{"$f":"SUM(C6:O6)","v":0}]
[{"$f":"'Energy Balance Time Series'!A7","v":"Imports (+)"},"B",0,0,0,0,0,0,0,0,0,0,0,0,0,{"$f":"SUM(C7:O7)","v":0}]
[{"$f":"'Energy Balance Time Series'!A8","v":"Exports (–)"},"C",0,0,0,0,0,0,0,0,0,0,0,0,0,0]
[{"$f":"'Energy Balance Time Series'!A9","v":"International marine bunkers (–)"},"D",0,0,0,0,0,0,0,0,0,0,0,0,0,0]
[{"$f":"'Energy Balance Time Series'!A10","v":"International aviation bunkers (–)"},"E",0,0,0,0,0,0,0,0,0,0,0,0,0,0]
[{"$f":"'Energy Balance Time Series'!A11","v":"Stock changes (±)"},"F",0,0,0,0,0,0,0,0,0,0,0,0,0,0]
[{"$f":"'Energy Balance Time Series'!A12","v":"Total Energy Supply"},"G",{"$f":"SUM(C6:C11)","v":0},{"$f":"SUM(D6:D11)","v":0},0,0,0,0,0,0,0,0,0,0,{"$f":"SUM(O6:O11)","v":0},0]
[{"$f":"'Energy Balance Time Series'!A13","v":"Transformation processes & Energy industry own use"},"H",{"$f":"SUM(C14:C16)","v":0},{"$f":"SUM(D14:D16)","v":0},0,0,0,0,0,0,0,0,0,0,{"$f":"SUM(O14:O16)","v":0},0]
[{"$f":"'Energy Balance Time Series'!A14","v":"Electricity, CHP & heat plants (±)"},"I",0,0,0,0,0,0,0,0,0,0,0,0,0,0]
[{"$f":"'Energy Balance Time Series'!A15","v":"Other transformation processes (±)     "},"J",0,0,0,0,0,0,0,0,0,0,0,0,0,0]
[{"$f":"'Energy Balance Time Series'!A16","v":"Own use and Losses            "},"K",0,0,0,0,0,0,0,0,0,0,0,0,0,0]
[{"$f":"'Energy Balance Time Series'!A17","v":"Statistical differences (±)"},"L",0,0,0,0,0,0,0,0,0,0,0,0,0,0]
[{"$f":"'Energy Balance Time Series'!A18","v":"Total Final Consumption       "},"M",{"$f":"SUM(C19,C20,C22,C24)","v":0},{"$f":"SUM(D19,D20,D22,D24)","v":0},0,0,0,0,0,0,0,0,0,0,{"$f":"SUM(O19,O20,O22,O24)","v":0},0]
[{"$f":"'Energy Balance Time Series'!A19","v":"Industry (+)"},"N",0,0,0,0,0,0,0,0,0,0,0,0,0,0]
[{"$f":"'Energy Balance Time Series'!A20","v":"Transport (+)"},"O",0,0,0,0,0,0,0,0,0,0,0,0,0,0]
[{"$f":"'Energy Balance Time Series'!A21","v":"of which: Road (+)"},"P",0,0,0,0,0,0,0,0,0,0,0,0,0,0]
[{"$f":"'Energy Balance Time Series'!A22","v":"Other (+)"},"Q",0,0,0,0,0,0,0,0,0,0,0,0,0,0]
[{"$f":"'Energy Balance Time Series'!A23","v":"of which: Residential (+) "},"R",0,0,0,0,0,0,0,0,0,0,0,0,0,0]
[{"$f":"'Energy Balance Time Series'!A24","v":"Non-energy use (+)"},"S",0,0,0,0,0,0,0,0,0,0,0,0,0,0]
[{"$f":"'Energy Balance Time Series'!A25","v":"of which: chemical/petrochemical (+)"},"T",0,0,0,0,0,0,0,0,0,0,0,0,0,0]
[{"$f":"'Energy Balance Time Series'!A26","v":"Elec. Gen. Exc. Pumped storage (TWh) (+)"},"U",0,0,0,0,0,0,0,0,0,0,0,0,0,0]
[{"$f":"'Energy Balance Time Series'!A27","v":"Heat generated (PJ) (+)"},"V",0,0,0,0,0,0,0,0,0,0,0,0,0,0]
[]
[]
[{"$f":"\"Table 1 checks for \" & Database!B12&\" \"&Database!P11","v":"Table 1 checks for Australia 2040"}]
["Checksums (should be zero)"]
["TFC > sum of TPES, Transf., Stat.Diff.",null,{"$f":"ROUND(C18-(C12+C13+C17),3)","v":0},{"$f":"ROUND(D18-(D12+D13+D17),3)","v":0},0,0,0,0,0,0,0,{"$f":"ROUND(L18-(L12+L13+L17),3)","v":0},0,0,0,0]
["Conversion Mtoe to TWh",null,{"$f":"ROUND(P26*0.0859845228-N14-N27/41.868-O27/41.868+O6,3)","v":0}]
["Conversion Mtoe to PJ",null,{"$f":"ROUND(P27*0.0238845897-O14-O6,3)","v":0}]
["Calculated efficiency (%)",null,{"$f":"IF(  C26+C27=0, IF(  C14<>0,\"Error\",0 ), IF( C14=0, \"Error\", (C26*0.086+C27*0.02388)/C14*-100) )","v":0},0,0,0,0,0,0,0,0,{"$f":"IF(  L26+L27=0, IF(  L14<>0,\"Error\",0 ), IF( L14=0, \"Error\", (L26*0.086+L27*0.02388)/L14*-100) )","v":0},0,"not applic.","not applic.",{"$f":"IF(  P26+P27=0, IF(  SUM(C14:M14)<>0,\"Error\",0 ), IF( SUM(C14:M14)=0, \"Error\", (P26*0.086+P27*0.02388)/SUM(C14:M14)*-100) )","v":0}]

{"sheet":"Table 1 2050","index":9,"n_rows":35,"n_cols":16,"rows_kept":35,"cut":false,"hidden":false,"merged":[[30,0,30,1]]}
["Table 1 - Energy Balances (Mtoe)"]
[{"$f":"Database!B12&\" \"&Database!Q11&\" (optional)\"","v":"Australia 2050 (optional)"}]
[]
[null,null,{"$f":"'2018'!C4","v":"Coal / Oil shale"},{"$f":"'2018'!D4","v":"Peat"},{"$f":"'2018'!E4","v":"Oil"},{"$f":"'2018'!F4","v":"Natural gas"},{"$f":"'2018'!G4","v":"Nuclear"},{"$f":"'2018'!H4","v":"Hydro"},{"$f":"'2018'!I4","v":"Wind"},{"$f":"'2018'!J4","v":"Geothermal"},{"$f":"'2018'!K4","v":"Solar"},{"$f":"'2018'!L4","v":"Tide, Etc."},{"$f":"'2018'!M4","v":"Biofuels & waste"},{"$f":"'2018'!N4","v":"Electricity"},{"$f":"'2018'!O4","v":"Heat"},{"$f":"'2018'!P4","v":"Total"}]
[null,null,"A","B","C","D","E","F","G","H","I","J","K","L","M","N"]
[{"$f":"'Energy Balance Time Series'!A6","v":"Production (+)"},"A",0,0,0,0,0,0,0,0,0,0,0,0,0,{"$f":"SUM(C6:O6)","v":0}]
[{"$f":"'Energy Balance Time Series'!A7","v":"Imports (+)"},"B",0,0,0,0,0,0,0,0,0,0,0,0,0,{"$f":"SUM(C7:O7)","v":0}]
[{"$f":"'Energy Balance Time Series'!A8","v":"Exports (–)"},"C",0,0,0,0,0,0,0,0,0,0,0,0,0,0]
[{"$f":"'Energy Balance Time Series'!A9","v":"International marine bunkers (–)"},"D",0,0,0,0,0,0,0,0,0,0,0,0,0,0]
[{"$f":"'Energy Balance Time Series'!A10","v":"International aviation bunkers (–)"},"E",0,0,0,0,0,0,0,0,0,0,0,0,0,0]
[{"$f":"'Energy Balance Time Series'!A11","v":"Stock changes (±)"},"F",0,0,0,0,0,0,0,0,0,0,0,0,0,0]
[{"$f":"'Energy Balance Time Series'!A12","v":"Total Energy Supply"},"G",{"$f":"SUM(C6:C11)","v":0},{"$f":"SUM(D6:D11)","v":0},0,0,0,0,0,0,0,0,0,0,{"$f":"SUM(O6:O11)","v":0},0]
[{"$f":"'Energy Balance Time Series'!A13","v":"Transformation processes & Energy industry own use"},"H",{"$f":"SUM(C14:C16)","v":0},{"$f":"SUM(D14:D16)","v":0},0,0,0,0,0,0,0,0,0,0,{"$f":"SUM(O14:O16)","v":0},0]
[{"$f":"'Energy Balance Time Series'!A14","v":"Electricity, CHP & heat plants (±)"},"I",0,0,0,0,0,0,0,0,0,0,0,0,0,0]
[{"$f":"'Energy Balance Time Series'!A15","v":"Other transformation processes (±)     "},"J",0,0,0,0,0,0,0,0,0,0,0,0,0,0]
[{"$f":"'Energy Balance Time Series'!A16","v":"Own use and Losses            "},"K",0,0,0,0,0,0,0,0,0,0,0,0,0,0]
[{"$f":"'Energy Balance Time Series'!A17","v":"Statistical differences (±)"},"L",0,0,0,0,0,0,0,0,0,0,0,0,0,0]
[{"$f":"'Energy Balance Time Series'!A18","v":"Total Final Consumption       "},"M",{"$f":"SUM(C19,C20,C22,C24)","v":0},{"$f":"SUM(D19,D20,D22,D24)","v":0},0,0,0,0,0,0,0,0,0,0,{"$f":"SUM(O19,O20,O22,O24)","v":0},0]
[{"$f":"'Energy Balance Time Series'!A19","v":"Industry (+)"},"N",0,0,0,0,0,0,0,0,0,0,0,0,0,0]
[{"$f":"'Energy Balance Time Series'!A20","v":"Transport (+)"},"O",0,0,0,0,0,0,0,0,0,0,0,0,0,0]
[{"$f":"'Energy Balance Time Series'!A21","v":"of which: Road (+)"},"P",0,0,0,0,0,0,0,0,0,0,0,0,0,0]
[{"$f":"'Energy Balance Time Series'!A22","v":"Other (+)"},"Q",0,0,0,0,0,0,0,0,0,0,0,0,0,0]
[{"$f":"'Energy Balance Time Series'!A23","v":"of which: Residential (+) "},"R",0,0,0,0,0,0,0,0,0,0,0,0,0,0]
[{"$f":"'Energy Balance Time Series'!A24","v":"Non-energy use (+)"},"S",0,0,0,0,0,0,0,0,0,0,0,0,0,0]
[{"$f":"'Energy Balance Time Series'!A25","v":"of which: chemical/petrochemical (+)"},"T",0,0,0,0,0,0,0,0,0,0,0,0,0,0]
[{"$f":"'Energy Balance Time Series'!A26","v":"Elec. Gen. Exc. Pumped storage (TWh) (+)"},"U",0,0,0,0,0,0,0,0,0,0,0,0,0,0]
[{"$f":"'Energy Balance Time Series'!A27","v":"Heat generated (PJ) (+)"},"V",0,0,0,0,0,0,0,0,0,0,0,0,0,0]
[]
[]
[{"$f":"\"Table 1 checks for \" & Database!B12&\" \"&Database!Q11","v":"Table 1 checks for Australia 2050"}]
["Checksums (should be zero)"]
["TFC > sum of TPES, Transf., Stat.Diff.",null,{"$f":"ROUND(C18-(C12+C13+C17),3)","v":0},{"$f":"ROUND(D18-(D12+D13+D17),3)","v":0},0,0,0,0,0,0,0,0,0,0,0,0]
["Conversion Mtoe to TWh",null,{"$f":"ROUND(P26*0.0859845228-N14-N27/41.868-O27/41.868+O6,3)","v":0}]
["Conversion Mtoe to PJ",null,{"$f":"ROUND(P27*0.0238845897-O14-O6,3)","v":0}]
["Calculated efficiency (%)",null,{"$f":"IF(  C26+C27=0, IF(  C14<>0,\"Error\",0 ), IF( C14=0, \"Error\", (C26*0.086+C27*0.02388)/C14*-100) )","v":0},0,0,0,0,0,0,0,0,0,0,"not applic.","not applic.",{"$f":"IF(  P26+P27=0, IF(  SUM(C14:M14)<>0,\"Error\",0 ), IF( SUM(C14:M14)=0, \"Error\", (P26*0.086+P27*0.02388)/SUM(C14:M14)*-100) )","v":0}]

{"sheet":"Table 2","index":10,"n_rows":17,"n_cols":7,"rows_kept":17,"cut":false,"hidden":false,"merged":[]}
["Table 2"]
["Supplementary Data"]
[{"$f":"Database!B12","v":"Australia"}]
["Please note that there is no option to copy data from L.C. exists for this Table. Data must be entered by hand."]
[null,null,{"$f":"Database!M11","v":"2019P"},{"$f":"Database!N11","v":2020},{"$f":"Database!O11","v":2030},{"$f":"Database!P11","v":2040},{"$f":"Database!Q11&\" (optional)\"","v":"2050 (optional)"}]
[null,null,"A","B","C","D","E"]
["GDP Growth Rates (%)( 1 ) (2 )","A",0,0,0,0,0]
["Population (Millions) ( 2 )","B",0,0,0,0,0]
[]
["(1)  The annual growth rates (which refer to GDP in constant 2005 prices) should be calculated in the following way:"]
[{"$f":"\"     For \"&Database!B4&\" report the GDP \"&Database!B4&\"/GDP \"&Database!D11&\" annual rate.\"","v":"     For 2019 report the GDP 2019/GDP 2018 annual rate."}]
[{"$f":"\"     For \"&Database!B5&\" report the GDP \"&Database!B5&\"/GDP \"&Database!B4&\" average annual rate.\"","v":"     For 2020 report the GDP 2020/GDP 2019 average annual rate."}]
[{"$f":"\"     For \"&Database!C5&\" report the GDP \"&Database!C5&\"/GDP \"&Database!B5&\" average annual rate.\"","v":"     For 2030 report the GDP 2030/GDP 2020 average annual rate."}]
[{"$f":"\"     For \"&Database!D5&\" report the GDP \"&Database!D5&\"/GDP \"&Database!C5&\" average annual rate.\"","v":"     For 2040 report the GDP 2040/GDP 2030 average annual rate."}]
[{"$f":"\"     For \"&Database!E5&\" report the GDP \"&Database!E5&\"/GDP \"&Database!D5&\" average annual rate.\"","v":"     For 2050 report the GDP 2050/GDP 2040 average annual rate."}]
[{"$f":"\"(2)  Before publication, the Secretariat will update the provisional \" & Database!B4 & \" GDP and population figures submitted with those published in OECD \"","v":"(2)  Before publication, the Secretariat will update the provisional 2019 GDP and population figures submitted with those published in OECD "}]
["     National Accounts."]

{"sheet":"Table 3","index":11,"n_rows":41,"n_cols":16,"rows_kept":41,"cut":false,"hidden":false,"merged":[[0,10,1,17],[27,9,27,10],[16,9,16,10],[6,9,6,10]]}
["Table 3",null,null,null,null,null,null,null,null,null,"Table 3 Checks"]
["Coal Production, Imports and Exports (Mtoe)"]
[{"$f":"Database!B12","v":"Australia"}]
["Please note that there is no option to copy data from L.C. exists for this Table. Data must be entered by hand."]
["3/1"]
[null,null,{"$f":"Database!M11","v":"2019P"},{"$f":"Database!N11","v":2020},{"$f":"Database!O11","v":2030},{"$f":"Database!P11","v":2040},{"$f":"Database!Q11&\" (optional)\"","v":"2050 (optional)"},null,null,null,null,{"$f":"C6","v":"2019P"},{"$f":"D6","v":2020},{"$f":"E6","v":2030},{"$f":"F6","v":2040},{"$f":"G6","v":"2050 (optional)"}]
[null,null,"A","B","C","D","E",null,null,"Production of Coal",null,{"$f":"ROUND(C8-'Table 1 2019P'!C6,3)","v":0},{"$f":"ROUND(D8-'Table 1 2020'!C6,3)","v":0},{"$f":"ROUND(E8-'Table 1 2030'!C6,3)","v":0},{"$f":"ROUND(F8-'Table 1 2040'!C6,3)","v":0},{"$f":"ROUND(G8-'Table 1 2050'!C6,3)","v":0}]
["PRODUCTION (1)","A",{"$f":"SUM(C9:C13)","v":0},{"$f":"SUM(D9:D13)","v":0},{"$f":"SUM(E9:E13)","v":0},{"$f":"SUM(F9:F13)","v":0},{"$f":"SUM(G9:G13)","v":0},null,null,{"$f":"IF(SUMPRODUCT(--(ABS(L7:N7)>0.001))>0,\"Error - Difference between Table 1 & Table 3 for coal production\",IF(SUMPRODUCT(--(ABS(L7:N7)=0.001))>0,\"Warning: Rounding Difference between Table 1 & Table 3 for coal production\",\"\"))","v":""}]
["Anthracite","B",0,0,0,0,0]
["Coking Coal                   ","C",0,0,0,0,0]
["Other Bituminous Coal","D",0,0,0,0,0]
["Sub-Bituminous Coal           ","E",0,0,0,0,0]
["Lignite                       ","F",0,0,0,0,0]
[]
["3/2"]
[null,null,{"$f":"C6","v":"2019P"},2020,2030,2040,"2050 (optional)",null,null,null,null,{"$f":"C16","v":"2019P"},{"$f":"D16","v":2020},{"$f":"E16","v":2030},{"$f":"F16","v":2040},{"$f":"G16","v":"2050 (optional)"}]
[null,null,"A","B","C","D","E",null,null,"Imports of Coal",null,{"$f":"ROUND(C18-'Table 1 2019P'!C7,3)","v":0},{"$f":"ROUND(D18-'Table 1 2020'!C7,3)","v":0},{"$f":"ROUND(E18-'Table 1 2030'!C7,3)","v":0},{"$f":"ROUND(F18-'Table 1 2040'!C7,3)","v":0},{"$f":"ROUND(G18-'Table 1 2050'!C7,3)","v":0}]
["IMPORTS (2)","A",{"$f":"SUM(C19:C24)","v":0},{"$f":"SUM(D19:D24)","v":0},{"$f":"SUM(E19:E24)","v":0},{"$f":"SUM(F19:F24)","v":0},{"$f":"SUM(G19:G24)","v":0},null,null,{"$f":"IF(SUMPRODUCT(--(ABS(L17:N17)>0.001))>0,\"Error - Difference between Table 1 & Table 3 for coal imports\",IF(SUMPRODUCT(--(ABS(L17:N17)=0.001))>0,\"Warning: Rounding Difference between Table 1 & Table 3 for coal imports\",\"\"))","v":""}]
["Anthracite","B",0,0,0,0,0]
["Coking Coal                   ","C",0,0,0,0,0]
["Other Bituminous Coal","D",0,0,0,0,0]
["Sub-Bituminous Coal           ","E",0,0,0,0,0]
["Lignite                       ","F",0,0,0,0,0]
["Coal Products                 ","G",0,0,0,0,0]
[]
["3/3"]
[null,null,{"$f":"C6","v":"2019P"},2020,2030,2040,"2050 (optional)",null,null,null,null,{"$f":"C27","v":"2019P"},{"$f":"D27","v":2020},{"$f":"E27","v":2030},{"$f":"F27","v":2040},{"$f":"G27","v":"2050 (optional)"}]
[null,null,"A","B","C","D","E",null,null,"Exports of Coal",null,{"$f":"ROUND(C29+'Table 1 2019P'!C8,3)","v":0},{"$f":"ROUND(D29+'Table 1 2020'!C8,3)","v":0},{"$f":"ROUND(E29+'Table 1 2030'!C8,3)","v":0},{"$f":"ROUND(F29+'Table 1 2040'!C8,3)","v":0},{"$f":"ROUND(G29+'Table 1 2050'!C8,3)","v":0}]
["EXPORTS (3)","A",{"$f":"SUM(C30:C35)","v":0},{"$f":"SUM(D30:D35)","v":0},{"$f":"SUM(E30:E35)","v":0},{"$f":"SUM(F30:F35)","v":0},{"$f":"SUM(G30:G35)","v":0},null,null,{"$f":"IF(SUMPRODUCT(--(ABS(L28:N28)>0.001))>0,\"Error - Difference between Table 1 & Table 3 for coal exports\",IF(SUMPRODUCT(--(ABS(L28:N28)=0.001))>0,\"Warning: Rounding Difference between Table 1 & Table 3 for coal exports\",\"\"))","v":""}]
["Anthracite","B",0,0,0,0,0]
["Coking Coal                   ","C",0,0,0,0,0]
["Other Bituminous Coal","D",0,0,0,0,0]
["Sub-Bituminous Coal           ","E",0,0,0,0,0]
["Lignite                       ","F",0,0,0,0,0]
["Coal Products                 ","G",0,0,0,0,0]
[]
["(1) Should correspond to indigenous production of coal on the energy balances, Table 1 (cell AA)."]
["(2) Should correspond to imports of coal on the energy balances, Table 1 (cell BA)."]
["(3) Should correspond to exports of coal on the energy balances, Table 1 (cell CA)."]
["Note:  The definitions of product categories in this table are the same as those in the OECD Coal (Solid Fossil Fuels "]
["and Manufactured Gases) Questionnaire."]

{"sheet":"LastCycle","index":12,"n_rows":91,"n_cols":60,"rows_kept":91,"cut":false,"hidden":true,"merged":[]}
[null,null,null,null,null,null,null,"Without Qualifers",null,null,null,null,null,null,null,null,null,null,null,null,null,null,null,"With Qualifers",null,null,null,null,null,null,null,null,"Qualifers from Last Cycle:",null,null,null,null,null,null,null,null,null,null,null,null,null,null,"Last Cycle Data Used?"]
["COUNTRY","Australia",null,null,null,null,null,null,null,null,null,null,null,null,null,null,"COUNTRY","Australia",null,null,null,null,null,null,null,null,null,null,null,null,null,null,"COUNTRY","Germany",null,null,null,null,null,null,null,null,null,null,null,null,null,"Germany"]
[null,"Coal / oil shale","Peat and peat products","Oil","Natural gas","Nuclear","Hydro","Wind","Geothermal","Solar","Tide etc.","Biofuels and waste","Heat","Electricity","Total",null,null,"Coal / oil shale","Peat and peat products","Oil","Natural gas","Nuclear","Hydro","Wind","Geothermal","Solar","Tide etc.","Biofuels and waste","Heat","Electricity","Total",null,null,"Coal (excluding PEAT)","Peat","Oil","Natural Gas","Nuclear","Hydro","Wind","Geothermal","Solar, Tide, Wave, Ocean","Biofuels and waste","Electricity","Heat","Total",null,"Coal (excluding PEAT)","Peat","Oil","Natural Gas","Nuclear","Hydro","Wind","Geothermal","Solar, Tide, Wave, Ocean","Biofuels and waste","Electricity","Heat","Total"]
["2020.LC.Production                                  ",310.33199999999999,0,0,0,0,0,0,0,0,0,0,0,0,0,null,"2020.LC.Production                                  ",310.33199999999999,"..","..","..","..","..","..","..","..",0,"..","..","..","..",null,"2020.LC.Production                                  ",4,0,4,4,4,4,4,4,4,4,0,0,4,null,0,0,0,0,0,0,0,0,0,0,0,0,0]
["2020.LC.Imports                                     ",0,0,0,0,0,0,0,0,0,0,0,0,0,0,null,"2020.LC.Imports                                     ","..","..","..","..","..","..","..","..","..",0,"..","..","..","..",null,"2020.LC.Imports                                     ",4,0,4,4,0,0,0,0,0,0,4,0,4,null,0,0,0,0,0,0,0,0,0,0,1.3979999999999999,0,1.3979999999999961]
["2020.LC.Exports                                     ",-270.89999999999998,0,0,0,0,0,0,0,0,0,0,0,0,0,null,"2020.LC.Exports                                     ",-270.89999999999998,"..","..","..","..","..","..","..","..",0,"..","..","..","..",null,"2020.LC.Exports                                     ",4,0,4,4,0,0,0,0,0,0,4,0,4,null,0,0,0,0,0,0,0,0,0,0,0,0,0]
["2020.LC.International Marine Bunkers                ",0,0,0,0,0,0,0,0,0,0,0,0,0,0,null,"2020.LC.International Marine Bunkers                ","..","..","..","..","..","..","..","..","..",0,"..","..","..","..",null,"2020.LC.International Marine Bunkers                ",0,0,4,0,0,0,0,0,0,0,0,0,4,null,0,0,0,0,0,0,0,0,0,0,0,0,0]
["2020.LC.International Aviation Bunkers              ",0,0,0,0,0,0,0,0,0,0,0,0,0,0,null,"2020.LC.International Aviation Bunkers              ","..","..","..","..","..","..","..","..","..",0,"..","..","..","..",null,"2020.LC.International Aviation Bunkers              "]
["2020.LC.Stock Changes                               ",0,0,0,0,0,0,0,0,0,0,0,0,0,0,null,"2020.LC.Stock Changes                               ","..","..","..","..","..","..","..","..","..",0,"..","..","..","..",null,"2020.LC.Stock Changes                               ",0,0,0,0,0,0,0,0,0,0,0,0,0,null,0,0,0,0,0,0,0,0,0,0,0,0,0]
["2020.LC.Total Primary Energy Supply                 ",39.432000000000002,0,0,0,0,0,0,0,0,0,0,0,0,0,null,"2020.LC.Total Primary Energy Supply                 ",39.432000000000002,"..","..","..","..","..","..","..","..",0,"..","..","..","..",null,"2020.LC.Total Primary Energy Supply                 ",4,0,4,4,4,4,4,4,4,4,4,0,4,null,0,0,0,0,0,0,0,0,0,0,1.3979999999999999,0,1.3979999999999677]
["2020.LC.Transf. and Energy Ind. own use             ",0,0,0,0,0,0,0,0,0,0,0,0,0,0,null,"2020.LC.Transf. and Energy Ind. own use             ","..","..","..","..","..","..","..","..","..",0,"..","..","..","..",null,"2020.LC.Transf. and Energy Ind. own use             ",4,0,4,4,4,4,4,4,4,4,4,4,4,null,0,0,0,0,0,0,0,0,0,0,0,0,0]
["2020.LC.Electricity, CHP and heat plants            ",0,0,0,0,0,0,0,0,0,0,0,0,0,0,null,"2020.LC.Electricity, CHP and heat plants            ","..","..","..","..","..","..","..","..","..",0,"..","..","..","..",null,"2020.LC.Electricity, CHP and Heat Plants            ",4,0,4,4,4,4,4,4,4,4,4,4,4,null,0,0,0,0,0,0,0,0,0,0,0,0,0]
["2020.LC.Other transformation                        ",0,0,0,0,0,0,0,0,0,0,0,0,0,0,null,"2020.LC.Other transformation                        ","..","..","..","..","..","..","..","..","..",0,"..","..","..","..",null,"2020.LC.Other transformation                        ",4,0,4,4,0,0,0,0,0,4,0,0,4,null,0,0,0,0,0,0,0,0,0,0,0,0,0]
["2020.LC.Own Use and Losses                          ",0,0,0,0,0,0,0,0,0,0,0,0,0,0,null,"2020.LC.Own Use and Losses                          ","..","..","..","..","..","..","..","..","..",0,"..","..","..","..",null,"2020.LC.Own Use and Losses                          ",4,0,4,4,0,0,0,0,0,4,4,4,4,null,0,0,0,0,0,0,0,0,0,0,0,0,0]
["2020.LC.Statistical Differences                     ",0,0,0,0,0,0,0,0,0,0,0,0,0,0,null,"2020.LC.Statistical Differences                     ","..","..","..","..","..","..","..","..","..",0,"..","..","..","..",null,"2020.LC.Statistical Differences                     ",0,0,0,0,0,0,0,0,0,4,0,0,4,null,0,0,0,0,0,0,0,0,0,0,0,0,0]
["2020.LC.Total Final Consumption                     ",0,0,35.279000000000003,6.0999999999999999E-2,0,0,0,0,0,0,0.14699999999999999,0,0.28799999999999998,0,null,"2020.LC.Total Final Consumption                     ","..","..",35.279000000000003,6.0999999999999999E-2,"..","..","..","..","..",0,0.14699999999999999,"..",0.28799999999999998,"..",null,"2020.LC.Total Final Consumption                     ",4,0,4,4,0,0,0,4,4,4,4,4,4,null,0,0,0,0,0,0,0,0,0,0,0,0,0]
["2020.LC.Industry                                    ",0,0,0,0,0,0,0,0,0,0,0,0,0,0,null,"2020.LC.Industry                                    ","..","..","..","..","..","..","..","..","..",0,"..","..","..","..",null,"2020.LC.Industry                                    ",4,0,4,4,0,0,0,4,0,4,4,4,4,null,0,0,0,0,0,0,0,0,0,0,0,0,0]
["2020.LC.Transport                                   ",0,0,35.279000000000003,6.0999999999999999E-2,0,0,0,0,0,0,0.14699999999999999,0,0.28799999999999998,35.774999999999999,null,"2020.LC.Transport                                   ",0,0,35.279000000000003,6.0999999999999999E-2,0,0,0,0,0,0,0.14699999999999999,0,0.28799999999999998,35.774999999999999,null,"2020.LC.Transport                                   ",0,0,4,4,0,0,0,0,0,4,4,0,4,null,0,0,0,0,0,0,0,0,0,0,0,0,0]
["2020.LC.of which: Road                              ",0,0,30.056999999999999,5.6000000000000001E-2,0,0,0,0,0,0,0.14699999999999999,0,8.0000000000000002E-3,30.268000000000001,null,"2020.LC.of which: Road                              ",0,0,30.056999999999999,5.6000000000000001E-2,0,0,0,0,0,0,0.14699999999999999,0,8.0000000000000002E-3,30.268000000000001,null,"2020.LC.of which: Road                              ",0,0,4,4,0,0,0,0,0,4,4,0,4,null,0,0,0,0,0,0,0,0,0,0,0,0,0]
["2020.LC.Other energy consumption                    ",0,0,0,0,0,0,0,0,0,0,0,0,0,0,null,"2020.LC.Other energy consumption                    ","..","..","..","..","..","..","..","..","..",0,"..","..","..","..",null,"2020.LC.Other energy consumption                    ",4,0,4,4,0,0,0,4,4,4,4,4,4,null,0,0,0,0,0,0,0,0,0,0,0,0,0]
["2020.LC.of which: Residential                       ",0,0,0,0,0,0,0,0,0,0,0,0,0,0,null,"2020.LC.of which: Residential                       ","..","..","..","..","..","..","..","..","..",0,"..","..","..","..",null,"2020.LC.of which: Residential                       ",4,0,4,4,0,0,0,4,4,4,4,4,4,null,0,0,0,0,0,0,0,0,0,0,0,0,0]
["2020.LC.Non-Energy Use                              ",0,0,0,0,0,0,0,0,0,0,0,0,0,0,null,"2020.LC.Non-Energy Use                              ","..","..","..","..","..","..","..","..","..",0,"..","..","..","..",null,"2020.LC.Non-Energy Use                              ",4,0,4,4,0,0,0,0,0,0,0,0,4,null,0,0,0,0,0,0,0,0,0,0,0,0,0]
["2020.LC.of which: chemical/petrochemical            ",0,0,0,0,0,0,0,0,0,0,0,0,0,0,null,"2020.LC.of which: chemical/petrochemical            ","..","..","..","..","..","..","..","..","..",0,"..","..","..","..",null,"2020.LC.of which: Petrochem Feedstocks              ",4,0,4,4,0,0,0,0,0,0,0,0,4,null,0,0,0,0,0,0,0,0,0,0,0,0,0]
["2020.LC.Electricity Generated (excl. pumped storage)",132.69800000000001,0,4.2519999999999998,39.648000000000003,0,14.917999999999999,25.827000000000002,0,24.87,0,0,0,0,242.21299999999999,null,"2020.LC.Electricity Generated (excl. pumped storage)",132.69800000000001,0,4.2519999999999998,39.648000000000003,0,14.917999999999999,25.827000000000002,0,24.87,0,0,0,0,242.21299999999999,null,"2020.LC.Electricity Generated (excl. pumped storage)",4,0,0,4,4,4,4,4,4,4,0,0,4,null,0,0,0,0,0,0,0,0,0,0,0,0,0]
["2020.LC.Heat Generated                              ",0,0,0,0,0,0,0,0,0,0,0,0,0,0,null,"2020.LC.Heat Generated                              ","..","..","..","..","..","..","..","..","..",0,"..","..","..","..",null,"2020.LC.Heat Generated                              ",4,0,4,4,0,0,0,4,0,4,0,0,4,null,0,0,0,0,0,0,0,0,0,0,0,0,0]
["2030.LC.Production                                  ",0,0,0,0,0,0,0,0,0,0,0,0,0,0,null,"2030.LC.Production                                  ","..","..","..","..","..","..","..","..","..",0,"..","..","..","..",null,"2030.LC.Production                                  ",4,0,4,4,0,4,4,4,4,4,0,0,4,null,0,0,0,0,0,0,0,0,0,0,0,0,0]
["2030.LC.Imports                                     ",0,0,0,0,0,0,0,0,0,0,0,0,0,0,null,"2030.LC.Imports                                     ","..","..","..","..","..","..","..","..","..",0,"..","..","..","..",null,"2030.LC.Imports                                     ",4,0,4,4,0,0,0,0,0,4,4,0,4,null,0,0,0,0,0,0,0,0,0,0,0,0,0]
["2030.LC.Exports                                     ",0,0,0,0,0,0,0,0,0,0,0,0,0,0,null,"2030.LC.Exports                                     ","..","..","..","..","..","..","..","..","..",0,"..","..","..","..",null,"2030.LC.Exports                                     ",4,0,4,4,0,0,0,0,0,0,4,0,4,null,0,0,0,0,0,0,0,0,0,0,0,0,0]
["2030.LC.International Marine Bunkers                ",0,0,0,0,0,0,0,0,0,0,0,0,0,0,null,"2030.LC.International Marine Bunkers                ","..","..","..","..","..","..","..","..","..",0,"..","..","..","..",null,"2030.LC.International Marine Bunkers                ",0,0,4,0,0,0,0,0,0,0,0,0,4,null,0,0,0,0,0,0,0,0,0,0,0,0,0]
["2030.LC.International Aviation Bunkers              ",0,0,0,0,0,0,0,0,0,0,0,0,0,0,null,"2030.LC.International Aviation Bunkers              ","..","..","..","..","..","..","..","..","..",0,"..","..","..","..",null,"2030.LC.International Aviation Bunkers              "]
["2030.LC.Stock Changes                               ",0,0,0,0,0,0,0,0,0,0,0,0,0,0,null,"2030.LC.Stock Changes                               ","..","..","..","..","..","..","..","..","..",0,"..","..","..","..",null,"2030.LC.Stock Changes                               ",0,0,0,0,0,0,0,0,0,0,0,0,0,null,0,0,0,0,0,0,0,0,0,0,0,0,0]
["2030.LC.Total Primary Energy Supply                 ",0,0,0,0,0,0,0,0,0,0,0,0,0,0,null,"2030.LC.Total Primary Energy Supply                 ","..","..","..","..","..","..","..","..","..",0,"..","..","..","..",null,"2030.LC.Total Primary Energy Supply                 ",4,0,4,4,0,4,4,4,4,4,4,0,4,null,0,0,0,0,0,0,0,0,0,0,0,0,0]
["2030.LC.Transf. and Energy Ind. own use             ",0,0,0,0,0,0,0,0,0,0,0,0,0,0,null,"2030.LC.Transf. and Energy Ind. own use             ","..","..","..","..","..","..","..","..","..",0,"..","..","..","..",null,"2030.LC.Transf. and Energy Ind. own use             ",4,0,4,4,0,4,4,4,4,4,4,4,4,null,0,0,0,0,0,0,0,0,0,0,0,0,0]
["2030.LC.Electricity, CHP and heat plants            ",0,0,0,0,0,0,0,0,0,0,0,0,0,0,null,"2030.LC.Electricity, CHP and heat plants            ","..","..","..","..","..","..","..","..","..",0,"..","..","..","..",null,"2030.LC.Electricity, CHP and Heat Plants            ",4,0,4,4,0,4,4,4,4,4,4,4,4,null,0,0,0,0,0,0,0,0,0,0,0,0,0]
["2030.LC.Other transformation                        ",0,0,0,0,0,0,0,0,0,0,0,0,0,0,null,"2030.LC.Other transformation                        ","..","..","..","..","..","..","..","..","..",0,"..","..","..","..",null,"2030.LC.Other transformation                        ",4,0,4,4,0,0,0,0,0,4,0,0,4,null,0,0,0,0,0,0,0,0,0,0,0,0,0]
["2030.LC.Own Use and Losses                          ",0,0,0,0,0,0,0,0,0,0,0,0,0,0,null,"2030.LC.Own Use and Losses                          ","..","..","..","..","..","..","..","..","..",0,"..","..","..","..",null,"2030.LC.Own Use and Losses                          ",4,0,4,4,0,0,0,0,0,4,4,4,4,null,0,0,0,0,0,0,0,0,0,0,0,0,0]
["2030.LC.Statistical Differences                     ",0,0,0,0,0,0,0,0,0,0,0,0,0,0,null,"2030.LC.Statistical Differences                     ","..","..","..","..","..","..","..","..","..",0,"..","..","..","..",null,"2030.LC.Statistical Differences                     ",0,0,0,0,0,0,0,0,0,4,0,0,4,null,0,0,0,0,0,0,0,0,0,0,0,0,0]
["2030.LC.Total Final Consumption                     ",0,0,37.898000000000003,6.0000000000000001E-3,0,0,0,0,0,0,0.224,0,1.623,0,null,"2030.LC.Total Final Consumption                     ","..","..",37.898000000000003,6.0000000000000001E-3,"..","..","..","..","..",0,0.224,"..",1.623,"..",null,"2030.LC.Total Final Consumption                     ",4,0,4,4,0,0,0,4,4,4,4,4,4,null,0,0,0,0,0,0,0,0,0,0,0,0,0]
["2030.LC.Industry                                    ",0,0,0,0,0,0,0,0,0,0,0,0,0,0,null,"2030.LC.Industry                                    ","..","..","..","..","..","..","..","..","..",0,"..","..","..","..",null,"2030.LC.Industry                                    ",4,0,4,4,0,0,0,4,0,4,4,4,4,null,0,0,0,0,0,0,0,0,0,0,0,0,0]
["2030.LC.Transport                                   ",0,0,37.898000000000003,6.0000000000000001E-3,0,0,0,0,0,0,0.224,0,1.623,39.750999999999998,null,"2030.LC.Transport                                   ",0,0,37.898000000000003,6.0000000000000001E-3,0,0,0,0,0,0,0.224,0,1.623,39.750999999999998,null,"2030.LC.Transport                                   ",0,0,4,4,0,0,0,0,0,4,4,0,4,null,0,0,0,0,0,0,0,0,0,0,0,0,0]
["2030.LC.of which: Road                              ",0,0,32.277999999999999,0,0,0,0,0,0,0,0.224,0,1.325,33.826999999999998,null,"2030.LC.of which: Road                              ",0,0,32.277999999999999,0,0,0,0,0,0,0,0.224,0,1.325,33.826999999999998,null,"2030.LC.of which: Road                              ",0,0,4,4,0,0,0,0,0,4,4,0,4,null,0,0,0,0,0,0,0,0,0,0,0,0,0]
["2030.LC.Other energy consumption                    ",0,0,0,0,0,0,0,0,0,0,0,0,0,0,null,"2030.LC.Other energy consumption                    ","..","..","..","..","..","..","..","..","..",0,"..","..","..","..",null,"2030.LC.Other energy consumption                    ",4,0,4,4,0,0,0,4,4,4,4,4,4,null,0,0,0,0,0,0,0,0,0,0,0,0,0]
["2030.LC.of which: Residential                       ",0,0,0,0,0,0,0,0,0,0,0,0,0,0,null,"2030.LC.of which: Residential                       ","..","..","..","..","..","..","..","..","..",0,"..","..","..","..",null,"2030.LC.of which: Residential                       ",4,0,4,4,0,0,0,4,4,4,4,4,4,null,0,0,0,0,0,0,0,0,0,0,0,0,0]
["2030.LC.Non-Energy Use                              ",0,0,0,0,0,0,0,0,0,0,0,0,0,0,null,"2030.LC.Non-Energy Use                              ","..","..","..","..","..","..","..","..","..",0,"..","..","..","..",null,"2030.LC.Non-Energy Use                              ",4,0,4,4,0,0,0,0,0,0,0,0,4,null,0,0,0,0,0,0,0,0,0,0,0,0,0]
["2030.LC.of which: chemical/petrochemical            ",0,0,0,0,0,0,0,0,0,0,0,0,0,0,null,"2030.LC.of which: chemical/petrochemical            ","..","..","..","..","..","..","..","..","..",0,"..","..","..","..",null,"2030.LC.of which: Petrochem Feedstocks              ",4,0,4,4,0,0,0,0,0,0,0,0,4,null,0,0,0,0,0,0,0,0,0,0,0,0,0]
["2030.LC.Electricity Generated (excl. pumped storage)",103.508,0,2.3690000000000002,26.428000000000001,0,14.541,52.716999999999999,0,54.228000000000002,0,0,0,0,253.79,null,"2030.LC.Electricity Generated (excl. pumped storage)",103.508,0,2.3690000000000002,26.428000000000001,0,14.541,52.716999999999999,0,54.228000000000002,0,0,0,0,253.79,null,"2030.LC.Electricity Generated (excl. pumped storage)",4,0,0,4,0,4,4,4,4,4,0,0,4,null,0,0,0,0,0,0,0,0,0,0,0,0,0]
["2030.LC.Heat Generated                              ",0,0,0,0,0,0,0,0,0,0,0,0,0,0,null,"2030.LC.Heat Generated                              ","..","..","..","..","..","..","..","..","..",0,"..","..","..","..",null,"2030.LC.Heat Generated                              ",4,0,4,4,0,0,0,4,0,4,0,0,4,null,0,0,0,0,0,0,0,0,0,0,0,0,0]
["2040.LC.Production                                  ",0,0,0,0,0,0,0,0,0,0,0,0,0,0,null,"2040.LC.Production                                  ","..","..","..","..","..","..","..","..","..",0,"..","..","..",".."]
["2040.LC.Imports                                     ",0,0,0,0,0,0,0,0,0,0,0,0,0,0,null,"2040.LC.Imports                                     ","..","..","..","..","..","..","..","..","..",0,"..","..","..",".."]
["2040.LC.Exports                                     ",0,0,0,0,0,0,0,0,0,0,0,0,0,0,null,"2040.LC.Exports                                     ","..","..","..","..","..","..","..","..","..",0,"..","..","..",".."]
["2040.LC.International Marine Bunkers                ",0,0,0,0,0,0,0,0,0,0,0,0,0,0,null,"2040.LC.International Marine Bunkers                ","..","..","..","..","..","..","..","..","..",0,"..","..","..",".."]
["2040.LC.International Aviation Bunkers              ",0,0,0,0,0,0,0,0,0,0,0,0,0,0,null,"2040.LC.International Aviation Bunkers              ","..","..","..","..","..","..","..","..","..",0,"..","..","..",".."]
["2040.LC.Stock Changes                               ",0,0,0,0,0,0,0,0,0,0,0,0,0,0,null,"2040.LC.Stock Changes                               ","..","..","..","..","..","..","..","..","..",0,"..","..","..",".."]
["2040.LC.Total Primary Energy Supply                 ",0,0,0,0,0,0,0,0,0,0,0,0,0,0,null,"2040.LC.Total Primary Energy Supply                 ","..","..","..","..","..","..","..","..","..",0,"..","..","..",".."]
["2040.LC.Transf. and Energy Ind. own use             ",0,0,0,0,0,0,0,0,0,0,0,0,0,0,null,"2040.LC.Transf. and Energy Ind. own use             ","..","..","..","..","..","..","..","..","..",0,"..","..","..",".."]
["2040.LC.Electricity, CHP and heat plants            ",0,0,0,0,0,0,0,0,0,0,0,0,0,0,null,"2040.LC.Electricity, CHP and heat plants            ","..","..","..","..","..","..","..","..","..",0,"..","..","..",".."]
["2040.LC.Other transformation                        ",0,0,0,0,0,0,0,0,0,0,0,0,0,0,null,"2040.LC.Other transformation                        ","..","..","..","..","..","..","..","..","..",0,"..","..","..",".."]
["2040.LC.Own Use and Losses                          ",0,0,0,0,0,0,0,0,0,0,0,0,0,0,null,"2040.LC.Own Use and Losses                          ","..","..","..","..","..","..","..","..","..",0,"..","..","..",".."]
["2040.LC.Statistical Differences                     ",0,0,0,0,0,0,0,0,0,0,0,0,0,0,null,"2040.LC.Statistical Differences                     ","..","..","..","..","..","..","..","..","..",0,"..","..","..",".."]
["2040.LC.Total Final Consumption                     ",0,0,0,0,0,0,0,0,0,0,0,0,0,0,null,"2040.LC.Total Final Consumption                     ","..","..","..","..","..","..","..","..","..",0,"..","..","..",".."]
["2040.LC.Industry                                    ",0,0,0,0,0,0,0,0,0,0,0,0,0,0,null,"2040.LC.Industry                                    ","..","..","..","..","..","..","..","..","..",0,"..","..","..",".."]
["2040.LC.Transport                                   ",0,0,0,0,0,0,0,0,0,0,0,0,0,0,null,"2040.LC.Transport                                   ","..","..","..","..","..","..","..","..","..",0,"..","..","..",".."]
["2040.LC.of which: Road                              ",0,0,0,0,0,0,0,0,0,0,0,0,0,0,null,"2040.LC.of which: Road                              ","..","..","..","..","..","..","..","..","..",0,"..","..","..",".."]
["2040.LC.Other energy consumption                    ",0,0,0,0,0,0,0,0,0,0,0,0,0,0,null,"2040.LC.Other energy consumption                    ","..","..","..","..","..","..","..","..","..",0,"..","..","..",".."]
["2040.LC.of which: Residential                       ",0,0,0,0,0,0,0,0,0,0,0,0,0,0,null,"2040.LC.of which: Residential                       ","..","..","..","..","..","..","..","..","..",0,"..","..","..",".."]
["2040.LC.Non-Energy Use                              ",0,0,0,0,0,0,0,0,0,0,0,0,0,0,null,"2040.LC.Non-Energy Use                              ","..","..","..","..","..","..","..","..","..",0,"..","..","..",".."]
["2040.LC.of which: chemical/petrochemical            ",0,0,0,0,0,0,0,0,0,0,0,0,0,0,null,"2040.LC.of which: chemical/petrochemical            ","..","..","..","..","..","..","..","..","..",0,"..","..","..",".."]
["2040.LC.Electricity Generated (excl. pumped storage)",0,0,0,0,0,0,0,0,0,0,0,0,0,0,null,"2040.LC.Electricity Generated (excl. pumped storage)","..","..","..","..","..","..","..","..","..",0,"..","..","..",".."]
["2040.LC.Heat Generated                              ",0,0,0,0,0,0,0,0,0,0,0,0,0,0,null,"2040.LC.Heat Generated                              ","..","..","..","..","..","..","..","..","..",0,"..","..","..",".."]
["2050.LC.Production                                  ",0,0,0,0,0,0,0,0,0,0,0,0,0,0,null,"2050.LC.Production                                  ","..","..","..","..","..","..","..","..","..",0,"..","..","..",".."]
["2050.LC.Imports                                     ",0,0,0,0,0,0,0,0,0,0,0,0,0,0,null,"2050.LC.Imports                                     ","..","..","..","..","..","..","..","..","..",0,"..","..","..",".."]
["2050.LC.Exports                                     ",0,0,0,0,0,0,0,0,0,0,0,0,0,0,null,"2050.LC.Exports                                     ","..","..","..","..","..","..","..","..","..",0,"..","..","..",".."]
["2050.LC.International Marine Bunkers                ",0,0,0,0,0,0,0,0,0,0,0,0,0,0,null,"2050.LC.International Marine Bunkers                ","..","..","..","..","..","..","..","..","..",0,"..","..","..",".."]
["2050.LC.International Aviation Bunkers              ",0,0,0,0,0,0,0,0,0,0,0,0,0,0,null,"2050.LC.International Aviation Bunkers              ","..","..","..","..","..","..","..","..","..",0,"..","..","..",".."]
["2050.LC.Stock Changes                               ",0,0,0,0,0,0,0,0,0,0,0,0,0,0,null,"2050.LC.Stock Changes                               ","..","..","..","..","..","..","..","..","..",0,"..","..","..",".."]
["2050.LC.Total Primary Energy Supply                 ",0,0,0,0,0,0,0,0,0,0,0,0,0,0,null,"2050.LC.Total Primary Energy Supply                 ","..","..","..","..","..","..","..","..","..",0,"..","..","..",".."]
["2050.LC.Transf. and Energy Ind. own use             ",0,0,0,0,0,0,0,0,0,0,0,0,0,0,null,"2050.LC.Transf. and Energy Ind. own use             ","..","..","..","..","..","..","..","..","..",0,"..","..","..",".."]
["2050.LC.Electricity, CHP and heat plants            ",0,0,0,0,0,0,0,0,0,0,0,0,0,0,null,"2050.LC.Electricity, CHP and heat plants            ","..","..","..","..","..","..","..","..","..",0,"..","..","..",".."]
["2050.LC.Other transformation                        ",0,0,0,0,0,0,0,0,0,0,0,0,0,0,null,"2050.LC.Other transformation                        ","..","..","..","..","..","..","..","..","..",0,"..","..","..",".."]
["2050.LC.Own Use and Losses                          ",0,0,0,0,0,0,0,0,0,0,0,0,0,0,null,"2050.LC.Own Use and Losses                          ","..","..","..","..","..","..","..","..","..",0,"..","..","..",".."]
["2050.LC.Statistical Differences                     ",0,0,0,0,0,0,0,0,0,0,0,0,0,0,null,"2050.LC.Statistical Differences                     ","..","..","..","..","..","..","..","..","..",0,"..","..","..",".."]
["2050.LC.Total Final Consumption                     ",0,0,0,0,0,0,0,0,0,0,0,0,0,0,null,"2050.LC.Total Final Consumption                     ","..","..","..","..","..","..","..","..","..",0,"..","..","..",".."]
["2050.LC.Industry                                    ",0,0,0,0,0,0,0,0,0,0,0,0,0,0,null,"2050.LC.Industry                                    ","..","..","..","..","..","..","..","..","..",0,"..","..","..",".."]
["2050.LC.Transport                                   ",0,0,0,0,0,0,0,0,0,0,0,0,0,0,null,"2050.LC.Transport                                   ","..","..","..","..","..","..","..","..","..",0,"..","..","..",".."]
["2050.LC.of which: Road                              ",0,0,0,0,0,0,0,0,0,0,0,0,0,0,null,"2050.LC.of which: Road                              ","..","..","..","..","..","..","..","..","..",0,"..","..","..",".."]
["2050.LC.Other energy consumption                    ",0,0,0,0,0,0,0,0,0,0,0,0,0,0,null,"2050.LC.Other energy consumption                    ","..","..","..","..","..","..","..","..","..",0,"..","..","..",".."]
["2050.LC.of which: Residential                       ",0,0,0,0,0,0,0,0,0,0,0,0,0,0,null,"2050.LC.of which: Residential                       ","..","..","..","..","..","..","..","..","..",0,"..","..","..",".."]
["2050.LC.Non-Energy Use                              ",0,0,0,0,0,0,0,0,0,0,0,0,0,0,null,"2050.LC.Non-Energy Use                              ","..","..","..","..","..","..","..","..","..",0,"..","..","..",".."]
["2050.LC.of which: chemical/petrochemical            ",0,0,0,0,0,0,0,0,0,0,0,0,0,0,null,"2050.LC.of which: chemical/petrochemical            ","..","..","..","..","..","..","..","..","..",0,"..","..","..",".."]
["2050.LC.Electricity Generated (excl. pumped storage)",0,0,0,0,0,0,0,0,0,0,0,0,0,0,null,"2050.LC.Electricity Generated (excl. pumped storage)","..","..","..","..","..","..","..","..","..",0,"..","..","..",".."]
["2050.LC.Heat Generated                              ",0,0,0,0,0,0,0,0,0,0,0,0,0,0,null,"2050.LC.Heat Generated                              ","..","..","..","..","..","..","..","..","..",0,"..","..","..",".."]

{"sheet":"Database","index":13,"n_rows":321,"n_cols":17,"rows_kept":321,"cut":false,"hidden":true,"merged":[[9,9,9,11],[9,13,9,16],[9,1,9,3],[9,4,9,7]]}
[]
["I. Data for Time Elements"]
["Cycle Years",{"$f":"B4+1","v":2020},{"$f":"B3+1","v":2021},null,null,null,null,null,null,{"$f":"B3","v":2020},2021]
["Provisional Year",{"$f":"D6+1","v":2019},{"$f":"B4 & \"P\"","v":"2019P"},null,null,null,null,null,null,2019,"2019P"]
["Projection Years (db)",2020,2030,2040,2050,null,null,null,null,2020,2030,{"$f":"D5","v":2040},{"$f":"E5","v":2050}]
["Historical Years (db)",{"$f":"B13","v":2016},{"$f":"C13","v":2017},{"$f":"D13","v":2018},null,null,null,null,null,2016,2017,{"$f":"D6","v":2018}]
[]
[]
[null,null,null,"With Qualifiers",null,null,null,null,null,null,"Without Qualifiers"]
[null,"Time History",null,null,"Last Cycle Forcasts",null,null,null,null,"Time History",null,null,{"$f":"A4","v":"Provisional Year"},"Forecast Years"]
["IV. Data for Energy Balances Time History",2016,2017,2018,{"$f":"E13","v":"2020.LC"},"2030.LC","2040.LC","2050.LC",null,{"$f":"B11","v":2016},{"$f":"C11","v":2017},{"$f":"D11","v":2018},{"$f":"L11+1&\"P\"","v":"2019P"},{"$f":"B5","v":2020},{"$f":"C5","v":2030},{"$f":"D5","v":2040},{"$f":"E5","v":2050}]
["COUNTRY","Australia",null,null,null,null,null,null,null,{"$f":"IF(ISNUMBER(SEARCH(\"e\",B12)),LEFT(B12,LEN(B12)-1),B12)","v":"Australia"}]
[null,2016,2017,2018,"2020.LC","2030.LC","2040.LC","2050.LC",null,{"$f":"IF(ISNUMBER(SEARCH(\"e\",B13)),LEFT(B13,LEN(B13)-1),B13)","v":2016},{"$f":"IF(ISNUMBER(SEARCH(\"e\",C13)),LEFT(C13,LEN(C13)-1),C13)","v":2017},{"$f":"IF(ISNUMBER(SEARCH(\"e\",D13)),LEFT(D13,LEN(D13)-1),D13)","v":2018}]
["COAL.INDPROD      ",0,0,0,0,0,0,0,null,{"$f":"IF(ISNUMBER(SEARCH(\"e\",B14)),LEFT(B14,LEN(B14)-1),B14)","v":0},{"$f":"IF(ISNUMBER(SEARCH(\"e\",C14)),LEFT(C14,LEN(C14)-1),C14)","v":0},{"$f":"IF(ISNUMBER(SEARCH(\"e\",D14)),LEFT(D14,LEN(D14)-1),D14)","v":0}]
["COAL.IMPORTS      ",0,0,0,0,0,0,0,null,0,0,0]
["COAL.EXPORTS      ",0,0,0,0,0,0,0,null,0,0,0]
["COAL.MARBUNK      ",0,0,0,0,0,0,0,null,0,0,0]
["COAL.AVBUNK       ",0,0,0,0,0,0,0,null,{"$f":"IF(ISNUMBER(SEARCH(\"e\",B18)),LEFT(B18,LEN(B18)-1),B18)","v":0},{"$f":"IF(ISNUMBER(SEARCH(\"e\",C18)),LEFT(C18,LEN(C18)-1),C18)","v":0},{"$f":"IF(ISNUMBER(SEARCH(\"e\",D18)),LEFT(D18,LEN(D18)-1),D18)","v":0}]
["COAL.STOCKCHA     ",0,0,0,0,0,0,0,null,0,0,0]
["COAL.TPES         ",0,0,0,0,0,0,0,null,0,0,0]
["COAL.TRANENER     ",0,0,0,0,0,0,0,null,0,0,0]
["COAL.ELECHEAT     ",0,0,0,0,0,0,0,null,0,0,0]
["COAL.TRANOTH      ",0,0,0,0,0,0,0,null,0,0,0]
["COAL.OWNUSE       ",0,0,0,0,0,0,0,null,0,0,0]
["COAL.STATDIFF     ",0,0,0,0,0,0,0,null,0,0,0]
["COAL.TFC          ",0,0,0,0,0,0,0,null,0,0,0]
["COAL.TOTIND       ",0,0,0,0,0,0,0,null,0,0,0]
["COAL.TOTTRANS     ",0,0,0,0,0,0,0,null,0,0,0]
["COAL.ROAD         ",0,0,0,0,0,0,0,null,0,0,0]
["COAL.TOTOTHER     ",0,0,0,0,0,0,0,null,0,0,0]
["COAL.RESIDENT     ",0,0,0,0,0,0,0,null,0,0,0]
["COAL.NONENUSE     ",0,0,0,0,0,0,0,null,0,0,0]
["COAL.NECHEM       ",0,0,0,0,0,0,0,null,0,0,0]
["COAL.ELOUTPUT     ",0,0,0,0,0,0,0,null,0,0,0]
["COAL.HEATOUT      ",0,0,0,0,0,0,0,null,0,0,0]
["PEAT.INDPROD      ",0,0,0,0,0,0,0,null,0,0,0]
["PEAT.IMPORTS      ",0,0,0,0,0,0,0,null,0,0,0]
["PEAT.EXPORTS      ",0,0,0,0,0,0,0,null,0,0,0]
["PEAT.MARBUNK      ",0,0,0,0,0,0,0,null,0,0,0]
["PEAT.AVBUNK       ",0,0,0,0,0,0,0,null,{"$f":"IF(ISNUMBER(SEARCH(\"e\",B40)),LEFT(B40,LEN(B40)-1),B40)","v":0},{"$f":"IF(ISNUMBER(SEARCH(\"e\",C40)),LEFT(C40,LEN(C40)-1),C40)","v":0},{"$f":"IF(ISNUMBER(SEARCH(\"e\",D40)),LEFT(D40,LEN(D40)-1),D40)","v":0}]
["PEAT.STOCKCHA     ",0,0,0,0,0,0,0,null,0,0,0]
["PEAT.TPES         ",0,0,0,0,0,0,0,null,0,0,0]
["PEAT.TRANENER     ",0,0,0,0,0,0,0,null,0,0,0]
["PEAT.ELECHEAT     ",0,0,0,0,0,0,0,null,0,0,0]
["PEAT.TRANOTH      ",0,0,0,0,0,0,0,null,0,0,0]
["PEAT.OWNUSE       ",0,0,0,0,0,0,0,null,0,0,0]
["PEAT.STATDIFF     ",0,0,0,0,0,0,0,null,0,0,0]
["PEAT.TFC          ",0,0,0,0,0,0,0,null,0,0,0]
["PEAT.TOTIND       ",0,0,0,0,0,0,0,null,0,0,0]
["PEAT.TOTTRANS     ",0,0,0,0,0,0,0,null,0,0,0]
["PEAT.ROAD         ",0,0,0,0,0,0,0,null,0,0,0]
["PEAT.TOTOTHER     ",0,0,0,0,0,0,0,null,0,0,0]
["PEAT.RESIDENT     ",0,0,0,0,0,0,0,null,0,0,0]
["PEAT.NONENUSE     ",0,0,0,0,0,0,0,null,0,0,0]
["PEAT.NECHEM       ",0,0,0,0,0,0,0,null,0,0,0]
["PEAT.ELOUTPUT     ",0,0,0,0,0,0,0,null,0,0,0]
["PEAT.HEATOUT      ",0,0,0,0,0,0,0,null,0,0,0]
["OIL.INDPROD       ",0,0,0,0,0,0,0,null,0,0,0]
["OIL.IMPORTS       ",0,0,0,0,0,0,0,null,0,0,0]
["OIL.EXPORTS       ",0,0,0,0,0,0,0,null,0,0,0]
["OIL.MARBUNK       ",0,0,0,0,0,0,0,null,0,0,0]
["OIL.AVBUNK        ",0,0,0,0,0,0,0,null,{"$f":"IF(ISNUMBER(SEARCH(\"e\",B62)),LEFT(B62,LEN(B62)-1),B62)","v":0},{"$f":"IF(ISNUMBER(SEARCH(\"e\",C62)),LEFT(C62,LEN(C62)-1),C62)","v":0},{"$f":"IF(ISNUMBER(SEARCH(\"e\",D62)),LEFT(D62,LEN(D62)-1),D62)","v":0}]
["OIL.STOCKCHA      ",0,0,0,0,0,0,0,null,0,0,0]
["OIL.TPES          ",0,0,0,0,0,0,0,null,0,0,0]
["OIL.TRANENER      ",0,0,0,0,0,0,0,null,0,0,0]
["OIL.ELECHEAT      ",0,0,0,0,0,0,0,null,0,0,0]
["OIL.TRANOTH       ",0,0,0,0,0,0,0,null,0,0,0]
["OIL.OWNUSE        ",0,0,0,0,0,0,0,null,0,0,0]
["OIL.STATDIFF      ",0,0,0,0,0,0,0,null,0,0,0]
["OIL.TFC           ",0,0,0,0,0,0,0,null,0,0,0]
["OIL.TOTIND        ",0,0,0,0,0,0,0,null,0,0,0]
["OIL.TOTTRANS      ",0,0,0,0,0,0,0,null,0,0,0]
["OIL.ROAD          ",0,0,0,0,0,0,0,null,0,0,0]
["OIL.TOTOTHER      ",0,0,0,0,0,0,0,null,0,0,0]
["OIL.RESIDENT      ",0,0,0,0,0,0,0,null,0,0,0]
["OIL.NONENUSE      ",0,0,0,0,0,0,0,null,0,0,0]
["OIL.NECHEM        ",0,0,0,0,0,0,0,null,0,0,0]
["OIL.ELOUTPUT      ",0,0,0,0,0,0,0,null,0,0,0]
["OIL.HEATOUT       ",0,0,0,0,0,0,0,null,{"$f":"IF(ISNUMBER(SEARCH(\"e\",B79)),LEFT(B79,LEN(B79)-1),B79)","v":0},{"$f":"IF(ISNUMBER(SEARCH(\"e\",C79)),LEFT(C79,LEN(C79)-1),C79)","v":0},{"$f":"IF(ISNUMBER(SEARCH(\"e\",D79)),LEFT(D79,LEN(D79)-1),D79)","v":0}]
["NATGAS.INDPROD    ",0,0,0,0,0,0,0,null,0,0,0]
["NATGAS.IMPORTS    ",0,0,0,0,0,0,0,null,0,0,0]
["NATGAS.EXPORTS    ",0,0,0,0,0,0,0,null,0,0,0]
["NATGAS.MARBUNK    ",0,0,0,0,0,0,0,null,0,0,0]
["NATGAS.AVBUNK     ",0,0,0,0,0,0,0,null,{"$f":"IF(ISNUMBER(SEARCH(\"e\",B84)),LEFT(B84,LEN(B84)-1),B84)","v":0},{"$f":"IF(ISNUMBER(SEARCH(\"e\",C84)),LEFT(C84,LEN(C84)-1),C84)","v":0},{"$f":"IF(ISNUMBER(SEARCH(\"e\",D84)),LEFT(D84,LEN(D84)-1),D84)","v":0}]
["NATGAS.STOCKCHA   ",0,0,0,0,0,0,0,null,0,0,0]
["NATGAS.TPES       ",0,0,0,0,0,0,0,null,0,0,0]
["NATGAS.TRANENER   ",0,0,0,0,0,0,0,null,0,0,0]
["NATGAS.ELECHEAT   ",0,0,0,0,0,0,0,null,0,0,0]
["NATGAS.TRANOTH    ",0,0,0,0,0,0,0,null,0,0,0]
["NATGAS.OWNUSE     ",0,0,0,0,0,0,0,null,0,0,0]
["NATGAS.STATDIFF   ",0,0,0,0,0,0,0,null,0,0,0]
["NATGAS.TFC        ",0,0,0,0,0,0,0,null,0,0,0]
["NATGAS.TOTIND     ",0,0,0,0,0,0,0,null,0,0,0]
["NATGAS.TOTTRANS   ",0,0,0,0,0,0,0,null,0,0,0]
["NATGAS.ROAD       ",0,0,0,0,0,0,0,null,0,0,0]
["NATGAS.TOTOTHER   ",0,0,0,0,0,0,0,null,0,0,0]
["NATGAS.RESIDENT   ",0,0,0,0,0,0,0,null,0,0,0]
["NATGAS.NONENUSE   ",0,0,0,0,0,0,0,null,0,0,0]
["NATGAS.NECHEM     ",0,0,0,0,0,0,0,null,0,0,0]
["NATGAS.ELOUTPUT   ",0,0,0,0,0,0,0,null,0,0,0]
["NATGAS.HEATOUT    ",0,0,0,0,0,0,0,null,0,0,0]
["NUCLEAR.INDPROD   ",0,0,0,0,0,0,0,null,0,0,0]
["NUCLEAR.IMPORTS   ",0,0,0,0,0,0,0,null,0,0,0]
["NUCLEAR.EXPORTS   ",0,0,0,0,0,0,0,null,0,0,0]
["NUCLEAR.MARBUNK   ",0,0,0,0,0,0,0,null,0,0,0]
["NUCLEAR.AVBUNK    ",0,0,0,0,0,0,0,null,{"$f":"IF(ISNUMBER(SEARCH(\"e\",B106)),LEFT(B106,LEN(B106)-1),B106)","v":0},{"$f":"IF(ISNUMBER(SEARCH(\"e\",C106)),LEFT(C106,LEN(C106)-1),C106)","v":0},{"$f":"IF(ISNUMBER(SEARCH(\"e\",D106)),LEFT(D106,LEN(D106)-1),D106)","v":0}]
["NUCLEAR.STOCKCHA  ",0,0,0,0,0,0,0,null,0,0,0]
["NUCLEAR.TPES      ",0,0,0,0,0,0,0,null,0,0,0]
["NUCLEAR.TRANENER  ",0,0,0,0,0,0,0,null,0,0,0]
["NUCLEAR.ELECHEAT  ",0,0,0,0,0,0,0,null,0,0,0]
["NUCLEAR.TRANOTH   ",0,0,0,0,0,0,0,null,0,0,0]
["NUCLEAR.OWNUSE    ",0,0,0,0,0,0,0,null,0,0,0]
["NUCLEAR.STATDIFF  ",0,0,0,0,0,0,0,null,0,0,0]
["NUCLEAR.TFC       ",0,0,0,0,0,0,0,null,0,0,0]
["NUCLEAR.TOTIND    ",0,0,0,0,0,0,0,null,0,0,0]
["NUCLEAR.TOTTRANS  ",0,0,0,0,0,0,0,null,0,0,0]
["NUCLEAR.ROAD      ",0,0,0,0,0,0,0,null,0,0,0]
["NUCLEAR.TOTOTHER  ",0,0,0,0,0,0,0,null,0,0,0]
["NUCLEAR.RESIDENT  ",0,0,0,0,0,0,0,null,0,0,0]
["NUCLEAR.NONENUSE  ",0,0,0,0,0,0,0,null,0,0,0]
["NUCLEAR.NECHEM    ",0,0,0,0,0,0,0,null,0,0,0]
["NUCLEAR.ELOUTPUT  ",0,0,0,0,0,0,0,null,0,0,0]
["NUCLEAR.HEATOUT   ",0,0,0,0,0,0,0,null,0,0,0]
["HYDRO.INDPROD     ",0,0,0,0,0,0,0,null,0,0,0]
["HYDRO.IMPORTS     ",0,0,0,0,0,0,0,null,0,0,0]
["HYDRO.EXPORTS     ",0,0,0,0,0,0,0,null,0,0,0]
["HYDRO.MARBUNK     ",0,0,0,0,0,0,0,null,0,0,0]
["HYDRO.AVBUNK      ",0,0,0,0,0,0,0,null,{"$f":"IF(ISNUMBER(SEARCH(\"e\",B128)),LEFT(B128,LEN(B128)-1),B128)","v":0},{"$f":"IF(ISNUMBER(SEARCH(\"e\",C128)),LEFT(C128,LEN(C128)-1),C128)","v":0},{"$f":"IF(ISNUMBER(SEARCH(\"e\",D128)),LEFT(D128,LEN(D128)-1),D128)","v":0}]
["HYDRO.STOCKCHA    ",0,0,0,0,0,0,0,null,0,0,0]
["HYDRO.TPES        ",0,0,0,0,0,0,0,null,0,0,0]
["HYDRO.TRANENER    ",0,0,0,0,0,0,0,null,0,0,0]
["HYDRO.ELECHEAT    ",0,0,0,0,0,0,0,null,0,0,0]
["HYDRO.TRANOTH     ",0,0,0,0,0,0,0,null,0,0,0]
["HYDRO.OWNUSE      ",0,0,0,0,0,0,0,null,0,0,0]
["HYDRO.STATDIFF    ",0,0,0,0,0,0,0,null,0,0,0]
["HYDRO.TFC         ",0,0,0,0,0,0,0,null,0,0,0]
["HYDRO.TOTIND      ",0,0,0,0,0,0,0,null,0,0,0]
["HYDRO.TOTTRANS    ",0,0,0,0,0,0,0,null,0,0,0]
["HYDRO.ROAD        ",0,0,0,0,0,0,0,null,0,0,0]
["HYDRO.TOTOTHER    ",0,0,0,0,0,0,0,null,0,0,0]
["HYDRO.RESIDENT    ",0,0,0,0,0,0,0,null,0,0,0]
["HYDRO.NONENUSE    ",0,0,0,0,0,0,0,null,0,0,0]
["HYDRO.NECHEM      ",0,0,0,0,0,0,0,null,0,0,0]
["HYDRO.ELOUTPUT    ",0,0,0,0,0,0,0,null,0,0,0]
["HYDRO.HEATOUT     ",0,0,0,0,0,0,0,null,0,0,0]
["WIND.INDPROD      ",0,0,0,0,0,0,0,null,{"$f":"IF(ISNUMBER(SEARCH(\"e\",B146)),LEFT(B146,LEN(B146)-1),B146)","v":0},{"$f":"IF(ISNUMBER(SEARCH(\"e\",C146)),LEFT(C146,LEN(C146)-1),C146)","v":0},{"$f":"IF(ISNUMBER(SEARCH(\"e\",D146)),LEFT(D146,LEN(D146)-1),D146)","v":0}]
["WIND.IMPORTS      ",0,0,0,0,0,0,0,null,0,0,0]
["WIND.EXPORTS      ",0,0,0,0,0,0,0,null,0,0,0]
["WIND.MARBUNK      ",0,0,0,0,0,0,0,null,0,0,0]
["WIND.AVBUNK       ",0,0,0,0,0,0,0,null,{"$f":"IF(ISNUMBER(SEARCH(\"e\",B150)),LEFT(B150,LEN(B150)-1),B150)","v":0},{"$f":"IF(ISNUMBER(SEARCH(\"e\",C150)),LEFT(C150,LEN(C150)-1),C150)","v":0},{"$f":"IF(ISNUMBER(SEARCH(\"e\",D150)),LEFT(D150,LEN(D150)-1),D150)","v":0}]
["WIND.STOCKCHA     ",0,0,0,0,0,0,0,null,0,0,0]
["WIND.TPES         ",0,0,0,0,0,0,0,null,0,0,0]
["WIND.TRANENER     ",0,0,0,0,0,0,0,null,0,0,0]
["WIND.ELECHEAT     ",0,0,0,0,0,0,0,null,0,0,0]
["WIND.TRANOTH      ",0,0,0,0,0,0,0,null,0,0,0]
["WIND.OWNUSE       ",0,0,0,0,0,0,0,null,0,0,0]
["WIND.STATDIFF     ",0,0,0,0,0,0,0,null,0,0,0]
["WIND.TFC          ",0,0,0,0,0,0,0,null,0,0,0]
["WIND.TOTIND       ",0,0,0,0,0,0,0,null,0,0,0]
["WIND.TOTTRANS     ",0,0,0,0,0,0,0,null,0,0,0]
["WIND.ROAD         ",0,0,0,0,0,0,0,null,0,0,0]
["WIND.TOTOTHER     ",0,0,0,0,0,0,0,null,0,0,0]
["WIND.RESIDENT     ",0,0,0,0,0,0,0,null,0,0,0]
["WIND.NONENUSE     ",0,0,0,0,0,0,0,null,0,0,0]
["WIND.NECHEM       ",0,0,0,0,0,0,0,null,0,0,0]
["WIND.ELOUTPUT     ",0,0,0,0,0,0,0,null,0,0,0]
["WIND.HEATOUT      ",0,0,0,0,0,0,0,null,0,0,0]
["GEOTHERM.INDPROD  ",0,0,0,0,0,0,0,null,0,0,0]
["GEOTHERM.IMPORTS  ",0,0,0,0,0,0,0,null,0,0,0]
["GEOTHERM.EXPORTS  ",0,0,0,0,0,0,0,null,0,0,0]
["GEOTHERM.MARBUNK  ",0,0,0,0,0,0,0,null,0,0,0]
["GEOTHERM.AVBUNK   ",0,0,0,0,0,0,0,null,{"$f":"IF(ISNUMBER(SEARCH(\"e\",B172)),LEFT(B172,LEN(B172)-1),B172)","v":0},{"$f":"IF(ISNUMBER(SEARCH(\"e\",C172)),LEFT(C172,LEN(C172)-1),C172)","v":0},{"$f":"IF(ISNUMBER(SEARCH(\"e\",D172)),LEFT(D172,LEN(D172)-1),D172)","v":0}]
["GEOTHERM.STOCKCHA ",0,0,0,0,0,0,0,null,0,0,0]
["GEOTHERM.TPES     ",0,0,0,0,0,0,0,null,0,0,0]
["GEOTHERM.TRANENER ",0,0,0,0,0,0,0,null,0,0,0]
["GEOTHERM.ELECHEAT ",0,0,0,0,0,0,0,null,0,0,0]
["GEOTHERM.TRANOTH  ",0,0,0,0,0,0,0,null,0,0,0]
["GEOTHERM.OWNUSE   ",0,0,0,0,0,0,0,null,0,0,0]
["GEOTHERM.STATDIFF ",0,0,0,0,0,0,0,null,0,0,0]
["GEOTHERM.TFC      ",0,0,0,0,0,0,0,null,0,0,0]
["GEOTHERM.TOTIND   ",0,0,0,0,0,0,0,null,0,0,0]
["GEOTHERM.TOTTRANS ",0,0,0,0,0,0,0,null,0,0,0]
["GEOTHERM.ROAD     ",0,0,0,0,0,0,0,null,0,0,0]
["GEOTHERM.TOTOTHER ",0,0,0,0,0,0,0,null,0,0,0]
["GEOTHERM.RESIDENT ",0,0,0,0,0,0,0,null,0,0,0]
["GEOTHERM.NONENUSE ",0,0,0,0,0,0,0,null,0,0,0]
["GEOTHERM.NECHEM   ",0,0,0,0,0,0,0,null,0,0,0]
["GEOTHERM.ELOUTPUT ",0,0,0,0,0,0,0,null,0,0,0]
["GEOTHERM.HEATOUT  ",0,0,0,0,0,0,0,null,0,0,0]
["SOLAR.INDPROD     ",0,0,0,0,0,0,0,null,0,0,0]
["SOLAR.IMPORTS     ",0,0,0,0,0,0,0,null,0,0,0]
["SOLAR.EXPORTS     ",0,0,0,0,0,0,0,null,0,0,0]
["SOLAR.MARBUNK     ",0,0,0,0,0,0,0,null,0,0,0]
["SOLAR.AVBUNK      ",0,0,0,0,0,0,0,null,{"$f":"IF(ISNUMBER(SEARCH(\"e\",B194)),LEFT(B194,LEN(B194)-1),B194)","v":0},{"$f":"IF(ISNUMBER(SEARCH(\"e\",C194)),LEFT(C194,LEN(C194)-1),C194)","v":0},{"$f":"IF(ISNUMBER(SEARCH(\"e\",D194)),LEFT(D194,LEN(D194)-1),D194)","v":0}]
["SOLAR.STOCKCHA    ",0,0,0,0,0,0,0,null,0,0,0]
["SOLAR.TPES        ",0,0,0,0,0,0,0,null,0,0,0]
["SOLAR.TRANENER    ",0,0,0,0,0,0,0,null,0,0,0]
["SOLAR.ELECHEAT    ",0,0,0,0,0,0,0,null,0,0,0]
["SOLAR.TRANOTH     ",0,0,0,0,0,0,0,null,0,0,0]
["SOLAR.OWNUSE      ",0,0,0,0,0,0,0,null,0,0,0]
["SOLAR.STATDIFF    ",0,0,0,0,0,0,0,null,0,0,0]
["SOLAR.TFC         ",0,0,0,0,0,0,0,null,0,0,0]
["SOLAR.TOTIND      ",0,0,0,0,0,0,0,null,0,0,0]
["SOLAR.TOTTRANS    ",0,0,0,0,0,0,0,null,0,0,0]
["SOLAR.ROAD        ",0,0,0,0,0,0,0,null,0,0,0]
["SOLAR.TOTOTHER    ",0,0,0,0,0,0,0,null,0,0,0]
["SOLAR.RESIDENT    ",0,0,0,0,0,0,0,null,0,0,0]
["SOLAR.NONENUSE    ",0,0,0,0,0,0,0,null,0,0,0]
["SOLAR.NECHEM      ",0,0,0,0,0,0,0,null,0,0,0]
["SOLAR.ELOUTPUT    ",0,0,0,0,0,0,0,null,0,0,0]
["SOLAR.HEATOUT     ",0,0,0,0,0,0,0,null,0,0,0]
["TIDEOTHER.INDPROD ",0,0,0,0,0,0,0,null,0,0,0]
["TIDEOTHER.IMPORTS ",0,0,0,0,0,0,0,null,{"$f":"IF(ISNUMBER(SEARCH(\"e\",B213)),LEFT(B213,LEN(B213)-1),B213)","v":0},{"$f":"IF(ISNUMBER(SEARCH(\"e\",C213)),LEFT(C213,LEN(C213)-1),C213)","v":0},{"$f":"IF(ISNUMBER(SEARCH(\"e\",D213)),LEFT(D213,LEN(D213)-1),D213)","v":0}]
["TIDEOTHER.EXPORTS ",0,0,0,0,0,0,0,null,0,0,0]
["TIDEOTHER.MARBUNK ",0,0,0,0,0,0,0,null,0,0,0]
["TIDEOTHER.AVBUNK  ",0,0,0,0,0,0,0,null,{"$f":"IF(ISNUMBER(SEARCH(\"e\",B216)),LEFT(B216,LEN(B216)-1),B216)","v":0},{"$f":"IF(ISNUMBER(SEARCH(\"e\",C216)),LEFT(C216,LEN(C216)-1),C216)","v":0},{"$f":"IF(ISNUMBER(SEARCH(\"e\",D216)),LEFT(D216,LEN(D216)-1),D216)","v":0}]
["TIDEOTHER.STOCKCHA",0,0,0,0,0,0,0,null,0,0,0]
["TIDEOTHER.TPES    ",0,0,0,0,0,0,0,null,0,0,0]
["TIDEOTHER.TRANENER",0,0,0,0,0,0,0,null,0,0,0]
["TIDEOTHER.ELECHEAT",0,0,0,0,0,0,0,null,0,0,0]
["TIDEOTHER.TRANOTH ",0,0,0,0,0,0,0,null,0,0,0]
["TIDEOTHER.OWNUSE  ",0,0,0,0,0,0,0,null,0,0,0]
["TIDEOTHER.STATDIFF",0,0,0,0,0,0,0,null,0,0,0]
["TIDEOTHER.TFC     ",0,0,0,0,0,0,0,null,0,0,0]
["TIDEOTHER.TOTIND  ",0,0,0,0,0,0,0,null,0,0,0]
["TIDEOTHER.TOTTRANS",0,0,0,0,0,0,0,null,0,0,0]
["TIDEOTHER.ROAD    ",0,0,0,0,0,0,0,null,0,0,0]
["TIDEOTHER.TOTOTHER",0,0,0,0,0,0,0,null,0,0,0]
["TIDEOTHER.RESIDENT",0,0,0,0,0,0,0,null,0,0,0]
["TIDEOTHER.NONENUSE",0,0,0,0,0,0,0,null,0,0,0]
["TIDEOTHER.NECHEM  ",0,0,0,0,0,0,0,null,0,0,0]
["TIDEOTHER.ELOUTPUT",0,0,0,0,0,0,0,null,0,0,0]
["TIDEOTHER.HEATOUT ",0,0,0,0,0,0,0,null,0,0,0]
["COMRENEW.INDPROD  ",0,0,0,0,0,0,0,null,0,0,0]
["COMRENEW.IMPORTS  ",0,0,0,0,0,0,0,null,0,0,0]
["COMRENEW.EXPORTS  ",0,0,0,0,0,0,0,null,0,0,0]
["COMRENEW.MARBUNK  ",0,0,0,0,0,0,0,null,0,0,0]
["COMRENEW.AVBUNK   ",0,0,0,0,0,0,0,null,{"$f":"IF(ISNUMBER(SEARCH(\"e\",B238)),LEFT(B238,LEN(B238)-1),B238)","v":0},{"$f":"IF(ISNUMBER(SEARCH(\"e\",C238)),LEFT(C238,LEN(C238)-1),C238)","v":0},{"$f":"IF(ISNUMBER(SEARCH(\"e\",D238)),LEFT(D238,LEN(D238)-1),D238)","v":0}]
["COMRENEW.STOCKCHA ",0,0,0,0,0,0,0,null,0,0,0]
["COMRENEW.TPES     ",0,0,0,0,0,0,0,null,{"$f":"IF(ISNUMBER(SEARCH(\"e\",B240)),LEFT(B240,LEN(B240)-1),B240)","v":0},0,0]
["COMRENEW.TRANENER ",0,0,0,0,0,0,0,null,0,0,0]
["COMRENEW.ELECHEAT ",0,0,0,0,0,0,0,null,0,0,0]
["COMRENEW.TRANOTH  ",0,0,0,0,0,0,0,null,0,0,0]
["COMRENEW.OWNUSE   ",0,0,0,0,0,0,0,null,0,0,0]
["COMRENEW.STATDIFF ",0,0,0,0,0,0,0,null,0,0,0]
["COMRENEW.TFC      ",0,0,0,0,0,0,0,null,0,0,0]
["COMRENEW.TOTIND   ",0,0,0,0,0,0,0,null,0,0,0]
["COMRENEW.TOTTRANS ",0,0,0,0,0,0,0,null,0,0,0]
["COMRENEW.ROAD     ",0,0,0,0,0,0,0,null,0,0,0]
["COMRENEW.TOTOTHER ",0,0,0,0,0,0,0,null,0,0,0]
["COMRENEW.RESIDENT ",0,0,0,0,0,0,0,null,0,0,0]
["COMRENEW.NONENUSE ",0,0,0,0,0,0,0,null,0,0,0]
["COMRENEW.NECHEM   ",0,0,0,0,0,0,0,null,0,0,0]
["COMRENEW.ELOUTPUT ",0,0,0,0,0,0,0,null,0,0,0]
["COMRENEW.HEATOUT  ",0,0,0,0,0,0,0,null,0,0,0]
["ELECTR.INDPROD    ",0,0,0,0,0,0,0,null,0,0,0]
["ELECTR.IMPORTS    ",0,0,0,0,0,0,0,null,0,0,0]
["ELECTR.EXPORTS    ",0,0,0,0,0,0,0,null,0,0,0]
["ELECTR.MARBUNK    ",0,0,0,0,0,0,0,null,0,0,0]
["ELECTR.AVBUNK     ",0,0,0,0,0,0,0,null,{"$f":"IF(ISNUMBER(SEARCH(\"e\",B260)),LEFT(B260,LEN(B260)-1),B260)","v":0},{"$f":"IF(ISNUMBER(SEARCH(\"e\",C260)),LEFT(C260,LEN(C260)-1),C260)","v":0},{"$f":"IF(ISNUMBER(SEARCH(\"e\",D260)),LEFT(D260,LEN(D260)-1),D260)","v":0}]
["ELECTR.STOCKCHA   ",0,0,0,0,0,0,0,null,0,0,0]
["ELECTR.TPES       ",0,0,0,0,0,0,0,null,0,0,0]
["ELECTR.TRANENER   ",0,0,0,0,0,0,0,null,0,0,0]
["ELECTR.ELECHEAT   ",0,0,0,0,0,0,0,null,0,0,0]
["ELECTR.TRANOTH    ",0,0,0,0,0,0,0,null,0,0,0]
["ELECTR.OWNUSE     ",0,0,0,0,0,0,0,null,0,0,0]
["ELECTR.STATDIFF   ",0,0,0,0,0,0,0,null,0,0,0]
["ELECTR.TFC        ",0,0,0,0,0,0,0,null,0,0,0]
["ELECTR.TOTIND     ",0,0,0,0,0,0,0,null,0,0,0]
["ELECTR.TOTTRANS   ",0,0,0,0,0,0,0,null,0,0,0]
["ELECTR.ROAD       ",0,0,0,0,0,0,0,null,0,0,0]
["ELECTR.TOTOTHER   ",0,0,0,0,0,0,0,null,0,0,0]
["ELECTR.RESIDENT   ",0,0,0,0,0,0,0,null,0,0,0]
["ELECTR.NONENUSE   ",0,0,0,0,0,0,0,null,0,0,0]
["ELECTR.NECHEM     ",0,0,0,0,0,0,0,null,0,0,0]
["ELECTR.ELOUTPUT   ",0,0,0,0,0,0,0,null,0,0,0]
["ELECTR.HEATOUT    ",0,0,0,0,0,0,0,null,{"$f":"IF(ISNUMBER(SEARCH(\"e\",B277)),LEFT(B277,LEN(B277)-1),B277)","v":0},{"$f":"IF(ISNUMBER(SEARCH(\"e\",C277)),LEFT(C277,LEN(C277)-1),C277)","v":0},{"$f":"IF(ISNUMBER(SEARCH(\"e\",D277)),LEFT(D277,LEN(D277)-1),D277)","v":0}]
["HEAT.INDPROD      ",0,0,0,0,0,0,0,null,0,0,0]
["HEAT.IMPORTS      ",0,0,0,0,0,0,0,null,0,0,0]
["HEAT.EXPORTS      ",0,0,0,0,0,0,0,null,0,0,0]
["HEAT.MARBUNK      ",0,0,0,0,0,0,0,null,0,0,0]
["HEAT.AVBUNK       ",0,0,0,0,0,0,0,null,{"$f":"IF(ISNUMBER(SEARCH(\"e\",B282)),LEFT(B282,LEN(B282)-1),B282)","v":0},{"$f":"IF(ISNUMBER(SEARCH(\"e\",C282)),LEFT(C282,LEN(C282)-1),C282)","v":0},{"$f":"IF(ISNUMBER(SEARCH(\"e\",D282)),LEFT(D282,LEN(D282)-1),D282)","v":0}]
["HEAT.STOCKCHA     ",0,0,0,0,0,0,0,null,{"$f":"IF(ISNUMBER(SEARCH(\"e\",B283)),LEFT(B283,LEN(B283)-1),B283)","v":0},{"$f":"IF(ISNUMBER(SEARCH(\"e\",C283)),LEFT(C283,LEN(C283)-1),C283)","v":0},{"$f":"IF(ISNUMBER(SEARCH(\"e\",D283)),LEFT(D283,LEN(D283)-1),D283)","v":0}]
["HEAT.TPES         ",0,0,0,0,0,0,0,null,0,0,0]
["HEAT.TRANENER     ",0,0,0,0,0,0,0,null,0,0,0]
["HEAT.ELECHEAT     ",0,0,0,0,0,0,0,null,0,0,0]
["HEAT.TRANOTH      ",0,0,0,0,0,0,0,null,0,0,0]
["HEAT.OWNUSE       ",0,0,0,0,0,0,0,null,0,0,0]
["HEAT.STATDIFF     ",0,0,0,0,0,0,0,null,0,0,0]
["HEAT.TFC          ",0,0,0,0,0,0,0,null,0,0,0]
["HEAT.TOTIND       ",0,0,0,0,0,0,0,null,0,0,0]
["HEAT.TOTTRANS     ",0,0,0,0,0,0,0,null,0,0,0]
["HEAT.ROAD         ",0,0,0,0,0,0,0,null,0,0,0]
["HEAT.TOTOTHER     ",0,0,0,0,0,0,0,null,0,0,0]
["HEAT.RESIDENT     ",0,0,0,0,0,0,0,null,0,0,0]
["HEAT.NONENUSE     ",0,0,0,0,0,0,0,null,0,0,0]
["HEAT.NECHEM       ",0,0,0,0,0,0,0,null,0,0,0]
["HEAT.ELOUTPUT     ",0,0,0,0,0,0,0,null,0,0,0]
["HEAT.HEATOUT      ",0,0,0,0,0,0,0,null,{"$f":"IF(ISNUMBER(SEARCH(\"e\",B299)),LEFT(B299,LEN(B299)-1),B299)","v":0},{"$f":"IF(ISNUMBER(SEARCH(\"e\",C299)),LEFT(C299,LEN(C299)-1),C299)","v":0},{"$f":"IF(ISNUMBER(SEARCH(\"e\",D299)),LEFT(D299,LEN(D299)-1),D299)","v":0}]
["TOTAL.INDPROD     ",0,0,0,0,0,0,0,null,0,0,0]
["TOTAL.IMPORTS     ",0,0,0,0,0,0,0,null,0,0,0]
["TOTAL.EXPORTS     ",0,0,0,0,0,0,0,null,0,0,0]
["TOTAL.MARBUNK     ",0,0,0,0,0,0,0,null,0,0,0]
["TOTAL.AVBUNK      ",0,0,0,0,0,0,0,null,{"$f":"IF(ISNUMBER(SEARCH(\"e\",B304)),LEFT(B304,LEN(B304)-1),B304)","v":0},{"$f":"IF(ISNUMBER(SEARCH(\"e\",C304)),LEFT(C304,LEN(C304)-1),C304)","v":0},{"$f":"IF(ISNUMBER(SEARCH(\"e\",D304)),LEFT(D304,LEN(D304)-1),D304)","v":0}]
["TOTAL.STOCKCHA    ",0,0,0,0,0,0,0,null,{"$f":"IF(ISNUMBER(SEARCH(\"e\",B305)),LEFT(B305,LEN(B305)-1),B305)","v":0},{"$f":"IF(ISNUMBER(SEARCH(\"e\",C305)),LEFT(C305,LEN(C305)-1),C305)","v":0},{"$f":"IF(ISNUMBER(SEARCH(\"e\",D305)),LEFT(D305,LEN(D305)-1),D305)","v":0}]
["TOTAL.TPES        ",0,0,0,0,0,0,0,null,0,0,0]
["TOTAL.TRANENER    ",0,0,0,0,0,0,0,null,0,0,0]
["TOTAL.ELECHEAT    ",0,0,0,0,0,0,0,null,0,0,0]
["TOTAL.TRANOTH     ",0,0,0,0,0,0,0,null,0,0,0]
["TOTAL.OWNUSE      ",0,0,0,0,0,0,0,null,0,0,0]
["TOTAL.STATDIFF    ",0,0,0,0,0,0,0,null,0,0,0]
["TOTAL.TFC         ",0,0,0,0,0,0,0,null,0,0,0]
["TOTAL.TOTIND      ",0,0,0,0,0,0,0,null,0,0,0]
["TOTAL.TOTTRANS    ",0,0,0,0,0,0,0,null,0,0,0]
["TOTAL.ROAD        ",0,0,0,0,0,0,0,null,0,0,0]
["TOTAL.TOTOTHER    ",0,0,0,0,0,0,0,null,0,0,0]
["TOTAL.RESIDENT    ",0,0,0,0,0,0,0,null,0,0,0]
["TOTAL.NONENUSE    ",0,0,0,0,0,0,0,null,0,0,0]
["TOTAL.NECHEM      ",0,0,0,0,0,0,0,null,0,0,0]
["TOTAL.ELOUTPUT    ",0,0,0,0,0,0,0,null,0,0,0]
["TOTAL.HEATOUT     ",0,0,0,0,0,0,0,null,0,0,0]

{"sheet":"Efficiencies","index":14,"n_rows":13,"n_cols":4,"rows_kept":13,"cut":false,"hidden":true,"merged":[]}
["Range of Efficiencies for Plants",null,null,"used in the Energy Balance Time Series sheet for checking"]
[]
[null,"min","max"]
["Coal/Oil shale",15,50]
["Peat",15,50]
["Oil",15,50]
["Gas",20,80]
["Nuclear",25,40]
["Hydro",95,105]
["Wind",95,105]
["Geothermal",5,20]
["Solar Etc",95,105]
["Combrenew",15,50]