{"text_format":"1","workbook":"xlsx","n_sheets":10,"sheets":["Instructions","JODI_Oil","MOS_Table_1","MOS_Table_2","MOS_Table_5","Definitions - short","Product Definitions Long","Flows Definitions Long","Param","Formulas"],"not_rendered":{"charts":0,"images":2,"macros":1,"external_links":0,"defined_names":112,"comments":5,"pivot_tables":0},"unopened":[],"bounds":{"document_bytes":16777216,"sheet_cells":100000,"rows_first":2000,"rows_last":500,"rows_between":2000,"halvings":0,"cell_chars":16384,"cell_head_chars":4096},"cells_cut":0,"cells_raw":0,"read":"whole","date_system":"1900"}

{"sheet":"Instructions","index":0,"n_rows":24,"n_cols":10,"rows_kept":24,"cut":false,"hidden":false,"merged":[]}
[]
[]
[]
[]
[null,"Joint Organisations Data Initiative"]
[null,"JODI OIL QUESTIONNAIRE"]
[]
[null,"INSTRUCTIONS"]
[]
[]
{"$rows_left_out":15}
{"sheet":"JODI_Oil","index":1,"n_rows":130,"n_cols":74,"rows_kept":130,"cut":false,"hidden":false,"merged":[[6,3,6,4],[4,3,4,5]]}
[2010.3]
[null,null,"Joint Organisations Data Initiative - Oil"]
[null,null,"Monthly Questionnaire"]
[]
[null,null,"Country ","(select country)"]
[]
[null,null,"Month","January",null,2021,null,{"$f":"IF(DataFromMOS=TRUE,\"Data is calculated from MOS tables\",\"Data is filled out in Maxi-JODI format\")","v":"Data is calculated from MOS tables"},null,null,null,null,null,null,null,null,null,{"$f":"IF(CountryUser=\"United States (Barrels)\",\"Unit: Thousand barrels\",\"Unit: Thousand metric tons\")","v":"Unit: Thousand metric tons"}]
[]
[null,null,null,null,null,null,null,null,null,"Petroleum Products",null,null,null,null,null,null,null,null,null,null,null,null,null,null,null,null,null,null,null,null,null,null,null,null,null,null,null,null,null,null,null,null,null,null,null,null,"Petroleum Products",null,null,null,null,null,null,null,null,null,null,null,null,null,null,null,null,null,null,"Petroleum Products"]
[null,null,null,"Crude oil","NGL","Other","Total\n(1)+(2)+(3)",null,null,"LPG","Naphtha","Gasoline","Total kerosene","Of which: Jet\nkerosene","Gas/ diesel oil","Fuel oil","Other\nproducts","Total products (5)+(6) +(7) +(8) +(10) +(11) +(12)",null,"Checks",null,null,null,null,null,null,null,null,null,null,null,null,null,null,null,null,null,null,null,null,"Crude Oil","NGL","Other","Total\n(1)+(2)+(3)",null,null,"LPG","Naphtha","Gasoline","Total Kerosene","Of which: Jet\nKerosene","Gas/ Diesel Oil","Fuel Oil","Other\nProducts","Total Products (5)+(6) +(7) +(8) +(10) +(11) +(12)",null,null,null,null,"Crude Oil","NGL","Other","Total\n(1)+(2)+(3)",null,null,"LPG","Naphtha","Gasoline","Total Kerosene","Of which: Jet\nKerosene","Gas/ Diesel Oil","Fuel Oil","Other\nProducts","Total Products (5)+(6) +(7) +(8) +(10) +(11) +(12)"]
{"$rows_left_out":121}
{"sheet":"MOS_Table_1","index":2,"n_rows":130,"n_cols":35,"rows_kept":130,"cut":false,"hidden":false,"merged":[[10,11,11,11],[10,9,11,9],[1,3,1,4],[10,3,11,3],[10,4,11,4],[10,5,11,5],[10,6,11,6],[10,8,11,8]]}
["MONTHLY OIL QUESTIONNAIRE",null,null,null,null,null,null,null,null,null,null,null,null,null,null,null,null,null,null,null,null,null,null,null,null,null,null,null,null,null,null,null,null,null,"Final"]
[2010,"Country",null,{"$f":"CountryUser","v":"(select country)"},null,null,null,null,null,null,null,null,"Provisional"]
[null,"Month of data",null,{"$f":"FirstMonth & \" \" & QuestYear","v":"January 2021"},null,null,null,"ALL DATA SHOULD BE ENTERED"]
[null,"Status of data (final/provisional)",null,null,null,null,null,"IN THOUSAND METRIC TONS"]
[null,"Prepared by",null,null,null,null,null,"WITH NO DECIMAL PLACE"]
[null,"Date of transmisssion"]
[]
["Table 1: SUPPLY OF CRUDE OIL, NGL, REFINERY FEEDSTOCKS, ADDITIVES AND OTHER HYDROCARBONS"]
[]
[null,null,null,null,null,null,null,null,null,{"$f":"IF(CountryUser=\"United States (Barrels)\",\"Unit: Thousand barrels\",\"Unit: Thousand metric tons\")","v":"Unit: Thousand metric tons"}]
{"$rows_left_out":121}
{"sheet":"MOS_Table_2","index":3,"n_rows":130,"n_cols":45,"rows_kept":130,"cut":false,"hidden":false,"merged":[[4,23,5,23],[4,26,5,26],[4,27,5,27],[4,28,5,28],[4,30,5,30],[4,20,5,20],[4,3,5,3],[4,4,5,4],[4,5,5,5],[4,6,5,6],[4,7,5,7],[4,8,5,8],[4,9,5,9],[4,12,5,12],[4,13,5,13],[4,14,5,14],[4,17,5,17]]}
["MONTHLY OIL QUESTIONNAIRE"]
[null,{"$f":"IF(MOS_Table_1!D2=0,\"\",MOS_Table_1!D2)","v":"(select country)"}]
[null,{"$f":"IF(MOS_Table_1!D3=0,\"\",MOS_Table_1!D3)","v":"January 2021"}]
["Table 2: SUPPLY OF FINISHED PRODUCTS",null,null,null,null,null,null,null,null,null,null,null,null,null,null,null,null,null,null,null,null,null,null,null,null,null,null,null,{"$f":"IF(CountryUser=\"United States (Barrels)\",\"Unit: Thousand barrels\",\"Unit: Thousand metric tons\")","v":"Unit: Thousand metric tons"}]
[null,null,null,"Crude\noil","Natural\ngas\nliquids","Refinery\ngas","Ethane","LPG","Naphtha","Total motor\ngasoline",null,null,"Aviation\ngasoline","Gasoline\ntype\njet fuel","Total\nkerosene\ntype\njet fuel",null,null,"Other\nkerosene",null,null,"Total\ngas/diesel\noil",null,null,"Total \nfuel oil",null,null,"Petroleum coke","Other products","Total products",null,"Probate"]
[null,null,null,null,null,null,null,null,null,null,"Biogasoline","Non-biogasoline",null,null,null,"Bio jet\nkerosene","Non-bio jet\nkerosene",null,"Road diesel","Heating and\nother gas oil",null,"Biodiesels","Non-bio\ngas/diesel\noil",null,"Fuel oil-\nlow sulphur \n(<1%)","Fuel oil-\nhigh sulphur\n (>=1%)"]
[null,null,null,"A","B","C","D","E","F","G","H","I","J","K","L","M","N","O","P","Q","R","S","T","U","V","W","X","Y","Z",null,"AA",null,null,null,null,null,null,null,null,null,null,null,null,null,"Item1 ê"]
["+","Primary product receipts1",1,null,null,null,null,null,null,null,null,null,null,null,null,null,null,null,null,null,null,null,null,null,null,null,null,null,{"$f":"SUM(D8:J8,M8:O8,R8,U8,X8,AA8:AB8)","v":0},null,{"$f":"IF(AC8-SUM(D8:J8,M8:O8,R8,U8,X8,AA8:AB8)=0,\"\",\"Total products is not equal to the sum of products\")","v":""},null,null,null,null,null,null,null,null,null,null,null,null,null,"PPRECPTS"]
["+","Refinery gross output",2,null,null,null,null,null,null,null,null,null,null,null,null,null,null,null,null,null,null,null,null,null,null,null,null,null,{"$f":"SUM(F9:J9,M9:O9,R9,U9,X9,AA9:AB9)","v":0},null,{"$f":"IF(AC9-SUM(F9:J9,M9:O9,R9,U9,X9,AA9:AB9)=0,\"\",\"Total products is not equal to the sum of products\")","v":""},null,null,null,null,null,null,null,null,null,null,null,null,null,"REFGROUT"]
["+","Recycled products",3,null,null,null,null,null,null,null,null,null,null,null,null,null,null,null,null,null,null,null,null,null,null,null,null,null,{"$f":"SUM(F10:J10,M10:O10,R10,U10,X10,AA10:AB10)","v":0},null,{"$f":"IF(AC10-SUM(F10:J10,M10:O10,R10,U10,X10,AA10:AB10)=0,\"\",\"Total products is not equal to the sum of products\")","v":""},null,null,null,null,null,null,null,null,null,null,null,null,null,"RECYCLED"]
{"$rows_left_out":121}
{"sheet":"MOS_Table_5","index":4,"n_rows":130,"n_cols":45,"rows_kept":130,"cut":false,"hidden":false,"merged":[[4,32,5,32],[4,33,5,33],[4,35,5,35],[4,18,5,18],[4,21,5,21],[4,24,5,24],[4,27,5,27],[4,30,5,30],[4,31,5,31],[4,17,5,17],[4,3,5,3],[4,4,5,4],[4,5,5,5],[4,6,5,6],[4,8,5,8],[4,9,5,9],[4,10,5,10],[4,11,5,11],[4,12,5,12],[4,13,5,13],[4,16,5,16]]}
["MONTHLY OIL QUESTIONNAIRE"]
[{"$f":"IF(MOS_Table_1!D2=0,\"\",MOS_Table_1!D2)","v":"(select country)"}]
[{"$f":"IF(MOS_Table_1!D3=0,\"\",MOS_Table_1!D3)","v":"January 2021"},null,null,null,null,null,null,null,null,null,null,null,null,null,null,null,null,null,null,null,null,null,null,null,null,null,null,null,null,null,null,null,null,null,null,null,null,null,null,null,null,null,null,null,"Datatype"]
["Table 5: STOCK LEVELS",null,null,null,"All opening stock levels should be equal to closing stock levels of the previous month",null,null,null,null,null,null,null,null,null,null,null,null,null,null,null,null,null,null,null,null,null,null,null,null,null,null,null,null,{"$f":"IF(CountryUser=\"United States (Barrels)\",\"Unit: Thousand barrels\",\"Unit: Thousand metric tons\")","v":"Unit: Thousand metric tons"},null,null,null,null,null,null,null,null,null,null,"BALANCE"]
[null,null,null,"Crude\noil","Natural\ngas\nliquids","Refinery\nfeedstocks","Additives /\noxygenates",null,"Other\nhydro-carbons","Total\n(A to F, excl. E)","Ethane","LPG","Naphtha","Total motor\ngasoline",null,null,"Aviation\ngasoline","Gasoline\ntype\njet fuel","Total\nkerosene\ntype\njet fuel",null,null,"Other\nkerosene",null,null,"Total\ngas/diesel\noil",null,null,"Total \nfuel oil",null,null,"Petroleum coke","Other products","Total products","Total\noil",null,"Probate"]
[null,null,null,null,null,null,null,"Of which\nBiofuels",null,null,null,null,null,null,"Biogasoline","Non-biogasoline",null,null,null,"Bio jet\nkerosene","Non-bio jet\nkerosene",null,"Road diesel","Heating and\nother gas oil",null,"Biodiesels","Non-bio\ngas/diesel\noil",null,"Fuel oil-\nlow sulphur \n(<1%)","Fuel oil-\nhigh sulphur\n (>=1%)"]
[null,null,null,"A","B","C","D","E","F","G","H","I","J","K","L","M","N","O","P","Q","R","S","T","U","V","W","X","Y","Z","AA","AB","AC","AD","AE",null,"AF",null,null,null,null,null,null,null,null,"Item1 ê"]
["(a) All stocks on","Opening",1,{"$f":"D10+D12+D14+D16+D18+D20+D22+D24","v":0},{"$f":"E10+E12+E14+E16+E18+E20+E22+E24","v":0},0,{"$f":"G10+G12+G14+G16+G18+G20+G22+G24","v":0},{"$f":"H10+H12+H14+H16+H18+H20+H22+H24","v":0},0,{"$f":"J10+J12+J14+J16+J18+J20+J22+J24","v":0},0,{"$f":"L10+L12+L14+L16+L18+L20+L22+L24","v":0},{"$f":"M10+M12+M14+M16+M18+M20+M22+M24","v":0},0,0,0,0,0,0,0,0,0,0,0,0,0,0,0,0,0,0,0,{"$f":"SUM(K8:N8,Q8:S8,V8,Y8,AB8,AE8:AF8)","v":0},{"$f":"SUM(J8,AG8)","v":0},0," ",null,null,null,null,null,null,null,null,"OSNATTER"]
["national territory (b+c+d+e+f+g+h+i) 1","Closing",2,{"$f":"D11+D13+D15+D17+D19+D21+D23+D25","v":0},0,0,{"$f":"G11+G13+G15+G17+G19+G21+G23+G25","v":0},{"$f":"H11+H13+H15+H17+H19+H21+H23+H25","v":0},0,0,0,{"$f":"L11+L13+L15+L17+L19+L21+L23+L25","v":0},0,0,0,0,0,0,0,0,0,0,0,0,0,0,0,0,0,0,0,0,{"$f":"SUM(K9:N9,Q9:S9,V9,Y9,AB9,AE9:AF9)","v":0},{"$f":"SUM(J9,AG9)","v":0},0," ",null,null,null,null,null,null,null,null,"CSNATTER"]
["(b) Stocks held for other countries","Opening",3,null,null,null,null,null,null,{"$f":"SUM(D10:G10,I10)","v":0},null,null,null,null,null,null,null,null,null,null,null,null,null,null,null,null,null,null,null,null,null,null,0,0,0," ",null,null,null,null,null,null,null,null,"OSOTHBIL"]
{"$rows_left_out":121}
{"sheet":"Definitions - short","index":5,"n_rows":33,"n_cols":3,"rows_kept":33,"cut":false,"hidden":false,"merged":[]}
[]
[null,{"$f":"JODI_Oil!C2&\" - Definitions\"","v":"Joint Organisations Data Initiative - Oil - Definitions"}]
[]
[null,"PRODUCTS"]
[null," 1. Crude oil ",": Including lease condensate  – excluding  NGL.\n"]
[null," 2. NGL",": Liquid or liquefied hydrocarbons recovered from gas separation plants and gas processing facilities."]
[null," 3. Other",": Refinery feedstocks +  Additives/oxygenates + Other hydrocarbons.\n"]
[null," 4. Total",": Sum of categories (1) to (3).\n  Total = Crude Oil + NGL + Other\n"]
[null," 5. LPG",": Comprises propane and butane .\n"]
[null," 6. Naphtha",": Comprises Naphtha used as feedstocks for producing high octane gasoline and also as feedstock for the chemical/petrochemical industries."]
{"$rows_left_out":24}
{"sheet":"Product Definitions Long","index":6,"n_rows":72,"n_cols":3,"rows_kept":72,"cut":false,"hidden":false,"merged":[]}
[]
[null,null,"DEFINITION OF PRODUCTS"]
[]
[null,null,"REFINERY INPUTS"]
[null,"1.","CRUDE OIL"]
[null,null,"Crude oil is a mineral oil of natural origin comprising a mixture of hydrocarbons and associated impurities, such as sulphur. It exists in the liquid phase under normal surface temperature and pressure and its physical characteristics (density, viscosity, etc.) are highly variable.  This category includes field or lease condensate recovered from associated and non-associated gas where it is commingled with the commercial crude oil stream."]
[null,"2.","NATURAL GAS LIQUIDS (NGL)"]
[null,null,"NGL are liquid or liquefied hydrocarbons recovered from natural gas in separation facilities or gas processing plants.  Natural gas liquids include ethane, propane, butane (normal and iso-), (iso) pentane and pentanes plus (sometimes referred to as natural gasoline or plant condensate)."]
[null,"3.","OTHERS"]
[null,null,"a.  Refinery Feedstocks"]
{"$rows_left_out":63}
{"sheet":"Flows Definitions Long","index":7,"n_rows":34,"n_cols":3,"rows_kept":34,"cut":false,"hidden":false,"merged":[]}
[]
[null,null,"DEFINITION OF FLOWS"]
[]
[null,"1.","PRODUCTION"]
[null,null,"Refers to Indigenous Production of Crude Oil, NGL and other Hydrocarbons: Report all production within national boundaries including off-shore production.  Production should only include marketable production, excluding volumes returned to formation.  Such production should include all crude oil, NGL, condensates and oil from shale and tar sands, etc.  It should also include the receipts of additives/oxygenates by refineries and blending plants from outside the refinery sector."]
[null,"2.","FROM OTHER SOURCES"]
[null,null,"These refer to supplies of Additives, Biofuels and Other Hydrocarbons that are produced from non-oil sources such as: coal, natural gas and renewable energy such as biofuels."]
[null,"3.","IMPORTS AND EXPORTS"]
[null,null,"Imports and Exports data should reflect amounts having crossed the national territorial boundaries, whether customs clearance has taken place or not.  Quantities of crude oil and products imported or exported under processing agreements (i.e. refining on account) should be included. "]
[null,null,"Note 1: Re-exports of oil imported for processing within bonded areas should be included as an export of product from the processing country to the final destination."]
{"$rows_left_out":25}
{"sheet":"Param","index":8,"n_rows":112,"n_cols":11,"rows_kept":112,"cut":false,"hidden":true,"merged":[]}
[]
[null,"SETTINGS"]
[]
[]
[]
[]
[null,null,"ParamCountry / CountryList"]
[null,null,"(select country)","SELECT","00"]
[null,null,"Albania","ALBANIA","AL"]
[null,null,"Armenia","ARMENIA","AM"]
{"$rows_left_out":103}
{"sheet":"Formulas","index":9,"n_rows":79,"n_cols":94,"rows_kept":79,"cut":false,"hidden":true,"merged":[[42,90,43,90],[42,91,43,91],[42,92,43,92],[42,93,43,93],[42,60,44,62],[42,76,43,76],[42,77,43,77],[42,78,43,78],[42,81,43,81],[42,84,43,84],[42,87,43,87],[42,68,43,68],[42,69,43,69],[42,70,43,70],[42,71,43,71],[42,72,43,72],[42,73,43,73],[42,58,43,58],[42,30,44,32],[42,63,43,63],[42,64,43,64],[42,65,43,65],[42,66,43,66],[42,44,43,44],[42,47,43,47],[42,50,43,50],[42,53,43,53],[42,56,43,56],[42,57,43,57],[42,36,43,36],[42,37,43,37],[42,38,43,38],[42,39,43,39],[42,42,43,42],[42,43,43,43],[42,27,43,27],[42,28,43,28],[42,19,44,21],[42,33,43,33],[42,34,43,34],[42,35,43,35],[42,22,43,22],[42,23,43,23],[42,24,43,24],[42,25,43,25],[8,6,9,6],[8,3,9,3],[8,4,9,4],[8,5,9,5],[27,3,28,3],[27,4,28,4],[27,5,28,5],[27,6,28,6]]}
[2007.1]
[null,null,"Formulas backup for forms"]
[]
[null,null,"Caution:"]
[null,null,"The cells addresses must be exactly the same between the sheet of the Maxi-JODI form and this one (for example, cell D12 must be "]
[null,null,"\"Crude oil production\" in both sheets) because the program do a copy/paste of the formulas of this table on the other one."]
[null,null,"It has been done in order to facilitate the maintenance of the formulas: you must do it in this current sheet."]
[]
[null,null,null,"Crude Oil","NGL","Other","Total\n(1)+(2)+(3)",null,null,"Petroleum Products"]
[null,null,null,null,null,null,null,null,null,"LPG","Naphtha","Gasoline","Total Kerosene","Of which: Jet\nKerosene","Gas/ Diesel Oil","Fuel Oil","Other\nProducts","Total Products (5)+(6) +(7) +(8) +(10) +(11) +(12)"]
{"$rows_left_out":69}