{"text_format":"1","workbook":"xlsx","n_sheets":6,"sheets":["Summary","Table 1","Table 2","Remarks","Param","Formulas"],"not_rendered":{"charts":0,"images":1,"macros":1,"external_links":0,"defined_names":43,"comments":0,"pivot_tables":0},"unopened":[],"bounds":{"document_bytes":16777216,"sheet_cells":100000,"rows_first":2000,"rows_last":500,"rows_between":2000,"halvings":0,"cell_chars":16384,"cell_head_chars":4096},"cells_cut":0,"cells_raw":0,"read":"whole","date_system":"1900"}

{"sheet":"Summary","index":0,"n_rows":27,"n_cols":11,"rows_kept":27,"cut":false,"hidden":false,"merged":[[7,1,7,9],[8,1,8,8]]}
[]
[]
[]
[]
[]
[]
[]
[null,{"$f":"\"Crude Oil Import Register - COIR\"","v":"Crude Oil Import Register - COIR"}]
[null,"COIR_v2023.3"]
[]
[]
[]
[]
[]
[]
[null,"This questionnaire is a template based on the Eurostat-IEA common list of crude oil streams."]
[null,"This template allows data to be submitted through the E-VO system starting with January 2023 data.*"]
[]
[null,"To fill this template  "]
[null,"1. Select your Country and the reference month-year at the top of the Table 1."]
[null,"2. Report all information needed by crude stream."]
[null,"3. On the Summary page, click on Export to produce a CSV file compatible with E-VO."]
[]
[null,"You can address your questions to the Energy Security Data Unit (MOS/SOM):",null,null,null,null,null,null,null,null,"som@iea.org"]
[]
[null,"* Eurostat is developing a common reporting tool which includes additional features (time series, flags). "]
[null,"It should be available in the coming months."]

{"sheet":"Table 1","index":1,"n_rows":499,"n_cols":27,"rows_kept":499,"cut":false,"hidden":false,"merged":[]}
["Confidential (When Completed)",null,null,null,null,null,null,null,null,null,null,null,null,null,null,null,null,null,null,null,null,null,null,null,null,null,"Final"]
["International Energy Agency",null,null,null,null,null,null,null,null,null,null,null,null,null,null,null,null,null,null,null,null,null,null,null,null,null,"Provisional"]
["Information System on the International Oil Market - General Section"]
["IEA Crude Oil Imports (CIF Basis)"]
[]
[]
["Questionnaire","Crude Oil Import Register"]
["Country","(select country)"]
["Month of data","January",2023]
["Status of data","Final",null,null,null,null,null,null,null,null,null,null,null,null,null,null,null,null,null,null,null,null,null,null,null,null,"Datatype"]
["Prepared by",null,null,null,null,null,null,null,null,null,null,null,null,null,null,null,null,null,null,null,null,null,null,null,null,null,"FLOW"]
["Date of transmisssion"]
[]
["Table 1 CRUDE OIL IMPORTS"]
["Region","Country","Crude oil type","Typical\nAPI gravity (degrees)","Typical\nsulphur content (wt %)","Number of reporting companies","API Gravity","Sulphur content","Total\nvolume\n[1000 bbls]","Total\nprice\n[1000 $]","Average price\n[$/bbl]","Total weight [Ktonnes]",null,null,null,null,null,null,null,null,null,null,null,null,null,null,"Product ê"]
["AFRICA","Algeria","Algerian Mix",45.6,0.2,null,null,null,null,null,{"$f":"IF(I16<>0,ROUND(J16/I16,3),\"\")","v":""},{"$f":"IF(OR(G16=\"\",G16=0),\"\",ROUND(1/((G16+131.5)/(141.5*0.159))*I16,3))","v":""},null,null,null,null,null,null,null,null,null,null,null,null,null,null,"DZ_ALG_MIX"]
["AFRICA","Algeria","Hassi Messaoud",42.8,0.2,null,null,null,null,null,{"$f":"IF(I17<>0,ROUND(J17/I17,3),\"\")","v":""},{"$f":"IF(OR(G17=\"\",G17=0),\"\",ROUND(1/((G17+131.5)/(141.5*0.159))*I17,3))","v":""},null,null,null,null,null,null,null,null,null,null,null,null,null,null,"DZ_HME"]
["AFRICA","Algeria","Hassi Ramal","NA",0.1,null,null,null,null,null,{"$f":"IF(I18<>0,ROUND(J18/I18,3),\"\")","v":""},{"$f":"IF(OR(G18=\"\",G18=0),\"\",ROUND(1/((G18+131.5)/(141.5*0.159))*I18,3))","v":""},null,null,null,null,null,null,null,null,null,null,null,null,null,null,"DZ_RME"]
["AFRICA","Algeria","Saharan Blend",45.5,0.1,null,null,null,null,null,{"$f":"IF(I19<>0,ROUND(J19/I19,3),\"\")","v":""},{"$f":"IF(OR(G19=\"\",G19=0),\"\",ROUND(1/((G19+131.5)/(141.5*0.159))*I19,3))","v":""},null,null,null,null,null,null,null,null,null,null,null,null,null,null,"DZ_SAH_BLN"]
["AFRICA","Algeria","Zarzaitine",43,0.1,null,null,null,null,null,"","",null,null,null,null,null,null,null,null,null,null,null,null,null,null,"DZ_ZRZ"]
["AFRICA","Algeria","Algeria Miscellaneous","NA","NA",null,null,null,null,null,"","",null,null,null,null,null,null,null,null,null,null,null,null,null,null,"DZ_MSC"]
["AFRICA","Angola","Cabaca SUR","NA","NA",null,null,null,null,null,"","",null,null,null,null,null,null,null,null,null,null,null,null,null,null,"AO_CAB_SUR"]
["AFRICA","Angola","Clov",32.700000000000003,0.26,null,null,null,null,null,"","",null,null,null,null,null,null,null,null,null,null,null,null,null,null,"AO_CLO"]
["AFRICA","Angola","Dalia",23.6,1.48,null,null,null,null,null,"","",null,null,null,null,null,null,null,null,null,null,null,null,null,null,"AO_DAL"]
["AFRICA","Angola","Gimboa",23.7,0.65,null,null,null,null,null,"","",null,null,null,null,null,null,null,null,null,null,null,null,null,null,"AO_GIM"]
["AFRICA","Angola","Girassol",30.2,0.34,null,null,null,null,null,"","",null,null,null,null,null,null,null,null,null,null,null,null,null,null,"AO_GIR"]
["AFRICA","Angola","Greater Plutonio ","NA","NA",null,null,null,null,null,"","",null,null,null,null,null,null,null,null,null,null,null,null,null,null,"AO_GR_PLO"]
["AFRICA","Angola","Kissanje",30.5,0.37,null,null,null,null,null,"","",null,null,null,null,null,null,null,null,null,null,null,null,null,null,"AO_KSJ"]
["AFRICA","Angola","Malongo",30,0.2,null,null,null,null,null,"","",null,null,null,null,null,null,null,null,null,null,null,null,null,null,"AO_MAL"]
["AFRICA","Angola","Mostarda crude",28.3,1.1200000000000001,null,null,null,null,null,"","",null,null,null,null,null,null,null,null,null,null,null,null,null,null,"AO_MOS"]
["AFRICA","Angola","Nemba",38.5,0,null,null,null,null,null,"","",null,null,null,null,null,null,null,null,null,null,null,null,null,null,"AO_NMB"]
["AFRICA","Angola","Palanca",40,0.14000000000000001,null,null,null,null,null,"","",null,null,null,null,null,null,null,null,null,null,null,null,null,null,"AO_PAL"]
["AFRICA","Angola","Plutonio",33.200000000000003,0.37,null,null,null,null,null,"","",null,null,null,null,null,null,null,null,null,null,null,null,null,null,"AO_PLO"]
["AFRICA","Angola","Takula",33.700000000000003,0.1,null,null,null,null,null,"","",null,null,null,null,null,null,null,null,null,null,null,null,null,null,"AO_TAK"]
["AFRICA","Angola","Angola Miscellaneous","NA","NA",null,null,null,null,null,"","",null,null,null,null,null,null,null,null,null,null,null,null,null,null,"AO_MSC"]
["AFRICA","Benin","Benin Miscellaneous","NA","NA",null,null,null,null,null,"","",null,null,null,null,null,null,null,null,null,null,null,null,null,null,"BJ_MSC"]
["AFRICA","Cameroon","Kole Marine Blend",34.9,0.3,null,null,null,null,null,"","",null,null,null,null,null,null,null,null,null,null,null,null,null,null,"CM_KOL_MAR_BLN"]
["AFRICA","Cameroon","Lokele",21.5,0.5,null,null,null,null,null,"","",null,null,null,null,null,null,null,null,null,null,null,null,null,null,"CM_LKL"]
["AFRICA","Cameroon","Cameroon Miscellaneous","NA","NA",null,null,null,null,null,"","",null,null,null,null,null,null,null,null,null,null,null,null,null,null,"CM_MSC"]
["AFRICA","Chad","Doba Blend (Early Production)",24.8,0.14000000000000001,null,null,null,null,null,"","",null,null,null,null,null,null,null,null,null,null,null,null,null,null,"TD_DOB_BLN_EPRD"]
{"$rows_left_out":460}
{"sheet":"Table 2","index":2,"n_rows":88,"n_cols":27,"rows_kept":88,"cut":false,"hidden":true,"merged":[[16,1,16,2],[7,3,7,4],[16,3,16,4],[7,1,7,2]]}
["Table 2 CRUDE OIL SUPPLY"]
["Country",{"$f":"CountryUser","v":"(select country)"}]
["Month of data",{"$f":"FirstMonth","v":"January"},{"$f":"QuestYear","v":2023}]
[]
[]
[null,null,null,null,null,null,null,null,null,null,null,null,null,null,null,null,null,null,null,null,null,null,null,null,null,null,"Datatype"]
["Table 2.1: Crude oil imports price",null,null,null,null,null,null,null,null,null,null,null,null,null,null,null,null,null,null,null,null,null,null,null,null,null,"FLOW"]
[null,"Total imports",null,"Average CIF price"]
[null,"1000 barrels","1000 tonnes","per barrel","per tonne",null,null,null,null,null,null,null,null,null,null,null,null,null,null,null,null,null,null,null,null,null,"Product ê"]
["Crude oil imports price",{"$f":"'Table 1'!$I$394","v":0},{"$f":"'Table 1'!$L$394","v":0},{"$f":"'Table 1'!$K$394","v":""},{"$f":"IF('Table 1'!$L$394<>0,ROUND('Table 1'!$J$394/'Table 1'!$L$394,3),\"\")","v":""},null,null,null,null,null,null,null,null,null,null,null,null,null,null,null,null,null,null,null,null,null,"TOTCRUDIMP"]
[]
[]
[]
[]
[]
["Table 2.2: Crude oil production price"]
[null,"Total production",null,"Average CIF price"]
[null,"1000 barrels","1000 tonnes","per barrel","per tonne"]
["Crude oil production price",null,null,null,null,null,null,null,null,null,null,null,null,null,null,null,null,null,null,null,null,null,null,null,null,null,"TOTCRUDPROD"]
[]
[]
[]
[]
[]
[]
[]
[]
[]
[]
[]
[]
[]
[]
[]
[]
[]
[]
[]
[]
[]
{"$rows_left_out":49}
{"sheet":"Remarks","index":3,"n_rows":43,"n_cols":35,"rows_kept":43,"cut":false,"hidden":false,"merged":[]}
[null,null,null,null,null,null,null,null,null,null,null,null,null,null,null,null,null,null,null,null,null,null,null,null,null,null,null,null,null,null,null,null,null,null,"Datatype"]
[null,null,{"$f":"\"COIR Remarks\"","v":"COIR Remarks"},null,null,null,null,null,null,null,null,null,null,null,null,null,null,null,null,null,null,null,null,null,null,null,null,null,null,null,null,null,null,null,"REMARKS"]
[null,null,null,null,null,null,null,null,null,null,null,null,null,null,null,null,null,null,null,null,null,null,null,null,null,null,null,null,null,null,null,null,null,null,"Item1 ê"]
[null,null,null,null,null,null,null,null,null,null,null,null,null,null,null,null,null,null,null,null,null,null,null,null,null,null,null,null,null,null,null,null,null,null,"REMROW01"]
[null,null,null,null,null,null,null,null,null,null,null,null,null,null,null,null,null,null,null,null,null,null,null,null,null,null,null,null,null,null,null,null,null,null,"REMROW02"]
[null,null,null,null,null,null,null,null,null,null,null,null,null,null,null,null,null,null,null,null,null,null,null,null,null,null,null,null,null,null,null,null,null,null,"REMROW03"]
[null,null,null,null,null,null,null,null,null,null,null,null,null,null,null,null,null,null,null,null,null,null,null,null,null,null,null,null,null,null,null,null,null,null,"REMROW04"]
[null,null,null,null,null,null,null,null,null,null,null,null,null,null,null,null,null,null,null,null,null,null,null,null,null,null,null,null,null,null,null,null,null,null,"REMROW05"]
[null,null,null,null,null,null,null,null,null,null,null,null,null,null,null,null,null,null,null,null,null,null,null,null,null,null,null,null,null,null,null,null,null,null,"REMROW06"]
[null,null,null,null,null,null,null,null,null,null,null,null,null,null,null,null,null,null,null,null,null,null,null,null,null,null,null,null,null,null,null,null,null,null,"REMROW07"]
[null,null,null,null,null,null,null,null,null,null,null,null,null,null,null,null,null,null,null,null,null,null,null,null,null,null,null,null,null,null,null,null,null,null,"REMROW08"]
[null,null,null,null,null,null,null,null,null,null,null,null,null,null,null,null,null,null,null,null,null,null,null,null,null,null,null,null,null,null,null,null,null,null,"REMROW09"]
[null,null,null,null,null,null,null,null,null,null,null,null,null,null,null,null,null,null,null,null,null,null,null,null,null,null,null,null,null,null,null,null,null,null,"REMROW10"]
[null,null,null,null,null,null,null,null,null,null,null,null,null,null,null,null,null,null,null,null,null,null,null,null,null,null,null,null,null,null,null,null,null,null,"REMROW11"]
[null,null,null,null,null,null,null,null,null,null,null,null,null,null,null,null,null,null,null,null,null,null,null,null,null,null,null,null,null,null,null,null,null,null,"REMROW12"]
[null,null,null,null,null,null,null,null,null,null,null,null,null,null,null,null,null,null,null,null,null,null,null,null,null,null,null,null,null,null,null,null,null,null,"REMROW13"]
[null,null,null,null,null,null,null,null,null,null,null,null,null,null,null,null,null,null,null,null,null,null,null,null,null,null,null,null,null,null,null,null,null,null,"REMROW14"]
[null,null,null,null,null,null,null,null,null,null,null,null,null,null,null,null,null,null,null,null,null,null,null,null,null,null,null,null,null,null,null,null,null,null,"REMROW15"]
[null,null,null,null,null,null,null,null,null,null,null,null,null,null,null,null,null,null,null,null,null,null,null,null,null,null,null,null,null,null,null,null,null,null,"REMROW16"]
[null,null,null,null,null,null,null,null,null,null,null,null,null,null,null,null,null,null,null,null,null,null,null,null,null,null,null,null,null,null,null,null,null,null,"REMROW17"]
[null,null,null,null,null,null,null,null,null,null,null,null,null,null,null,null,null,null,null,null,null,null,null,null,null,null,null,null,null,null,null,null,null,null,"REMROW18"]
[null,null,null,null,null,null,null,null,null,null,null,null,null,null,null,null,null,null,null,null,null,null,null,null,null,null,null,null,null,null,null,null,null,null,"REMROW19"]
[null,null,null,null,null,null,null,null,null,null,null,null,null,null,null,null,null,null,null,null,null,null,null,null,null,null,null,null,null,null,null,null,null,null,"REMROW20"]
[null,null,null,null,null,null,null,null,null,null,null,null,null,null,null,null,null,null,null,null,null,null,null,null,null,null,null,null,null,null,null,null,null,null,"REMROW21"]
[null,null,null,null,null,null,null,null,null,null,null,null,null,null,null,null,null,null,null,null,null,null,null,null,null,null,null,null,null,null,null,null,null,null,"REMROW22"]
[null,null,null,null,null,null,null,null,null,null,null,null,null,null,null,null,null,null,null,null,null,null,null,null,null,null,null,null,null,null,null,null,null,null,"REMROW23"]
[null,null,null,null,null,null,null,null,null,null,null,null,null,null,null,null,null,null,null,null,null,null,null,null,null,null,null,null,null,null,null,null,null,null,"REMROW24"]
[null,null,null,null,null,null,null,null,null,null,null,null,null,null,null,null,null,null,null,null,null,null,null,null,null,null,null,null,null,null,null,null,null,null,"REMROW25"]
[null,null,null,null,null,null,null,null,null,null,null,null,null,null,null,null,null,null,null,null,null,null,null,null,null,null,null,null,null,null,null,null,null,null,"REMROW26"]
[null,null,null,null,null,null,null,null,null,null,null,null,null,null,null,null,null,null,null,null,null,null,null,null,null,null,null,null,null,null,null,null,null,null,"REMROW27"]
[null,null,null,null,null,null,null,null,null,null,null,null,null,null,null,null,null,null,null,null,null,null,null,null,null,null,null,null,null,null,null,null,null,null,"REMROW28"]
[null,null,null,null,null,null,null,null,null,null,null,null,null,null,null,null,null,null,null,null,null,null,null,null,null,null,null,null,null,null,null,null,null,null,"REMROW29"]
[null,null,null,null,null,null,null,null,null,null,null,null,null,null,null,null,null,null,null,null,null,null,null,null,null,null,null,null,null,null,null,null,null,null,"REMROW30"]
[null,null,null,null,null,null,null,null,null,null,null,null,null,null,null,null,null,null,null,null,null,null,null,null,null,null,null,null,null,null,null,null,null,null,"REMROW31"]
[null,null,null,null,null,null,null,null,null,null,null,null,null,null,null,null,null,null,null,null,null,null,null,null,null,null,null,null,null,null,null,null,null,null,"REMROW32"]
[null,null,null,null,null,null,null,null,null,null,null,null,null,null,null,null,null,null,null,null,null,null,null,null,null,null,null,null,null,null,null,null,null,null,"REMROW33"]
[null,null,null,null,null,null,null,null,null,null,null,null,null,null,null,null,null,null,null,null,null,null,null,null,null,null,null,null,null,null,null,null,null,null,"REMROW34"]
[null,null,null,null,null,null,null,null,null,null,null,null,null,null,null,null,null,null,null,null,null,null,null,null,null,null,null,null,null,null,null,null,null,null,"REMROW35"]
[null,null,null,null,null,null,null,null,null,null,null,null,null,null,null,null,null,null,null,null,null,null,null,null,null,null,null,null,null,null,null,null,null,null,"REMROW36"]
[null,null,null,null,null,null,null,null,null,null,null,null,null,null,null,null,null,null,null,null,null,null,null,null,null,null,null,null,null,null,null,null,null,null,"REMROW37"]
{"$rows_left_out":4}
{"sheet":"Param","index":4,"n_rows":127,"n_cols":11,"rows_kept":127,"cut":false,"hidden":true,"merged":[[1,1,1,3]]}
[]
[null,"SETTINGS"]
[]
[]
[]
[]
[null,null,"ParamCountry / CountryList",null,null,"Is EU","Is Enc"]
[null,null,"(select country)","SELECT","00",0,0]
[null,null,"Albania","ALBANIA","AL",0,1]
[null,null,"Argentina","ARGENTINA","AR",0,0]
[null,null,"Armenia","ARMENIA","AM",0,1]
[null,null,"Australia","AUSTRALI","AU",0,0]
[null,null,"Austria","AUSTRIA","AT",1,0]
[null,null,"Azerbaijan","AZERBAIJAN","AZ",0,0]
[null,null,"Belarus","BELARUS","BY",0,1]
[null,null,"Belgium","BELGIUM","BE",1,0]
[null,null,"Bosnia and Herzegovina","BOSNIAHERZ","BA",0,1]
[null,null,"Brazil","BRAZIL","BR",0,0]
[null,null,"Bulgaria","BULGARIA","BG",1,0]
[null,null,"Canada","CANADA","CA",0,0]
[null,null,"Chile","CHILE","CL",0,0]
[null,null,"China, People's Republic of","CHINA","CN",0,0]
[null,null,"Colombia","COLOMBIA","CO",0,0]
[null,null,"Costa Rica","COSTARICA","CR",0,0]
[null,null,"Croatia","CROATIA","HR",1,0]
[null,null,"Cyprus","CYPRUS","CY",1,0]
[null,null,"Czech Republic","CZECH","CZ",1,0]
[null,null,"Denmark","DENMARK","DK",1,0]
[null,null,"Egypt","EGYPT","EG",0,0]
[null,null,"Estonia","ESTONIA","EE",1,0]
[null,null,"Finland","FINLAND","FI",1,0]
[null,null,"France","FRANCE","FR",1,0]
[null,null,"Georgia","GEORGIA","GE",0,1]
[null,null,"Germany","GERMANY","DE",1,0]
[null,null,"Greece","GREECE","GR",1,0]
[null,null,"Hungary","HUNGARY","HU",1,0]
[null,null,"Iceland","ICELAND","IS",0,0]
[null,null,"Ireland","IRELAND","IE",1,0]
[null,null,"India","INDIA","IN",0,0]
[null,null,"Indonesia","INDONESIA","ID",0,0]
{"$rows_left_out":88}
{"sheet":"Formulas","index":5,"n_rows":411,"n_cols":13,"rows_kept":411,"cut":false,"hidden":true,"merged":[[399,2,399,3],[399,4,399,5],[408,2,408,3],[408,4,408,5]]}
[]
[null,null,"Formulas backup for forms"]
[]
[null,"This sheet has been done in order to facilitate the maintenance of the formulas the user could erase: you must do it in this current sheet."]
[]
[]
[]
[null,"Table 1"]
[null,"Region","Country","Crude oil type","Typical\nAPI gravity (degrees)","Typical\nsulphur content (wt %)","Number of reporting companies","API Gravity","Sulphur content","Total\nvolume\n[1000 bbls]","Total\nprice\n[1000 $]","Average price\n[$/bbl]","Total weight [Ktonnes]"]
[null,"AFRICA","Algeria","Algerian Mix",45.6,0.2,null,null,null,null,null,{"$f":"IF(J10<>0,ROUND(K10/J10,3),\"\")","v":""},{"$f":"IF(OR(H10=\"\",H10=0),\"\",ROUND(1/((H10+131.5)/(141.5*0.159))*J10,3))","v":""}]
[null,"AFRICA","Algeria","Hassi Messaoud",42.8,0.2,null,null,null,null,null,{"$f":"IF(J11<>0,ROUND(K11/J11,3),\"\")","v":""},{"$f":"IF(OR(H11=\"\",H11=0),\"\",ROUND(1/((H11+131.5)/(141.5*0.159))*J11,3))","v":""}]
[null,"AFRICA","Algeria","Hassi Ramal","NA",0.1,null,null,null,null,null,{"$f":"IF(J12<>0,ROUND(K12/J12,3),\"\")","v":""},{"$f":"IF(OR(H12=\"\",H12=0),\"\",ROUND(1/((H12+131.5)/(141.5*0.159))*J12,3))","v":""}]
[null,"AFRICA","Algeria","Saharan Blend",45.5,0.1,null,null,null,null,null,{"$f":"IF(J13<>0,ROUND(K13/J13,3),\"\")","v":""},{"$f":"IF(OR(H13=\"\",H13=0),\"\",ROUND(1/((H13+131.5)/(141.5*0.159))*J13,3))","v":""}]
[null,"AFRICA","Algeria","Zarzaitine",43,0.1,null,null,null,null,null,"",""]
[null,"AFRICA","Algeria","Algeria Miscellaneous","NA","NA",null,null,null,null,null,"",""]
[null,"AFRICA","Angola","Cabaca SUR","NA","NA",null,null,null,null,null,"",""]
[null,"AFRICA","Angola","Clov",32.700000000000003,0.26,null,null,null,null,null,"",""]
[null,"AFRICA","Angola","Dalia",23.6,1.48,null,null,null,null,null,"",""]
[null,"AFRICA","Angola","Gimboa",23.7,0.65,null,null,null,null,null,"",""]
[null,"AFRICA","Angola","Girassol",30.2,0.34,null,null,null,null,null,"",""]
[null,"AFRICA","Angola","Greater Plutonio ","NA","NA",null,null,null,null,null,"",""]
[null,"AFRICA","Angola","Kissanje",30.5,0.37,null,null,null,null,null,"",""]
[null,"AFRICA","Angola","Malongo","NA","NA",null,null,null,null,null,"",""]
[null,"AFRICA","Angola","Mostarda crude",28.3,1.1200000000000001,null,null,null,null,null,"",""]
[null,"AFRICA","Angola","Nemba",38.5,0,null,null,null,null,null,"",""]
[null,"AFRICA","Angola","Palanca",40,0.14000000000000001,null,null,null,null,null,"",""]
[null,"AFRICA","Angola","Plutonio",33.200000000000003,0.37,null,null,null,null,null,"",""]
[null,"AFRICA","Angola","Takula",33.700000000000003,0.1,null,null,null,null,null,"",""]
[null,"AFRICA","Angola","Angola Miscellaneous","NA","NA",null,null,null,null,null,"",""]
[null,"AFRICA","Benin","Benin Miscellaneous","NA","NA",null,null,null,null,null,"",""]
[null,"AFRICA","Cameroon","Kole Marine Blend",34.9,0.3,null,null,null,null,null,"",""]
[null,"AFRICA","Cameroon","Lokele",21.5,0.5,null,null,null,null,null,"",""]
[null,"AFRICA","Cameroon","Cameroon Miscellaneous","NA","NA",null,null,null,null,null,"",""]
[null,"AFRICA","Chad","Doba Blend (Early Production)",24.8,0.14000000000000001,null,null,null,null,null,"",""]
[null,"AFRICA","Chad","Chad Miscellaneous","NA","NA",null,null,null,null,null,"",""]
[null,"AFRICA","Congo (Brazzaville)","Djeno Blend",26.9,0.3,null,null,null,null,null,"",""]
[null,"AFRICA","Congo (Brazzaville)","Nkossa",47,0.03,null,null,null,null,null,"",""]
[null,"AFRICA","Congo (Brazzaville)","Congo (Brazzaville) Miscellaneous","NA","NA",null,null,null,null,null,"",""]
[null,"AFRICA","Côte d'Ivoire","Espoir",31.4,0.3,null,null,null,null,null,"",""]
[null,"AFRICA","Côte d'Ivoire","Côte d'Ivoire Miscellaneous","NA","NA",null,null,null,null,null,"",""]
{"$rows_left_out":371}